kafka-dev mailing list archives

Site index · List index
Message view « Date » · « Thread »
Top « Date » · « Thread »
From Apache Jenkins Server <jenk...@builds.apache.org>
Subject Build failed in Jenkins: kafka-2.0-jdk8 #69
Date Tue, 03 Jul 2018 21:53:31 GMT
See <https://builds.apache.org/job/kafka-2.0-jdk8/69/display/redirect?page=changes>

Changes:

[rajinisivaram] MINOR: Include quota related interfaces to javadocs (#5325)

------------------------------------------
[...truncated 869.07 KB...]
kafka.admin.ResetConsumerGroupOffsetTest > testResetOffsetsNotExistingGroup STARTED

kafka.admin.ResetConsumerGroupOffsetTest > testResetOffsetsNotExistingGroup PASSED

kafka.admin.ResetConsumerGroupOffsetTest > testResetOffsetsToZonedDateTime STARTED

kafka.admin.ResetConsumerGroupOffsetTest > testResetOffsetsToZonedDateTime PASSED

kafka.admin.ResetConsumerGroupOffsetTest > testResetOffsetsToEarliest STARTED

kafka.admin.ResetConsumerGroupOffsetTest > testResetOffsetsToEarliest PASSED

kafka.admin.ResetConsumerGroupOffsetTest > testResetOffsetsExportImportPlan STARTED

kafka.admin.ResetConsumerGroupOffsetTest > testResetOffsetsExportImportPlan PASSED

kafka.admin.ResetConsumerGroupOffsetTest > testResetOffsetsToSpecificOffset STARTED

kafka.admin.ResetConsumerGroupOffsetTest > testResetOffsetsToSpecificOffset PASSED

kafka.admin.ResetConsumerGroupOffsetTest > testResetOffsetsShiftPlus STARTED

kafka.admin.ResetConsumerGroupOffsetTest > testResetOffsetsShiftPlus PASSED

kafka.admin.ResetConsumerGroupOffsetTest > testResetOffsetsToLatest STARTED

kafka.admin.ResetConsumerGroupOffsetTest > testResetOffsetsToLatest PASSED

kafka.admin.ResetConsumerGroupOffsetTest > testResetOffsetsShiftByLowerThanEarliest STARTED

kafka.admin.ResetConsumerGroupOffsetTest > testResetOffsetsShiftByLowerThanEarliest PASSED

kafka.admin.ResetConsumerGroupOffsetTest > testResetOffsetsByDuration STARTED

kafka.admin.ResetConsumerGroupOffsetTest > testResetOffsetsByDuration PASSED

kafka.admin.ResetConsumerGroupOffsetTest > testResetOffsetsToLocalDateTime STARTED

kafka.admin.ResetConsumerGroupOffsetTest > testResetOffsetsToLocalDateTime PASSED

kafka.admin.ResetConsumerGroupOffsetTest > testResetOffsetsExistingTopic STARTED

kafka.admin.ResetConsumerGroupOffsetTest > testResetOffsetsExistingTopic PASSED

kafka.admin.ResetConsumerGroupOffsetTest > testResetOffsetsToEarliestOnTopicsAndPartitions
STARTED

kafka.admin.ResetConsumerGroupOffsetTest > testResetOffsetsToEarliestOnTopicsAndPartitions
PASSED

kafka.admin.ResetConsumerGroupOffsetTest > testResetOffsetsToEarliestOnTopics STARTED

kafka.admin.ResetConsumerGroupOffsetTest > testResetOffsetsToEarliestOnTopics PASSED

kafka.admin.ReassignPartitionsCommandArgsTest > shouldFailIfBlankArg STARTED

kafka.admin.ReassignPartitionsCommandArgsTest > shouldFailIfBlankArg PASSED

kafka.admin.ReassignPartitionsCommandArgsTest > shouldNotAllowVerifyWithoutReassignmentOption
STARTED

kafka.admin.ReassignPartitionsCommandArgsTest > shouldNotAllowVerifyWithoutReassignmentOption
PASSED

kafka.admin.ReassignPartitionsCommandArgsTest > shouldNotAllowGenerateWithoutBrokersOption
STARTED

kafka.admin.ReassignPartitionsCommandArgsTest > shouldNotAllowGenerateWithoutBrokersOption
PASSED

kafka.admin.ReassignPartitionsCommandArgsTest > shouldNotAllowTopicsOptionWithVerify STARTED

kafka.admin.ReassignPartitionsCommandArgsTest > shouldNotAllowTopicsOptionWithVerify PASSED

kafka.admin.ReassignPartitionsCommandArgsTest > shouldNotAllowGenerateWithThrottleOption
STARTED

kafka.admin.ReassignPartitionsCommandArgsTest > shouldNotAllowGenerateWithThrottleOption
PASSED

kafka.admin.ReassignPartitionsCommandArgsTest > shouldFailIfNoArgs STARTED

kafka.admin.ReassignPartitionsCommandArgsTest > shouldFailIfNoArgs PASSED

kafka.admin.ReassignPartitionsCommandArgsTest > shouldNotAllowExecuteWithoutReassignmentOption
STARTED

kafka.admin.ReassignPartitionsCommandArgsTest > shouldNotAllowExecuteWithoutReassignmentOption
PASSED

kafka.admin.ReassignPartitionsCommandArgsTest > shouldNotAllowBrokersListWithVerifyOption
STARTED

kafka.admin.ReassignPartitionsCommandArgsTest > shouldNotAllowBrokersListWithVerifyOption
PASSED

kafka.admin.ReassignPartitionsCommandArgsTest > shouldCorrectlyParseValidMinimumExecuteOptions
STARTED

kafka.admin.ReassignPartitionsCommandArgsTest > shouldCorrectlyParseValidMinimumExecuteOptions
PASSED

kafka.admin.ReassignPartitionsCommandArgsTest > shouldNotAllowGenerateWithReassignmentOption
STARTED

kafka.admin.ReassignPartitionsCommandArgsTest > shouldNotAllowGenerateWithReassignmentOption
PASSED

kafka.admin.ReassignPartitionsCommandArgsTest > shouldCorrectlyParseValidMinimumGenerateOptions
STARTED

kafka.admin.ReassignPartitionsCommandArgsTest > shouldCorrectlyParseValidMinimumGenerateOptions
PASSED

kafka.admin.ReassignPartitionsCommandArgsTest > shouldNotAllowGenerateWithoutBrokersAndTopicsOptions
STARTED

kafka.admin.ReassignPartitionsCommandArgsTest > shouldNotAllowGenerateWithoutBrokersAndTopicsOptions
PASSED

kafka.admin.ReassignPartitionsCommandArgsTest > shouldNotAllowThrottleWithVerifyOption
STARTED

kafka.admin.ReassignPartitionsCommandArgsTest > shouldNotAllowThrottleWithVerifyOption
PASSED

kafka.admin.ReassignPartitionsCommandArgsTest > shouldUseDefaultsIfEnabled STARTED

kafka.admin.ReassignPartitionsCommandArgsTest > shouldUseDefaultsIfEnabled PASSED

kafka.admin.ReassignPartitionsCommandArgsTest > shouldAllowThrottleOptionOnExecute STARTED

kafka.admin.ReassignPartitionsCommandArgsTest > shouldAllowThrottleOptionOnExecute PASSED

kafka.admin.ReassignPartitionsCommandArgsTest > shouldNotAllowExecuteWithBrokers STARTED

kafka.admin.ReassignPartitionsCommandArgsTest > shouldNotAllowExecuteWithBrokers PASSED

kafka.admin.ReassignPartitionsCommandArgsTest > shouldNotAllowExecuteWithTopicsOption STARTED

kafka.admin.ReassignPartitionsCommandArgsTest > shouldNotAllowExecuteWithTopicsOption PASSED

kafka.admin.ReassignPartitionsCommandArgsTest > shouldCorrectlyParseValidMinimumVerifyOptions
STARTED

kafka.admin.ReassignPartitionsCommandArgsTest > shouldCorrectlyParseValidMinimumVerifyOptions
PASSED

kafka.admin.ReassignPartitionsCommandArgsTest > shouldNotAllowGenerateWithoutTopicsOption
STARTED

kafka.admin.ReassignPartitionsCommandArgsTest > shouldNotAllowGenerateWithoutTopicsOption
PASSED

kafka.admin.BrokerApiVersionsCommandTest > checkBrokerApiVersionCommandOutput STARTED

kafka.admin.BrokerApiVersionsCommandTest > checkBrokerApiVersionCommandOutput PASSED

kafka.admin.TopicCommandTest > testCreateIfNotExists STARTED

kafka.admin.TopicCommandTest > testCreateIfNotExists PASSED

kafka.admin.TopicCommandTest > testCreateAlterTopicWithRackAware STARTED

kafka.admin.TopicCommandTest > testCreateAlterTopicWithRackAware PASSED

kafka.admin.TopicCommandTest > testTopicDeletion STARTED

kafka.admin.TopicCommandTest > testTopicDeletion PASSED

kafka.admin.TopicCommandTest > testInvalidTopicLevelConfig STARTED

kafka.admin.TopicCommandTest > testInvalidTopicLevelConfig PASSED

kafka.admin.TopicCommandTest > testConfigPreservationAcrossPartitionAlteration STARTED

kafka.admin.TopicCommandTest > testConfigPreservationAcrossPartitionAlteration PASSED

kafka.admin.TopicCommandTest > testAlterIfExists STARTED

kafka.admin.TopicCommandTest > testAlterIfExists PASSED

kafka.admin.TopicCommandTest > testDescribeAndListTopicsMarkedForDeletion STARTED

kafka.admin.TopicCommandTest > testDescribeAndListTopicsMarkedForDeletion PASSED

kafka.admin.TopicCommandTest > testDeleteIfExists STARTED

kafka.admin.TopicCommandTest > testDeleteIfExists PASSED

kafka.admin.AdminZkClientTest > testMockedConcurrentTopicCreation STARTED

kafka.admin.AdminZkClientTest > testMockedConcurrentTopicCreation PASSED

kafka.admin.AdminZkClientTest > testGetBrokerMetadatas STARTED

kafka.admin.AdminZkClientTest > testGetBrokerMetadatas PASSED

kafka.admin.AdminZkClientTest > testBootstrapClientIdConfig STARTED

kafka.admin.AdminZkClientTest > testBootstrapClientIdConfig PASSED

kafka.admin.AdminZkClientTest > testTopicConfigChange STARTED

kafka.admin.AdminZkClientTest > testTopicConfigChange PASSED

kafka.admin.AdminZkClientTest > testManualReplicaAssignment STARTED

kafka.admin.AdminZkClientTest > testManualReplicaAssignment PASSED

kafka.admin.AdminZkClientTest > testConcurrentTopicCreation STARTED

kafka.admin.AdminZkClientTest > testConcurrentTopicCreation PASSED

kafka.admin.AdminZkClientTest > shouldPropagateDynamicBrokerConfigs STARTED

kafka.admin.AdminZkClientTest > shouldPropagateDynamicBrokerConfigs PASSED

kafka.admin.AdminZkClientTest > testTopicCreationWithCollision STARTED

kafka.admin.AdminZkClientTest > testTopicCreationWithCollision PASSED

kafka.admin.AdminZkClientTest > testTopicCreationInZK STARTED

kafka.admin.AdminZkClientTest > testTopicCreationInZK PASSED

unit.kafka.server.FetchRequestDownConversionConfigTest > testV1FetchWithDownConversionDisabled
STARTED

unit.kafka.server.FetchRequestDownConversionConfigTest > testV1FetchWithDownConversionDisabled
PASSED

unit.kafka.server.FetchRequestDownConversionConfigTest > testV1FetchFromReplica STARTED

unit.kafka.server.FetchRequestDownConversionConfigTest > testV1FetchFromReplica PASSED

unit.kafka.server.FetchRequestDownConversionConfigTest > testLatestFetchWithDownConversionDisabled
STARTED

unit.kafka.server.FetchRequestDownConversionConfigTest > testLatestFetchWithDownConversionDisabled
PASSED

unit.kafka.server.FetchRequestDownConversionConfigTest > testV1FetchWithTopicLevelOverrides
STARTED

unit.kafka.server.FetchRequestDownConversionConfigTest > testV1FetchWithTopicLevelOverrides
PASSED

2023 tests completed, 1 failed, 4 skipped

> Task :kafka-2.0-jdk8:core:test FAILED
> Task :test_core_2_12 FAILED

FAILURE: Build failed with an exception.

* What went wrong:
Execution failed for task ':kafka-2.0-jdk8:core:test'.
> There were failing tests. See the report at: file://<https://builds.apache.org/job/kafka-2.0-jdk8/ws/core/build/reports/tests/test/index.html>

* Try:
Run with --stacktrace option to get the stack trace. Run with --info or --debug option to
get more log output. Run with --scan to get full insights.

* Get more help at https://help.gradle.org

BUILD FAILED in 2h 12m 43s
26 actionable tasks: 3 executed, 23 up-to-date
Build step 'Execute shell' marked build as failure
[FINDBUGS] Collecting findbugs analysis files...
Setting GRADLE_4_4_HOME=/home/jenkins/tools/gradle/4.4
[FINDBUGS] Searching for all files in <https://builds.apache.org/job/kafka-2.0-jdk8/ws/>
that match the pattern **/build/reports/findbugs/*.xml
[FINDBUGS] Parsing 1 file in <https://builds.apache.org/job/kafka-2.0-jdk8/ws/>
[FINDBUGS] Successfully parsed file <https://builds.apache.org/job/kafka-2.0-jdk8/ws/core/build/reports/findbugs/main.xml>
with 0 unique warnings and 0 duplicates.
Setting GRADLE_4_4_HOME=/home/jenkins/tools/gradle/4.4
Setting GRADLE_4_4_HOME=/home/jenkins/tools/gradle/4.4
<Git Blamer> Using GitBlamer to create author and commit information for all warnings.
<Git Blamer> GIT_COMMIT=486d7a3c917c720104f44cda2d63e7a879a8e6ee, workspace=<https://builds.apache.org/job/kafka-2.0-jdk8/ws/>
[FINDBUGS] Computing warning deltas based on reference build #67
Recording test results
Setting GRADLE_4_4_HOME=/home/jenkins/tools/gradle/4.4
Setting GRADLE_4_4_HOME=/home/jenkins/tools/gradle/4.4
Not sending mail to unregistered user rajinisivaram@googlemail.com

Mime
View raw message