kafka-dev mailing list archives

Site index · List index
Message view « Date » · « Thread »
Top « Date » · « Thread »
From Apache Jenkins Server <jenk...@builds.apache.org>
Subject Build failed in Jenkins: kafka-trunk-jdk8 #2319
Date Wed, 10 Jan 2018 01:06:22 GMT
See <https://builds.apache.org/job/kafka-trunk-jdk8/2319/display/redirect?page=changes>

Changes:

[junrao] KAFKA-4247; Prevent CLASSPATH from beginning with a single colon

------------------------------------------
[...truncated 401.78 KB...]

kafka.integration.TopicMetadataTest > testAutoCreateTopicWithInvalidReplication STARTED

kafka.integration.TopicMetadataTest > testAutoCreateTopicWithInvalidReplication PASSED

kafka.integration.TopicMetadataTest > testAliveBrokersListWithNoTopicsAfterABrokerShutdown
STARTED

kafka.integration.TopicMetadataTest > testAliveBrokersListWithNoTopicsAfterABrokerShutdown
PASSED

kafka.integration.AutoOffsetResetTest > testResetToLatestWhenOffsetTooLow STARTED

kafka.integration.AutoOffsetResetTest > testResetToLatestWhenOffsetTooLow PASSED

kafka.integration.AutoOffsetResetTest > testResetToEarliestWhenOffsetTooLow STARTED

kafka.integration.AutoOffsetResetTest > testResetToEarliestWhenOffsetTooLow PASSED

kafka.integration.AutoOffsetResetTest > testResetToEarliestWhenOffsetTooHigh STARTED

kafka.integration.AutoOffsetResetTest > testResetToEarliestWhenOffsetTooHigh PASSED

kafka.integration.AutoOffsetResetTest > testResetToLatestWhenOffsetTooHigh STARTED

kafka.integration.AutoOffsetResetTest > testResetToLatestWhenOffsetTooHigh PASSED

kafka.integration.MinIsrConfigTest > testDefaultKafkaConfig STARTED

kafka.integration.MinIsrConfigTest > testDefaultKafkaConfig PASSED

kafka.integration.FetcherTest > testFetcher STARTED

kafka.integration.FetcherTest > testFetcher PASSED

kafka.integration.PrimitiveApiTest > testMultiProduce STARTED

kafka.integration.PrimitiveApiTest > testMultiProduce PASSED

kafka.integration.PrimitiveApiTest > testDefaultEncoderProducerAndFetch STARTED

kafka.integration.PrimitiveApiTest > testDefaultEncoderProducerAndFetch PASSED

kafka.integration.PrimitiveApiTest > testFetchRequestCanProperlySerialize STARTED

kafka.integration.PrimitiveApiTest > testFetchRequestCanProperlySerialize PASSED

kafka.integration.PrimitiveApiTest > testPipelinedProduceRequests STARTED

kafka.integration.PrimitiveApiTest > testPipelinedProduceRequests PASSED

kafka.integration.PrimitiveApiTest > testProduceAndMultiFetch STARTED

kafka.integration.PrimitiveApiTest > testProduceAndMultiFetch PASSED

kafka.integration.PrimitiveApiTest > testDefaultEncoderProducerAndFetchWithCompression
STARTED

kafka.integration.PrimitiveApiTest > testDefaultEncoderProducerAndFetchWithCompression
PASSED

kafka.integration.PrimitiveApiTest > testConsumerEmptyTopic STARTED

kafka.integration.PrimitiveApiTest > testConsumerEmptyTopic PASSED

kafka.integration.PrimitiveApiTest > testEmptyFetchRequest STARTED

kafka.integration.PrimitiveApiTest > testEmptyFetchRequest PASSED

kafka.zk.KafkaZkClientTest > testBrokerRegistrationMethods STARTED

kafka.zk.KafkaZkClientTest > testBrokerRegistrationMethods PASSED

kafka.zk.KafkaZkClientTest > testSetGetAndDeletePartitionReassignment STARTED

kafka.zk.KafkaZkClientTest > testSetGetAndDeletePartitionReassignment PASSED

kafka.zk.KafkaZkClientTest > testGetDataAndVersion STARTED

kafka.zk.KafkaZkClientTest > testGetDataAndVersion PASSED

kafka.zk.KafkaZkClientTest > testGetChildren STARTED

kafka.zk.KafkaZkClientTest > testGetChildren PASSED

kafka.zk.KafkaZkClientTest > testSetAndGetConsumerOffset STARTED

kafka.zk.KafkaZkClientTest > testSetAndGetConsumerOffset PASSED

kafka.zk.KafkaZkClientTest > testClusterIdMethods STARTED

kafka.zk.KafkaZkClientTest > testClusterIdMethods PASSED

kafka.zk.KafkaZkClientTest > testEntityConfigManagementMethods STARTED

kafka.zk.KafkaZkClientTest > testEntityConfigManagementMethods PASSED

kafka.zk.KafkaZkClientTest > testCreateRecursive STARTED

kafka.zk.KafkaZkClientTest > testCreateRecursive PASSED

kafka.zk.KafkaZkClientTest > testGetConsumerOffsetNoData STARTED

kafka.zk.KafkaZkClientTest > testGetConsumerOffsetNoData PASSED

kafka.zk.KafkaZkClientTest > testDeleteTopicPathMethods STARTED

kafka.zk.KafkaZkClientTest > testDeleteTopicPathMethods PASSED

kafka.zk.KafkaZkClientTest > testAclManagementMethods STARTED

kafka.zk.KafkaZkClientTest > testAclManagementMethods PASSED

kafka.zk.KafkaZkClientTest > testPreferredReplicaElectionMethods STARTED

kafka.zk.KafkaZkClientTest > testPreferredReplicaElectionMethods PASSED

kafka.zk.KafkaZkClientTest > testPropagateLogDir STARTED

kafka.zk.KafkaZkClientTest > testPropagateLogDir PASSED

kafka.zk.KafkaZkClientTest > testGetDataAndStat STARTED

kafka.zk.KafkaZkClientTest > testGetDataAndStat PASSED

kafka.zk.KafkaZkClientTest > testCreateTopLevelPaths STARTED

kafka.zk.KafkaZkClientTest > testCreateTopLevelPaths PASSED

kafka.zk.KafkaZkClientTest > testBrokerSequenceIdMethods STARTED

kafka.zk.KafkaZkClientTest > testBrokerSequenceIdMethods PASSED

kafka.zk.KafkaZkClientTest > testCreateSequentialPersistentPath STARTED

kafka.zk.KafkaZkClientTest > testCreateSequentialPersistentPath PASSED

kafka.zk.KafkaZkClientTest > testConditionalUpdatePath STARTED

kafka.zk.KafkaZkClientTest > testConditionalUpdatePath PASSED

kafka.zk.KafkaZkClientTest > testTopicAssignmentMethods STARTED

kafka.zk.KafkaZkClientTest > testTopicAssignmentMethods PASSED

kafka.zk.KafkaZkClientTest > testPropagateIsrChanges STARTED

kafka.zk.KafkaZkClientTest > testPropagateIsrChanges PASSED

kafka.zk.KafkaZkClientTest > testDeleteRecursive STARTED

kafka.zk.KafkaZkClientTest > testDeleteRecursive PASSED

kafka.zk.ZKPathTest > testCreatePersistentSequentialThrowsException STARTED

kafka.zk.ZKPathTest > testCreatePersistentSequentialThrowsException PASSED

kafka.zk.ZKPathTest > testCreatePersistentSequentialExists STARTED

kafka.zk.ZKPathTest > testCreatePersistentSequentialExists PASSED

kafka.zk.ZKPathTest > testCreateEphemeralPathExists STARTED

kafka.zk.ZKPathTest > testCreateEphemeralPathExists PASSED

kafka.zk.ZKPathTest > testCreatePersistentPath STARTED

kafka.zk.ZKPathTest > testCreatePersistentPath PASSED

kafka.zk.ZKPathTest > testMakeSurePersistsPathExistsThrowsException STARTED

kafka.zk.ZKPathTest > testMakeSurePersistsPathExistsThrowsException PASSED

kafka.zk.ZKPathTest > testCreateEphemeralPathThrowsException STARTED

kafka.zk.ZKPathTest > testCreateEphemeralPathThrowsException PASSED

kafka.zk.ZKPathTest > testCreatePersistentPathThrowsException STARTED

kafka.zk.ZKPathTest > testCreatePersistentPathThrowsException PASSED

kafka.zk.ZKPathTest > testMakeSurePersistsPathExists STARTED

kafka.zk.ZKPathTest > testMakeSurePersistsPathExists PASSED

kafka.zk.ZKEphemeralTest > testOverlappingSessions[0] STARTED

kafka.zk.ZKEphemeralTest > testOverlappingSessions[0] PASSED

kafka.zk.ZKEphemeralTest > testEphemeralNodeCleanup[0] STARTED

kafka.zk.ZKEphemeralTest > testEphemeralNodeCleanup[0] PASSED

kafka.zk.ZKEphemeralTest > testZkWatchedEphemeral[0] STARTED

kafka.zk.ZKEphemeralTest > testZkWatchedEphemeral[0] PASSED

kafka.zk.ZKEphemeralTest > testSameSession[0] STARTED

kafka.zk.ZKEphemeralTest > testSameSession[0] PASSED

kafka.zk.ZKEphemeralTest > testOverlappingSessions[1] STARTED

kafka.zk.ZKEphemeralTest > testOverlappingSessions[1] PASSED

kafka.zk.ZKEphemeralTest > testEphemeralNodeCleanup[1] STARTED

kafka.zk.ZKEphemeralTest > testEphemeralNodeCleanup[1] PASSED

kafka.zk.ZKEphemeralTest > testZkWatchedEphemeral[1] STARTED

kafka.zk.ZKEphemeralTest > testZkWatchedEphemeral[1] PASSED

kafka.zk.ZKEphemeralTest > testSameSession[1] STARTED

kafka.zk.ZKEphemeralTest > testSameSession[1] PASSED

1774 tests completed, 1 failed, 6 skipped
:kafka-trunk-jdk8:core:test FAILED
:test_core_2_11 FAILED

FAILURE: Build failed with an exception.

* What went wrong:
Execution failed for task ':kafka-trunk-jdk8:core:test'.
> There were failing tests. See the report at: file://<https://builds.apache.org/job/kafka-trunk-jdk8/ws/core/build/reports/tests/test/index.html>

* Try:
Run with --stacktrace option to get the stack trace. Run with --info or --debug option to
get more log output. Run with --scan to get full insights.

* Get more help at https://help.gradle.org

BUILD FAILED in 1h 35m 44s
16 actionable tasks: 2 executed, 14 up-to-date
Build step 'Execute shell' marked build as failure
[FINDBUGS] Collecting findbugs analysis files...
ERROR: No tool found matching GRADLE_3_4_RC_2_HOME
Setting GRADLE_3_5_HOME=/home/jenkins/tools/gradle/3.5
[FINDBUGS] Searching for all files in <https://builds.apache.org/job/kafka-trunk-jdk8/ws/>
that match the pattern **/build/reports/findbugs/*.xml
[FINDBUGS] Parsing 1 file in <https://builds.apache.org/job/kafka-trunk-jdk8/ws/>
[FINDBUGS] Successfully parsed file <https://builds.apache.org/job/kafka-trunk-jdk8/ws/core/build/reports/findbugs/main.xml>
with 0 unique warnings and 0 duplicates.
ERROR: No tool found matching GRADLE_3_4_RC_2_HOME
Setting GRADLE_3_5_HOME=/home/jenkins/tools/gradle/3.5
ERROR: No tool found matching GRADLE_3_4_RC_2_HOME
Setting GRADLE_3_5_HOME=/home/jenkins/tools/gradle/3.5
<Git Blamer> Using GitBlamer to create author and commit information for all warnings.
<Git Blamer> GIT_COMMIT=abf4c547017304c9b1e743723bdcb0b8a4df1ad0, workspace=<https://builds.apache.org/job/kafka-trunk-jdk8/ws/>
[FINDBUGS] Computing warning deltas based on reference build #2316
Recording test results
ERROR: No tool found matching GRADLE_3_4_RC_2_HOME
Setting GRADLE_3_5_HOME=/home/jenkins/tools/gradle/3.5
ERROR: No tool found matching GRADLE_3_4_RC_2_HOME
Setting GRADLE_3_5_HOME=/home/jenkins/tools/gradle/3.5

Mime
View raw message