kafka-dev mailing list archives

Site index · List index
Message view « Date » · « Thread »
Top « Date » · « Thread »
From Apache Jenkins Server <jenk...@builds.apache.org>
Subject Build failed in Jenkins: kafka-trunk-jdk8 #2315
Date Mon, 08 Jan 2018 21:04:15 GMT
See <https://builds.apache.org/job/kafka-trunk-jdk8/2315/display/redirect>

------------------------------------------
[...truncated 3.87 MB...]
org.apache.kafka.connect.runtime.TransformationConfigTest > testEmbeddedConfigRegexRouter
PASSED

org.apache.kafka.connect.runtime.TransformationConfigTest > testEmbeddedConfigSetSchemaMetadata
STARTED

org.apache.kafka.connect.runtime.TransformationConfigTest > testEmbeddedConfigSetSchemaMetadata
PASSED

org.apache.kafka.connect.runtime.TransformationConfigTest > testEmbeddedConfigTimestampConverter
STARTED

org.apache.kafka.connect.runtime.TransformationConfigTest > testEmbeddedConfigTimestampConverter
PASSED

org.apache.kafka.connect.runtime.TransformationConfigTest > testEmbeddedConfigHoistField
STARTED

org.apache.kafka.connect.runtime.TransformationConfigTest > testEmbeddedConfigHoistField
PASSED

org.apache.kafka.connect.runtime.TransformationConfigTest > testEmbeddedConfigMaskField
STARTED

org.apache.kafka.connect.runtime.TransformationConfigTest > testEmbeddedConfigMaskField
PASSED

org.apache.kafka.connect.runtime.TransformationConfigTest > testEmbeddedConfigInsertField
STARTED

org.apache.kafka.connect.runtime.TransformationConfigTest > testEmbeddedConfigInsertField
PASSED

org.apache.kafka.connect.runtime.TransformationConfigTest > testEmbeddedConfigFlatten STARTED

org.apache.kafka.connect.runtime.TransformationConfigTest > testEmbeddedConfigFlatten PASSED

org.apache.kafka.connect.runtime.TransformationConfigTest > testEmbeddedConfigReplaceField
STARTED

org.apache.kafka.connect.runtime.TransformationConfigTest > testEmbeddedConfigReplaceField
PASSED

org.apache.kafka.connect.runtime.TransformationConfigTest > testEmbeddedConfigTimestampRouter
STARTED

org.apache.kafka.connect.runtime.TransformationConfigTest > testEmbeddedConfigTimestampRouter
PASSED

org.apache.kafka.connect.runtime.TransformationConfigTest > testEmbeddedConfigValueToKey
STARTED

org.apache.kafka.connect.runtime.TransformationConfigTest > testEmbeddedConfigValueToKey
PASSED

org.apache.kafka.connect.runtime.TransformationConfigTest > testEmbeddedConfigExtractField
STARTED

org.apache.kafka.connect.runtime.TransformationConfigTest > testEmbeddedConfigExtractField
PASSED

org.apache.kafka.connect.runtime.ConnectorConfigTest > unconfiguredTransform STARTED

org.apache.kafka.connect.runtime.ConnectorConfigTest > unconfiguredTransform PASSED

org.apache.kafka.connect.runtime.ConnectorConfigTest > multipleTransformsOneDangling STARTED

org.apache.kafka.connect.runtime.ConnectorConfigTest > multipleTransformsOneDangling PASSED

org.apache.kafka.connect.runtime.ConnectorConfigTest > misconfiguredTransform STARTED

org.apache.kafka.connect.runtime.ConnectorConfigTest > misconfiguredTransform PASSED

org.apache.kafka.connect.runtime.ConnectorConfigTest > noTransforms STARTED

org.apache.kafka.connect.runtime.ConnectorConfigTest > noTransforms PASSED

org.apache.kafka.connect.runtime.ConnectorConfigTest > danglingTransformAlias STARTED

org.apache.kafka.connect.runtime.ConnectorConfigTest > danglingTransformAlias PASSED

org.apache.kafka.connect.runtime.ConnectorConfigTest > multipleTransforms STARTED

org.apache.kafka.connect.runtime.ConnectorConfigTest > multipleTransforms PASSED

org.apache.kafka.connect.runtime.ConnectorConfigTest > singleTransform STARTED

org.apache.kafka.connect.runtime.ConnectorConfigTest > singleTransform PASSED

org.apache.kafka.connect.runtime.ConnectorConfigTest > wrongTransformationType STARTED

org.apache.kafka.connect.runtime.ConnectorConfigTest > wrongTransformationType PASSED

org.apache.kafka.connect.runtime.standalone.StandaloneHerderTest > testPutConnectorConfig
STARTED

org.apache.kafka.connect.runtime.standalone.StandaloneHerderTest > testPutConnectorConfig
PASSED

org.apache.kafka.connect.runtime.standalone.StandaloneHerderTest > testPutTaskConfigs STARTED

org.apache.kafka.connect.runtime.standalone.StandaloneHerderTest > testPutTaskConfigs PASSED

org.apache.kafka.connect.runtime.standalone.StandaloneHerderTest > testCorruptConfig STARTED

org.apache.kafka.connect.runtime.standalone.StandaloneHerderTest > testCorruptConfig PASSED

org.apache.kafka.connect.runtime.standalone.StandaloneHerderTest > testCreateConnectorFailedBasicValidation
STARTED

org.apache.kafka.connect.runtime.standalone.StandaloneHerderTest > testCreateConnectorFailedBasicValidation
PASSED

org.apache.kafka.connect.runtime.standalone.StandaloneHerderTest > testCreateConnectorFailedCustomValidation
STARTED

org.apache.kafka.connect.runtime.standalone.StandaloneHerderTest > testCreateConnectorFailedCustomValidation
PASSED

org.apache.kafka.connect.runtime.standalone.StandaloneHerderTest > testCreateConnectorAlreadyExists
STARTED

org.apache.kafka.connect.runtime.standalone.StandaloneHerderTest > testCreateConnectorAlreadyExists
PASSED

org.apache.kafka.connect.runtime.standalone.StandaloneHerderTest > testDestroyConnector
STARTED

org.apache.kafka.connect.runtime.standalone.StandaloneHerderTest > testDestroyConnector
PASSED

org.apache.kafka.connect.runtime.standalone.StandaloneHerderTest > testRestartConnector
STARTED

org.apache.kafka.connect.runtime.standalone.StandaloneHerderTest > testRestartConnector
PASSED

org.apache.kafka.connect.runtime.standalone.StandaloneHerderTest > testRestartTask STARTED

org.apache.kafka.connect.runtime.standalone.StandaloneHerderTest > testRestartTask PASSED

org.apache.kafka.connect.runtime.standalone.StandaloneHerderTest > testAccessors STARTED

org.apache.kafka.connect.runtime.standalone.StandaloneHerderTest > testAccessors PASSED

org.apache.kafka.connect.runtime.standalone.StandaloneHerderTest > testCreateSourceConnector
STARTED

org.apache.kafka.connect.runtime.standalone.StandaloneHerderTest > testCreateSourceConnector
PASSED

org.apache.kafka.connect.runtime.standalone.StandaloneHerderTest > testCreateSinkConnector
STARTED

org.apache.kafka.connect.runtime.standalone.StandaloneHerderTest > testCreateSinkConnector
PASSED

org.apache.kafka.connect.runtime.standalone.StandaloneHerderTest > testRestartConnectorFailureOnStart
STARTED

org.apache.kafka.connect.runtime.standalone.StandaloneHerderTest > testRestartConnectorFailureOnStart
PASSED

org.apache.kafka.connect.runtime.standalone.StandaloneHerderTest > testRestartTaskFailureOnStart
STARTED

org.apache.kafka.connect.runtime.standalone.StandaloneHerderTest > testRestartTaskFailureOnStart
PASSED

org.apache.kafka.connect.runtime.standalone.StandaloneHerderTest > testCreateAndStop STARTED

org.apache.kafka.connect.runtime.standalone.StandaloneHerderTest > testCreateAndStop PASSED

org.apache.kafka.connect.runtime.ConnectMetricsTest > testGettingGroupMultipleTimes STARTED

org.apache.kafka.connect.runtime.ConnectMetricsTest > testGettingGroupMultipleTimes PASSED

org.apache.kafka.connect.runtime.ConnectMetricsTest > testCreatingTags STARTED

org.apache.kafka.connect.runtime.ConnectMetricsTest > testCreatingTags PASSED

org.apache.kafka.connect.runtime.ConnectMetricsTest > testMetricGroupIdWithoutTags STARTED

org.apache.kafka.connect.runtime.ConnectMetricsTest > testMetricGroupIdWithoutTags PASSED

org.apache.kafka.connect.runtime.ConnectMetricsTest > testCreatingTagsWithOddNumberOfTags
STARTED

org.apache.kafka.connect.runtime.ConnectMetricsTest > testCreatingTagsWithOddNumberOfTags
PASSED

org.apache.kafka.connect.runtime.ConnectMetricsTest > testGettingGroupWithOddNumberOfTags
STARTED

org.apache.kafka.connect.runtime.ConnectMetricsTest > testGettingGroupWithOddNumberOfTags
PASSED

org.apache.kafka.connect.runtime.ConnectMetricsTest > testMetricGroupIdIdentity STARTED

org.apache.kafka.connect.runtime.ConnectMetricsTest > testMetricGroupIdIdentity PASSED

org.apache.kafka.connect.runtime.ConnectMetricsTest > testRecreateWithoutClose STARTED

org.apache.kafka.connect.runtime.ConnectMetricsTest > testRecreateWithoutClose PASSED

org.apache.kafka.connect.runtime.ConnectMetricsTest > testGettingGroupWithTags STARTED

org.apache.kafka.connect.runtime.ConnectMetricsTest > testGettingGroupWithTags PASSED

org.apache.kafka.connect.runtime.ConnectMetricsTest > testRecreateWithClose STARTED

org.apache.kafka.connect.runtime.ConnectMetricsTest > testRecreateWithClose PASSED

org.apache.kafka.connect.runtime.ConnectMetricsTest > testKafkaMetricsNotNull STARTED

org.apache.kafka.connect.runtime.ConnectMetricsTest > testKafkaMetricsNotNull PASSED

org.apache.kafka.connect.converters.ByteArrayConverterTest > testFromConnectSchemaless
STARTED

org.apache.kafka.connect.converters.ByteArrayConverterTest > testFromConnectSchemaless
PASSED

org.apache.kafka.connect.converters.ByteArrayConverterTest > testToConnectNull STARTED

org.apache.kafka.connect.converters.ByteArrayConverterTest > testToConnectNull PASSED

org.apache.kafka.connect.converters.ByteArrayConverterTest > testFromConnectBadSchema STARTED

org.apache.kafka.connect.converters.ByteArrayConverterTest > testFromConnectBadSchema PASSED

org.apache.kafka.connect.converters.ByteArrayConverterTest > testFromConnectNull STARTED

org.apache.kafka.connect.converters.ByteArrayConverterTest > testFromConnectNull PASSED

org.apache.kafka.connect.converters.ByteArrayConverterTest > testToConnect STARTED

org.apache.kafka.connect.converters.ByteArrayConverterTest > testToConnect PASSED

org.apache.kafka.connect.converters.ByteArrayConverterTest > testFromConnect STARTED

org.apache.kafka.connect.converters.ByteArrayConverterTest > testFromConnect PASSED

org.apache.kafka.connect.converters.ByteArrayConverterTest > testFromConnectInvalidValue
STARTED

org.apache.kafka.connect.converters.ByteArrayConverterTest > testFromConnectInvalidValue
PASSED

280 tests completed, 1 failed
:connect:runtime:test FAILED

FAILURE: Build failed with an exception.

* What went wrong:
Execution failed for task ':connect:runtime:test'.
> There were failing tests. See the report at: file://<https://builds.apache.org/job/kafka-trunk-jdk8/ws/connect/runtime/build/reports/tests/test/index.html>

* Try:
Run with --stacktrace option to get the stack trace. Run with --info or --debug option to
get more log output. Run with --scan to get full insights.

* Get more help at https://help.gradle.org

BUILD FAILED in 1h 24m 32s
97 actionable tasks: 94 executed, 3 up-to-date
Build step 'Execute shell' marked build as failure
[FINDBUGS] Collecting findbugs analysis files...
ERROR: No tool found matching GRADLE_3_4_RC_2_HOME
Setting GRADLE_3_5_HOME=/home/jenkins/tools/gradle/3.5
[FINDBUGS] Searching for all files in <https://builds.apache.org/job/kafka-trunk-jdk8/ws/>
that match the pattern **/build/reports/findbugs/*.xml
[FINDBUGS] Parsing 11 files in <https://builds.apache.org/job/kafka-trunk-jdk8/ws/>
[FINDBUGS] Successfully parsed file <https://builds.apache.org/job/kafka-trunk-jdk8/ws/clients/build/reports/findbugs/main.xml>
with 0 unique warnings and 0 duplicates.
[FINDBUGS] Successfully parsed file <https://builds.apache.org/job/kafka-trunk-jdk8/ws/connect/api/build/reports/findbugs/main.xml>
with 0 unique warnings and 0 duplicates.
[FINDBUGS] Successfully parsed file <https://builds.apache.org/job/kafka-trunk-jdk8/ws/connect/file/build/reports/findbugs/main.xml>
with 0 unique warnings and 0 duplicates.
[FINDBUGS] Successfully parsed file <https://builds.apache.org/job/kafka-trunk-jdk8/ws/connect/json/build/reports/findbugs/main.xml>
with 0 unique warnings and 0 duplicates.
[FINDBUGS] Successfully parsed file <https://builds.apache.org/job/kafka-trunk-jdk8/ws/connect/runtime/build/reports/findbugs/main.xml>
with 0 unique warnings and 0 duplicates.
[FINDBUGS] Successfully parsed file <https://builds.apache.org/job/kafka-trunk-jdk8/ws/core/build/reports/findbugs/main.xml>
with 0 unique warnings and 0 duplicates.
[FINDBUGS] Successfully parsed file <https://builds.apache.org/job/kafka-trunk-jdk8/ws/examples/build/reports/findbugs/main.xml>
with 0 unique warnings and 0 duplicates.
[FINDBUGS] Successfully parsed file <https://builds.apache.org/job/kafka-trunk-jdk8/ws/jmh-benchmarks/build/reports/findbugs/main.xml>
with 0 unique warnings and 0 duplicates.
[FINDBUGS] Successfully parsed file <https://builds.apache.org/job/kafka-trunk-jdk8/ws/log4j-appender/build/reports/findbugs/main.xml>
with 0 unique warnings and 0 duplicates.
[FINDBUGS] Successfully parsed file <https://builds.apache.org/job/kafka-trunk-jdk8/ws/streams/build/reports/findbugs/main.xml>
with 0 unique warnings and 0 duplicates.
[FINDBUGS] Successfully parsed file <https://builds.apache.org/job/kafka-trunk-jdk8/ws/tools/build/reports/findbugs/main.xml>
with 0 unique warnings and 0 duplicates.
ERROR: No tool found matching GRADLE_3_4_RC_2_HOME
Setting GRADLE_3_5_HOME=/home/jenkins/tools/gradle/3.5
ERROR: No tool found matching GRADLE_3_4_RC_2_HOME
Setting GRADLE_3_5_HOME=/home/jenkins/tools/gradle/3.5
<Git Blamer> Using GitBlamer to create author and commit information for all warnings.
<Git Blamer> GIT_COMMIT=d63f94797cd3a283b2d374d24a23ac54f92c7b27, workspace=<https://builds.apache.org/job/kafka-trunk-jdk8/ws/>
[FINDBUGS] Computing warning deltas based on reference build #2312
Recording test results
ERROR: No tool found matching GRADLE_3_4_RC_2_HOME
Setting GRADLE_3_5_HOME=/home/jenkins/tools/gradle/3.5
ERROR: No tool found matching GRADLE_3_4_RC_2_HOME
Setting GRADLE_3_5_HOME=/home/jenkins/tools/gradle/3.5
Not sending mail to unregistered user damian.guy@gmail.com
Not sending mail to unregistered user romain_hardouin@yahoo.fr

Mime
View raw message