kafka-dev mailing list archives

Site index · List index
Message view « Date » · « Thread »
Top « Date » · « Thread »
From Apache Jenkins Server <jenk...@builds.apache.org>
Subject Build failed in Jenkins: kafka-0.11.0-jdk7 #345
Date Mon, 11 Dec 2017 20:25:11 GMT
See <https://builds.apache.org/job/kafka-0.11.0-jdk7/345/display/redirect?page=changes>

Changes:

[jason] MINOR: Increase number of messages in replica verification tool test

------------------------------------------
[...truncated 2.61 MB...]

org.apache.kafka.connect.runtime.rest.resources.ConnectorsResourceTest > testRestartConnectorLeaderRedirect
STARTED

org.apache.kafka.connect.runtime.rest.resources.ConnectorsResourceTest > testRestartConnectorLeaderRedirect
PASSED

org.apache.kafka.connect.runtime.rest.resources.ConnectorsResourceTest > testRestartConnectorOwnerRedirect
STARTED

org.apache.kafka.connect.runtime.rest.resources.ConnectorsResourceTest > testRestartConnectorOwnerRedirect
PASSED

org.apache.kafka.connect.runtime.rest.resources.ConnectorsResourceTest > testRestartTaskNotFound
STARTED

org.apache.kafka.connect.runtime.rest.resources.ConnectorsResourceTest > testRestartTaskNotFound
PASSED

org.apache.kafka.connect.runtime.rest.resources.ConnectorsResourceTest > testRestartTaskLeaderRedirect
STARTED

org.apache.kafka.connect.runtime.rest.resources.ConnectorsResourceTest > testRestartTaskLeaderRedirect
PASSED

org.apache.kafka.connect.runtime.rest.resources.ConnectorsResourceTest > testRestartTaskOwnerRedirect
STARTED

org.apache.kafka.connect.runtime.rest.resources.ConnectorsResourceTest > testRestartTaskOwnerRedirect
PASSED

org.apache.kafka.connect.runtime.rest.RestServerTest > testCORSEnabled STARTED

org.apache.kafka.connect.runtime.rest.RestServerTest > testCORSEnabled PASSED

org.apache.kafka.connect.runtime.rest.RestServerTest > testCORSDisabled STARTED

org.apache.kafka.connect.runtime.rest.RestServerTest > testCORSDisabled PASSED

org.apache.kafka.connect.runtime.rest.entities.ConnectorTypeTest > testToStringIsLowerCase
STARTED

org.apache.kafka.connect.runtime.rest.entities.ConnectorTypeTest > testToStringIsLowerCase
PASSED

org.apache.kafka.connect.runtime.rest.entities.ConnectorTypeTest > testForValue STARTED

org.apache.kafka.connect.runtime.rest.entities.ConnectorTypeTest > testForValue PASSED

org.apache.kafka.connect.runtime.TransformationConfigTest > testEmbeddedConfigCast STARTED

org.apache.kafka.connect.runtime.TransformationConfigTest > testEmbeddedConfigCast PASSED

org.apache.kafka.connect.runtime.TransformationConfigTest > testEmbeddedConfigRegexRouter
STARTED

org.apache.kafka.connect.runtime.TransformationConfigTest > testEmbeddedConfigRegexRouter
PASSED

org.apache.kafka.connect.runtime.TransformationConfigTest > testEmbeddedConfigSetSchemaMetadata
STARTED

org.apache.kafka.connect.runtime.TransformationConfigTest > testEmbeddedConfigSetSchemaMetadata
PASSED

org.apache.kafka.connect.runtime.TransformationConfigTest > testEmbeddedConfigTimestampConverter
STARTED

org.apache.kafka.connect.runtime.TransformationConfigTest > testEmbeddedConfigTimestampConverter
PASSED

org.apache.kafka.connect.runtime.TransformationConfigTest > testEmbeddedConfigHoistField
STARTED

org.apache.kafka.connect.runtime.TransformationConfigTest > testEmbeddedConfigHoistField
PASSED

org.apache.kafka.connect.runtime.TransformationConfigTest > testEmbeddedConfigMaskField
STARTED

org.apache.kafka.connect.runtime.TransformationConfigTest > testEmbeddedConfigMaskField
PASSED

org.apache.kafka.connect.runtime.TransformationConfigTest > testEmbeddedConfigInsertField
STARTED

org.apache.kafka.connect.runtime.TransformationConfigTest > testEmbeddedConfigInsertField
PASSED

org.apache.kafka.connect.runtime.TransformationConfigTest > testEmbeddedConfigFlatten STARTED

org.apache.kafka.connect.runtime.TransformationConfigTest > testEmbeddedConfigFlatten PASSED

org.apache.kafka.connect.runtime.TransformationConfigTest > testEmbeddedConfigReplaceField
STARTED

org.apache.kafka.connect.runtime.TransformationConfigTest > testEmbeddedConfigReplaceField
PASSED

org.apache.kafka.connect.runtime.TransformationConfigTest > testEmbeddedConfigTimestampRouter
STARTED

org.apache.kafka.connect.runtime.TransformationConfigTest > testEmbeddedConfigTimestampRouter
PASSED

org.apache.kafka.connect.runtime.TransformationConfigTest > testEmbeddedConfigValueToKey
STARTED

org.apache.kafka.connect.runtime.TransformationConfigTest > testEmbeddedConfigValueToKey
PASSED

org.apache.kafka.connect.runtime.TransformationConfigTest > testEmbeddedConfigExtractField
STARTED

org.apache.kafka.connect.runtime.TransformationConfigTest > testEmbeddedConfigExtractField
PASSED

org.apache.kafka.connect.runtime.ConnectorConfigTest > unconfiguredTransform STARTED

org.apache.kafka.connect.runtime.ConnectorConfigTest > unconfiguredTransform PASSED

org.apache.kafka.connect.runtime.ConnectorConfigTest > multipleTransformsOneDangling STARTED

org.apache.kafka.connect.runtime.ConnectorConfigTest > multipleTransformsOneDangling PASSED

org.apache.kafka.connect.runtime.ConnectorConfigTest > misconfiguredTransform STARTED

org.apache.kafka.connect.runtime.ConnectorConfigTest > misconfiguredTransform PASSED

org.apache.kafka.connect.runtime.ConnectorConfigTest > noTransforms STARTED

org.apache.kafka.connect.runtime.ConnectorConfigTest > noTransforms PASSED

org.apache.kafka.connect.runtime.ConnectorConfigTest > danglingTransformAlias STARTED

org.apache.kafka.connect.runtime.ConnectorConfigTest > danglingTransformAlias PASSED

org.apache.kafka.connect.runtime.ConnectorConfigTest > multipleTransforms STARTED

org.apache.kafka.connect.runtime.ConnectorConfigTest > multipleTransforms PASSED

org.apache.kafka.connect.runtime.ConnectorConfigTest > singleTransform STARTED

org.apache.kafka.connect.runtime.ConnectorConfigTest > singleTransform PASSED

org.apache.kafka.connect.runtime.ConnectorConfigTest > wrongTransformationType STARTED

org.apache.kafka.connect.runtime.ConnectorConfigTest > wrongTransformationType PASSED

org.apache.kafka.connect.runtime.standalone.StandaloneHerderTest > testPutConnectorConfig
STARTED

org.apache.kafka.connect.runtime.standalone.StandaloneHerderTest > testPutConnectorConfig
PASSED

org.apache.kafka.connect.runtime.standalone.StandaloneHerderTest > testPutTaskConfigs STARTED

org.apache.kafka.connect.runtime.standalone.StandaloneHerderTest > testPutTaskConfigs PASSED

org.apache.kafka.connect.runtime.standalone.StandaloneHerderTest > testCreateSinkConnector
STARTED

org.apache.kafka.connect.runtime.standalone.StandaloneHerderTest > testCreateSinkConnector
PASSED

org.apache.kafka.connect.runtime.standalone.StandaloneHerderTest > testRestartConnectorFailureOnStart
STARTED

org.apache.kafka.connect.runtime.standalone.StandaloneHerderTest > testRestartConnectorFailureOnStart
PASSED

org.apache.kafka.connect.runtime.standalone.StandaloneHerderTest > testRestartTaskFailureOnStart
STARTED

org.apache.kafka.connect.runtime.standalone.StandaloneHerderTest > testRestartTaskFailureOnStart
PASSED

org.apache.kafka.connect.runtime.standalone.StandaloneHerderTest > testCreateAndStop STARTED

org.apache.kafka.connect.runtime.standalone.StandaloneHerderTest > testCreateAndStop PASSED

org.apache.kafka.connect.runtime.standalone.StandaloneHerderTest > testCreateConnectorFailedBasicValidation
STARTED

org.apache.kafka.connect.runtime.standalone.StandaloneHerderTest > testCreateConnectorFailedBasicValidation
PASSED

org.apache.kafka.connect.runtime.standalone.StandaloneHerderTest > testCreateConnectorFailedCustomValidation
STARTED

org.apache.kafka.connect.runtime.standalone.StandaloneHerderTest > testCreateConnectorFailedCustomValidation
PASSED

org.apache.kafka.connect.runtime.standalone.StandaloneHerderTest > testCreateConnectorAlreadyExists
STARTED

org.apache.kafka.connect.runtime.standalone.StandaloneHerderTest > testCreateConnectorAlreadyExists
PASSED

org.apache.kafka.connect.runtime.standalone.StandaloneHerderTest > testDestroyConnector
STARTED

org.apache.kafka.connect.runtime.standalone.StandaloneHerderTest > testDestroyConnector
PASSED

org.apache.kafka.connect.runtime.standalone.StandaloneHerderTest > testRestartConnector
STARTED

org.apache.kafka.connect.runtime.standalone.StandaloneHerderTest > testRestartConnector
PASSED

org.apache.kafka.connect.runtime.standalone.StandaloneHerderTest > testRestartTask STARTED

org.apache.kafka.connect.runtime.standalone.StandaloneHerderTest > testRestartTask PASSED

org.apache.kafka.connect.runtime.standalone.StandaloneHerderTest > testAccessors STARTED

org.apache.kafka.connect.runtime.standalone.StandaloneHerderTest > testAccessors PASSED

org.apache.kafka.connect.runtime.standalone.StandaloneHerderTest > testCreateSourceConnector
STARTED

org.apache.kafka.connect.runtime.standalone.StandaloneHerderTest > testCreateSourceConnector
PASSED

org.apache.kafka.connect.runtime.standalone.StandaloneHerderTest > testCorruptConfig STARTED

org.apache.kafka.connect.runtime.standalone.StandaloneHerderTest > testCorruptConfig PASSED

org.apache.kafka.connect.converters.ByteArrayConverterTest > testFromConnectSchemaless
STARTED

org.apache.kafka.connect.converters.ByteArrayConverterTest > testFromConnectSchemaless
PASSED

org.apache.kafka.connect.converters.ByteArrayConverterTest > testToConnectNull STARTED

org.apache.kafka.connect.converters.ByteArrayConverterTest > testToConnectNull PASSED

org.apache.kafka.connect.converters.ByteArrayConverterTest > testFromConnectBadSchema STARTED

org.apache.kafka.connect.converters.ByteArrayConverterTest > testFromConnectBadSchema PASSED

org.apache.kafka.connect.converters.ByteArrayConverterTest > testFromConnectNull STARTED

org.apache.kafka.connect.converters.ByteArrayConverterTest > testFromConnectNull PASSED

org.apache.kafka.connect.converters.ByteArrayConverterTest > testToConnect STARTED

org.apache.kafka.connect.converters.ByteArrayConverterTest > testToConnect PASSED

org.apache.kafka.connect.converters.ByteArrayConverterTest > testFromConnect STARTED

org.apache.kafka.connect.converters.ByteArrayConverterTest > testFromConnect PASSED

org.apache.kafka.connect.converters.ByteArrayConverterTest > testFromConnectInvalidValue
STARTED

org.apache.kafka.connect.converters.ByteArrayConverterTest > testFromConnectInvalidValue
PASSED

258 tests completed, 1 failed
:connect:runtime:test FAILED

FAILURE: Build failed with an exception.

* What went wrong:
Execution failed for task ':connect:runtime:test'.
> There were failing tests. See the report at: file://<https://builds.apache.org/job/kafka-0.11.0-jdk7/ws/connect/runtime/build/reports/tests/test/index.html>

* Try:
Run with --stacktrace option to get the stack trace. Run with --info or --debug option to
get more log output.

BUILD FAILED

Total time: 1 hrs 8 mins 23.132 secs
Build step 'Execute shell' marked build as failure
[FINDBUGS] Collecting findbugs analysis files...
ERROR: No tool found matching GRADLE_3_4_RC_2_HOME
Setting GRADLE_3_5_HOME=/home/jenkins/tools/gradle/3.5
[FINDBUGS] Searching for all files in <https://builds.apache.org/job/kafka-0.11.0-jdk7/ws/>
that match the pattern **/build/reports/findbugs/*.xml
[FINDBUGS] Parsing 10 files in <https://builds.apache.org/job/kafka-0.11.0-jdk7/ws/>
[FINDBUGS] Successfully parsed file <https://builds.apache.org/job/kafka-0.11.0-jdk7/ws/clients/build/reports/findbugs/main.xml>
with 0 unique warnings and 0 duplicates.
[FINDBUGS] Successfully parsed file <https://builds.apache.org/job/kafka-0.11.0-jdk7/ws/connect/api/build/reports/findbugs/main.xml>
with 0 unique warnings and 0 duplicates.
[FINDBUGS] Successfully parsed file <https://builds.apache.org/job/kafka-0.11.0-jdk7/ws/connect/file/build/reports/findbugs/main.xml>
with 0 unique warnings and 0 duplicates.
[FINDBUGS] Successfully parsed file <https://builds.apache.org/job/kafka-0.11.0-jdk7/ws/connect/json/build/reports/findbugs/main.xml>
with 0 unique warnings and 0 duplicates.
[FINDBUGS] Successfully parsed file <https://builds.apache.org/job/kafka-0.11.0-jdk7/ws/connect/runtime/build/reports/findbugs/main.xml>
with 0 unique warnings and 0 duplicates.
[FINDBUGS] Successfully parsed file <https://builds.apache.org/job/kafka-0.11.0-jdk7/ws/core/build/reports/findbugs/main.xml>
with 0 unique warnings and 0 duplicates.
[FINDBUGS] Successfully parsed file <https://builds.apache.org/job/kafka-0.11.0-jdk7/ws/examples/build/reports/findbugs/main.xml>
with 0 unique warnings and 0 duplicates.
[FINDBUGS] Successfully parsed file <https://builds.apache.org/job/kafka-0.11.0-jdk7/ws/log4j-appender/build/reports/findbugs/main.xml>
with 0 unique warnings and 0 duplicates.
[FINDBUGS] Successfully parsed file <https://builds.apache.org/job/kafka-0.11.0-jdk7/ws/streams/build/reports/findbugs/main.xml>
with 0 unique warnings and 0 duplicates.
[FINDBUGS] Successfully parsed file <https://builds.apache.org/job/kafka-0.11.0-jdk7/ws/tools/build/reports/findbugs/main.xml>
with 0 unique warnings and 0 duplicates.
ERROR: No tool found matching GRADLE_3_4_RC_2_HOME
Setting GRADLE_3_5_HOME=/home/jenkins/tools/gradle/3.5
ERROR: No tool found matching GRADLE_3_4_RC_2_HOME
Setting GRADLE_3_5_HOME=/home/jenkins/tools/gradle/3.5
<Git Blamer> Using GitBlamer to create author and commit information for all warnings.
<Git Blamer> GIT_COMMIT=ef97ed7ee5cb883a30245ea4f77ef99d4db15373, workspace=<https://builds.apache.org/job/kafka-0.11.0-jdk7/ws/>
[FINDBUGS] Computing warning deltas based on reference build #340
Recording test results
ERROR: No tool found matching GRADLE_3_4_RC_2_HOME
Setting GRADLE_3_5_HOME=/home/jenkins/tools/gradle/3.5
ERROR: No tool found matching GRADLE_3_4_RC_2_HOME
Setting GRADLE_3_5_HOME=/home/jenkins/tools/gradle/3.5
Not sending mail to unregistered user wangguoz@gmail.com

Mime
View raw message