kafka-dev mailing list archives

Site index · List index
Message view « Date » · « Thread »
Top « Date » · « Thread »
From Apache Jenkins Server <jenk...@builds.apache.org>
Subject Build failed in Jenkins: kafka-trunk-jdk7 #3014
Date Sat, 02 Dec 2017 00:24:56 GMT
See <https://builds.apache.org/job/kafka-trunk-jdk7/3014/display/redirect?page=changes>

Changes:

[wangguoz] MINOR: Improve EOS related config docs

------------------------------------------
[...truncated 406.45 KB...]
kafka.zk.KafkaZkClientTest > testSetAndGetConsumerOffset STARTED

kafka.zk.KafkaZkClientTest > testSetAndGetConsumerOffset PASSED

kafka.zk.KafkaZkClientTest > testEntityConfigManagementMethods STARTED

kafka.zk.KafkaZkClientTest > testEntityConfigManagementMethods PASSED

kafka.zk.KafkaZkClientTest > testCreateRecursive STARTED

kafka.zk.KafkaZkClientTest > testCreateRecursive PASSED

kafka.zk.KafkaZkClientTest > testGetConsumerOffsetNoData STARTED

kafka.zk.KafkaZkClientTest > testGetConsumerOffsetNoData PASSED

kafka.zk.KafkaZkClientTest > testDeleteTopicPathMethods STARTED

kafka.zk.KafkaZkClientTest > testDeleteTopicPathMethods PASSED

kafka.zk.KafkaZkClientTest > testAclManagementMethods STARTED

kafka.zk.KafkaZkClientTest > testAclManagementMethods PASSED

kafka.zk.KafkaZkClientTest > testGetDataAndStat STARTED

kafka.zk.KafkaZkClientTest > testGetDataAndStat PASSED

kafka.zk.KafkaZkClientTest > testConditionalUpdatePath STARTED

kafka.zk.KafkaZkClientTest > testConditionalUpdatePath PASSED

kafka.zk.KafkaZkClientTest > testTopicAssignmentMethods STARTED

kafka.zk.KafkaZkClientTest > testTopicAssignmentMethods PASSED

kafka.zk.KafkaZkClientTest > testDeleteRecursive STARTED

kafka.zk.KafkaZkClientTest > testDeleteRecursive PASSED

kafka.javaapi.message.ByteBufferMessageSetTest > testSizeInBytesWithCompression STARTED

kafka.javaapi.message.ByteBufferMessageSetTest > testSizeInBytesWithCompression PASSED

kafka.javaapi.message.ByteBufferMessageSetTest > testIteratorIsConsistentWithCompression
STARTED

kafka.javaapi.message.ByteBufferMessageSetTest > testIteratorIsConsistentWithCompression
PASSED

kafka.javaapi.message.ByteBufferMessageSetTest > testIteratorIsConsistent STARTED

kafka.javaapi.message.ByteBufferMessageSetTest > testIteratorIsConsistent PASSED

kafka.javaapi.message.ByteBufferMessageSetTest > testEqualsWithCompression STARTED

kafka.javaapi.message.ByteBufferMessageSetTest > testEqualsWithCompression PASSED

kafka.javaapi.message.ByteBufferMessageSetTest > testWrittenEqualsRead STARTED

kafka.javaapi.message.ByteBufferMessageSetTest > testWrittenEqualsRead PASSED

kafka.javaapi.message.ByteBufferMessageSetTest > testEquals STARTED

kafka.javaapi.message.ByteBufferMessageSetTest > testEquals PASSED

kafka.javaapi.message.ByteBufferMessageSetTest > testSizeInBytes STARTED

kafka.javaapi.message.ByteBufferMessageSetTest > testSizeInBytes PASSED

kafka.javaapi.consumer.ZookeeperConsumerConnectorTest > testBasic STARTED

kafka.javaapi.consumer.ZookeeperConsumerConnectorTest > testBasic PASSED

kafka.metrics.MetricsTest > testMetricsReporterAfterDeletingTopic STARTED

kafka.metrics.MetricsTest > testMetricsReporterAfterDeletingTopic PASSED

kafka.metrics.MetricsTest > testBrokerTopicMetricsUnregisteredAfterDeletingTopic STARTED

kafka.metrics.MetricsTest > testBrokerTopicMetricsUnregisteredAfterDeletingTopic PASSED

kafka.metrics.MetricsTest > testClusterIdMetric STARTED

kafka.metrics.MetricsTest > testClusterIdMetric PASSED

kafka.metrics.MetricsTest > testControllerMetrics STARTED

kafka.metrics.MetricsTest > testControllerMetrics PASSED

kafka.metrics.MetricsTest > testWindowsStyleTagNames STARTED

kafka.metrics.MetricsTest > testWindowsStyleTagNames PASSED

kafka.metrics.MetricsTest > testMetricsLeak STARTED

kafka.metrics.MetricsTest > testMetricsLeak PASSED

kafka.metrics.MetricsTest > testBrokerTopicMetricsBytesInOut STARTED

kafka.metrics.MetricsTest > testBrokerTopicMetricsBytesInOut PASSED

kafka.metrics.KafkaTimerTest > testKafkaTimer STARTED

kafka.metrics.KafkaTimerTest > testKafkaTimer PASSED

kafka.security.auth.ResourceTypeTest > testJavaConversions STARTED

kafka.security.auth.ResourceTypeTest > testJavaConversions PASSED

kafka.security.auth.ResourceTypeTest > testFromString STARTED

kafka.security.auth.ResourceTypeTest > testFromString PASSED

kafka.security.auth.OperationTest > testJavaConversions STARTED

kafka.security.auth.OperationTest > testJavaConversions PASSED

kafka.security.auth.ZkAuthorizationTest > testIsZkSecurityEnabled STARTED

kafka.security.auth.ZkAuthorizationTest > testIsZkSecurityEnabled PASSED

kafka.security.auth.ZkAuthorizationTest > testZkUtils STARTED

kafka.security.auth.ZkAuthorizationTest > testZkUtils PASSED

kafka.security.auth.ZkAuthorizationTest > testZkAntiMigration STARTED

kafka.security.auth.ZkAuthorizationTest > testZkAntiMigration PASSED

kafka.security.auth.ZkAuthorizationTest > testZkMigration STARTED

kafka.security.auth.ZkAuthorizationTest > testZkMigration PASSED

kafka.security.auth.ZkAuthorizationTest > testChroot STARTED

kafka.security.auth.ZkAuthorizationTest > testChroot PASSED

kafka.security.auth.ZkAuthorizationTest > testDelete STARTED

kafka.security.auth.ZkAuthorizationTest > testDelete PASSED

kafka.security.auth.ZkAuthorizationTest > testDeleteRecursive STARTED

kafka.security.auth.ZkAuthorizationTest > testDeleteRecursive PASSED

kafka.security.auth.AclTest > testAclJsonConversion STARTED

kafka.security.auth.AclTest > testAclJsonConversion PASSED

kafka.security.auth.PermissionTypeTest > testJavaConversions STARTED

kafka.security.auth.PermissionTypeTest > testJavaConversions PASSED

kafka.security.auth.PermissionTypeTest > testFromString STARTED

kafka.security.auth.PermissionTypeTest > testFromString PASSED

kafka.security.auth.SimpleAclAuthorizerTest > testAllowAllAccess STARTED

kafka.security.auth.SimpleAclAuthorizerTest > testAllowAllAccess PASSED

kafka.security.auth.SimpleAclAuthorizerTest > testLocalConcurrentModificationOfResourceAcls
STARTED

kafka.security.auth.SimpleAclAuthorizerTest > testLocalConcurrentModificationOfResourceAcls
PASSED

kafka.security.auth.SimpleAclAuthorizerTest > testHighConcurrencyDeletionOfResourceAcls
STARTED

kafka.security.auth.SimpleAclAuthorizerTest > testHighConcurrencyDeletionOfResourceAcls
PASSED

kafka.security.auth.SimpleAclAuthorizerTest > testNoAclFound STARTED

kafka.security.auth.SimpleAclAuthorizerTest > testNoAclFound PASSED

kafka.security.auth.SimpleAclAuthorizerTest > testAclInheritance STARTED

kafka.security.auth.SimpleAclAuthorizerTest > testAclInheritance PASSED

kafka.security.auth.SimpleAclAuthorizerTest > testDistributedConcurrentModificationOfResourceAcls
STARTED

kafka.security.auth.SimpleAclAuthorizerTest > testDistributedConcurrentModificationOfResourceAcls
PASSED

kafka.security.auth.SimpleAclAuthorizerTest > testAclManagementAPIs STARTED

kafka.security.auth.SimpleAclAuthorizerTest > testAclManagementAPIs PASSED

kafka.security.auth.SimpleAclAuthorizerTest > testWildCardAcls STARTED

kafka.security.auth.SimpleAclAuthorizerTest > testWildCardAcls PASSED

kafka.security.auth.SimpleAclAuthorizerTest > testTopicAcl STARTED

kafka.security.auth.SimpleAclAuthorizerTest > testTopicAcl PASSED

kafka.security.auth.SimpleAclAuthorizerTest > testSuperUserHasAccess STARTED

kafka.security.auth.SimpleAclAuthorizerTest > testSuperUserHasAccess PASSED

kafka.security.auth.SimpleAclAuthorizerTest > testDenyTakesPrecedence STARTED

kafka.security.auth.SimpleAclAuthorizerTest > testDenyTakesPrecedence PASSED

kafka.security.auth.SimpleAclAuthorizerTest > testNoAclFoundOverride STARTED

kafka.security.auth.SimpleAclAuthorizerTest > testNoAclFoundOverride PASSED

kafka.security.auth.SimpleAclAuthorizerTest > testHighConcurrencyModificationOfResourceAcls
STARTED

kafka.security.auth.SimpleAclAuthorizerTest > testHighConcurrencyModificationOfResourceAcls
PASSED

kafka.security.auth.SimpleAclAuthorizerTest > testLoadCache STARTED

kafka.security.auth.SimpleAclAuthorizerTest > testLoadCache PASSED

1730 tests completed, 1 failed, 6 skipped
:kafka-trunk-jdk7:core:test FAILED
:test_core_2_11 FAILED

FAILURE: Build failed with an exception.

* What went wrong:
Execution failed for task ':kafka-trunk-jdk7:core:test'.
> There were failing tests. See the report at: file://<https://builds.apache.org/job/kafka-trunk-jdk7/ws/core/build/reports/tests/test/index.html>

* Try:
Run with --stacktrace option to get the stack trace. Run with --info or --debug option to
get more log output.

* Get more help at https://help.gradle.org

BUILD FAILED in 1h 44m 19s
16 actionable tasks: 3 executed, 13 up-to-date
Build step 'Execute shell' marked build as failure
[FINDBUGS] Collecting findbugs analysis files...
ERROR: No tool found matching GRADLE_3_4_RC_2_HOME
Setting GRADLE_3_5_HOME=/home/jenkins/tools/gradle/3.5
[FINDBUGS] Searching for all files in <https://builds.apache.org/job/kafka-trunk-jdk7/ws/>
that match the pattern **/build/reports/findbugs/*.xml
[FINDBUGS] Parsing 1 file in <https://builds.apache.org/job/kafka-trunk-jdk7/ws/>
[FINDBUGS] Successfully parsed file <https://builds.apache.org/job/kafka-trunk-jdk7/ws/core/build/reports/findbugs/main.xml>
with 0 unique warnings and 0 duplicates.
ERROR: No tool found matching GRADLE_3_4_RC_2_HOME
Setting GRADLE_3_5_HOME=/home/jenkins/tools/gradle/3.5
ERROR: No tool found matching GRADLE_3_4_RC_2_HOME
Setting GRADLE_3_5_HOME=/home/jenkins/tools/gradle/3.5
<Git Blamer> Using GitBlamer to create author and commit information for all warnings.
<Git Blamer> GIT_COMMIT=d1e0443bac769c10598bbdeddf6d7e06f2fdf7e4, workspace=<https://builds.apache.org/job/kafka-trunk-jdk7/ws/>
[FINDBUGS] Computing warning deltas based on reference build #3011
Recording test results
ERROR: No tool found matching GRADLE_3_4_RC_2_HOME
Setting GRADLE_3_5_HOME=/home/jenkins/tools/gradle/3.5
ERROR: No tool found matching GRADLE_3_4_RC_2_HOME
Setting GRADLE_3_5_HOME=/home/jenkins/tools/gradle/3.5
Not sending mail to unregistered user wangguoz@gmail.com

Mime
View raw message