kafka-dev mailing list archives

Site index · List index
Message view « Date » · « Thread »
Top « Date » · « Thread »
From Apache Jenkins Server <jenk...@builds.apache.org>
Subject Build failed in Jenkins: kafka-trunk-jdk7 #2650
Date Fri, 18 Aug 2017 11:24:08 GMT
See <https://builds.apache.org/job/kafka-trunk-jdk7/2650/display/redirect?page=changes>

Changes:

[ismael] KAFKA-5744; ShellTest: add tests for attempting to run nonexistent

------------------------------------------
[...truncated 911.61 KB...]

kafka.coordinator.transaction.TransactionStateManagerTest > testAppendFailToUnknownError
STARTED

kafka.coordinator.transaction.TransactionStateManagerTest > testAppendFailToUnknownError
PASSED

kafka.coordinator.transaction.TransactionStateManagerTest > shouldReturnNotCooridnatorErrorIfTransactionIdPartitionNotOwned
STARTED

kafka.coordinator.transaction.TransactionStateManagerTest > shouldReturnNotCooridnatorErrorIfTransactionIdPartitionNotOwned
PASSED

kafka.coordinator.transaction.TransactionStateManagerTest > testValidateTransactionTimeout
STARTED

kafka.coordinator.transaction.TransactionStateManagerTest > testValidateTransactionTimeout
PASSED

kafka.coordinator.transaction.TransactionStateManagerTest > shouldWriteTxnMarkersForTransactionInPreparedCommitState
STARTED

kafka.coordinator.transaction.TransactionStateManagerTest > shouldWriteTxnMarkersForTransactionInPreparedCommitState
PASSED

kafka.coordinator.transaction.TransactionStateManagerTest > shouldOnlyConsiderTransactionsInTheOngoingStateToAbort
STARTED

kafka.coordinator.transaction.TransactionStateManagerTest > shouldOnlyConsiderTransactionsInTheOngoingStateToAbort
PASSED

kafka.coordinator.transaction.TransactionStateManagerTest > shouldRemoveCompleteAbortExpiredTransactionalIds
STARTED

kafka.coordinator.transaction.TransactionStateManagerTest > shouldRemoveCompleteAbortExpiredTransactionalIds
PASSED

kafka.coordinator.transaction.TransactionStateManagerTest > testAppendTransactionToLogWhilePendingStateChanged
STARTED

kafka.coordinator.transaction.TransactionStateManagerTest > testAppendTransactionToLogWhilePendingStateChanged
PASSED

kafka.coordinator.transaction.TransactionStateManagerTest > testLoadAndRemoveTransactionsForPartition
STARTED

kafka.coordinator.transaction.TransactionStateManagerTest > testLoadAndRemoveTransactionsForPartition
PASSED

kafka.coordinator.transaction.TransactionStateManagerTest > testAppendFailToNotCoordinatorError
STARTED

kafka.coordinator.transaction.TransactionStateManagerTest > testAppendFailToNotCoordinatorError
PASSED

kafka.coordinator.transaction.TransactionStateManagerTest > shouldNotRemovePrepareCommitTransactionalIds
STARTED

kafka.coordinator.transaction.TransactionStateManagerTest > shouldNotRemovePrepareCommitTransactionalIds
PASSED

kafka.coordinator.transaction.TransactionStateManagerTest > testAppendFailToCoordinatorLoadingError
STARTED

kafka.coordinator.transaction.TransactionStateManagerTest > testAppendFailToCoordinatorLoadingError
PASSED

kafka.coordinator.transaction.TransactionStateManagerTest > shouldNotRemoveOngoingTransactionalIds
STARTED

kafka.coordinator.transaction.TransactionStateManagerTest > shouldNotRemoveOngoingTransactionalIds
PASSED

kafka.coordinator.transaction.TransactionStateManagerTest > testAddGetPids STARTED

kafka.coordinator.transaction.TransactionStateManagerTest > testAddGetPids PASSED

kafka.coordinator.transaction.TransactionStateManagerTest > shouldWriteTxnMarkersForTransactionInPreparedAbortState
STARTED

kafka.coordinator.transaction.TransactionStateManagerTest > shouldWriteTxnMarkersForTransactionInPreparedAbortState
PASSED

kafka.coordinator.transaction.TransactionStateManagerTest > shouldRemoveEmptyExpiredTransactionalIds
STARTED

kafka.coordinator.transaction.TransactionStateManagerTest > shouldRemoveEmptyExpiredTransactionalIds
PASSED

kafka.coordinator.transaction.TransactionStateManagerTest > testPendingStateNotResetOnRetryAppend
STARTED

kafka.coordinator.transaction.TransactionStateManagerTest > testPendingStateNotResetOnRetryAppend
PASSED

kafka.coordinator.transaction.TransactionStateManagerTest > shouldNotRemoveExpiredTransactionalIdsIfLogAppendFails
STARTED

kafka.coordinator.transaction.TransactionStateManagerTest > shouldNotRemoveExpiredTransactionalIdsIfLogAppendFails
PASSED

kafka.coordinator.transaction.TransactionStateManagerTest > shouldNotRemovePrepareAbortTransactionalIds
STARTED

kafka.coordinator.transaction.TransactionStateManagerTest > shouldNotRemovePrepareAbortTransactionalIds
PASSED

kafka.coordinator.transaction.TransactionStateManagerTest > shouldRemoveCompleteCommmitExpiredTransactionalIds
STARTED

kafka.coordinator.transaction.TransactionStateManagerTest > shouldRemoveCompleteCommmitExpiredTransactionalIds
PASSED

unit.kafka.admin.ResetConsumerGroupOffsetTest > testResetOffsetsShiftByHigherThanLatest
STARTED

unit.kafka.admin.ResetConsumerGroupOffsetTest > testResetOffsetsShiftByHigherThanLatest
PASSED

unit.kafka.admin.ResetConsumerGroupOffsetTest > testResetOffsetsShiftMinus STARTED

unit.kafka.admin.ResetConsumerGroupOffsetTest > testResetOffsetsShiftMinus PASSED

unit.kafka.admin.ResetConsumerGroupOffsetTest > testResetOffsetsToCurrentOffset STARTED

unit.kafka.admin.ResetConsumerGroupOffsetTest > testResetOffsetsToCurrentOffset PASSED

unit.kafka.admin.ResetConsumerGroupOffsetTest > testResetOffsetsToEarliestOnOneTopicAndPartition
STARTED

unit.kafka.admin.ResetConsumerGroupOffsetTest > testResetOffsetsToEarliestOnOneTopicAndPartition
PASSED

unit.kafka.admin.ResetConsumerGroupOffsetTest > testResetOffsetsByDurationToEarliest STARTED

unit.kafka.admin.ResetConsumerGroupOffsetTest > testResetOffsetsByDurationToEarliest PASSED

unit.kafka.admin.ResetConsumerGroupOffsetTest > testResetOffsetsToEarliestOnOneTopic STARTED

unit.kafka.admin.ResetConsumerGroupOffsetTest > testResetOffsetsToEarliestOnOneTopic PASSED

unit.kafka.admin.ResetConsumerGroupOffsetTest > testResetOffsetsNotExistingGroup STARTED

unit.kafka.admin.ResetConsumerGroupOffsetTest > testResetOffsetsNotExistingGroup PASSED

unit.kafka.admin.ResetConsumerGroupOffsetTest > testResetOffsetsToZonedDateTime STARTED

unit.kafka.admin.ResetConsumerGroupOffsetTest > testResetOffsetsToZonedDateTime PASSED

unit.kafka.admin.ResetConsumerGroupOffsetTest > testResetOffsetsToEarliest STARTED

unit.kafka.admin.ResetConsumerGroupOffsetTest > testResetOffsetsToEarliest PASSED

unit.kafka.admin.ResetConsumerGroupOffsetTest > testResetOffsetsExportImportPlan STARTED

unit.kafka.admin.ResetConsumerGroupOffsetTest > testResetOffsetsExportImportPlan PASSED

unit.kafka.admin.ResetConsumerGroupOffsetTest > testResetOffsetsToSpecificOffset STARTED

unit.kafka.admin.ResetConsumerGroupOffsetTest > testResetOffsetsToSpecificOffset PASSED

unit.kafka.admin.ResetConsumerGroupOffsetTest > testResetOffsetsShiftPlus STARTED

unit.kafka.admin.ResetConsumerGroupOffsetTest > testResetOffsetsShiftPlus PASSED

unit.kafka.admin.ResetConsumerGroupOffsetTest > testResetOffsetsToLatest STARTED

unit.kafka.admin.ResetConsumerGroupOffsetTest > testResetOffsetsToLatest PASSED

unit.kafka.admin.ResetConsumerGroupOffsetTest > testResetOffsetsNewConsumerExistingTopic
STARTED

unit.kafka.admin.ResetConsumerGroupOffsetTest > testResetOffsetsNewConsumerExistingTopic
PASSED

unit.kafka.admin.ResetConsumerGroupOffsetTest > testResetOffsetsShiftByLowerThanEarliest
STARTED

unit.kafka.admin.ResetConsumerGroupOffsetTest > testResetOffsetsShiftByLowerThanEarliest
PASSED

unit.kafka.admin.ResetConsumerGroupOffsetTest > testResetOffsetsByDuration STARTED

unit.kafka.admin.ResetConsumerGroupOffsetTest > testResetOffsetsByDuration PASSED

unit.kafka.admin.ResetConsumerGroupOffsetTest > testResetOffsetsToLocalDateTime STARTED

unit.kafka.admin.ResetConsumerGroupOffsetTest > testResetOffsetsToLocalDateTime PASSED

unit.kafka.admin.ResetConsumerGroupOffsetTest > testResetOffsetsToEarliestOnTopicsAndPartitions
STARTED

unit.kafka.admin.ResetConsumerGroupOffsetTest > testResetOffsetsToEarliestOnTopicsAndPartitions
PASSED

unit.kafka.admin.ResetConsumerGroupOffsetTest > testResetOffsetsToEarliestOnTopics STARTED

unit.kafka.admin.ResetConsumerGroupOffsetTest > testResetOffsetsToEarliestOnTopics PASSED

unit.kafka.server.KafkaApisTest > shouldRespondWithUnsupportedForMessageFormatOnHandleWriteTxnMarkersWhenMagicLowerThanRequired
STARTED

unit.kafka.server.KafkaApisTest > shouldRespondWithUnsupportedForMessageFormatOnHandleWriteTxnMarkersWhenMagicLowerThanRequired
PASSED

unit.kafka.server.KafkaApisTest > shouldThrowUnsupportedVersionExceptionOnHandleTxnOffsetCommitRequestWhenInterBrokerProtocolNotSupported
STARTED

unit.kafka.server.KafkaApisTest > shouldThrowUnsupportedVersionExceptionOnHandleTxnOffsetCommitRequestWhenInterBrokerProtocolNotSupported
PASSED

unit.kafka.server.KafkaApisTest > shouldThrowUnsupportedVersionExceptionOnHandleAddPartitionsToTxnRequestWhenInterBrokerProtocolNotSupported
STARTED

unit.kafka.server.KafkaApisTest > shouldThrowUnsupportedVersionExceptionOnHandleAddPartitionsToTxnRequestWhenInterBrokerProtocolNotSupported
PASSED

unit.kafka.server.KafkaApisTest > testReadUncommittedConsumerListOffsetLatest STARTED

unit.kafka.server.KafkaApisTest > testReadUncommittedConsumerListOffsetLatest PASSED

unit.kafka.server.KafkaApisTest > shouldAppendToLogOnWriteTxnMarkersWhenCorrectMagicVersion
STARTED

unit.kafka.server.KafkaApisTest > shouldAppendToLogOnWriteTxnMarkersWhenCorrectMagicVersion
PASSED

unit.kafka.server.KafkaApisTest > shouldThrowUnsupportedVersionExceptionOnHandleWriteTxnMarkersRequestWhenInterBrokerProtocolNotSupported
STARTED

unit.kafka.server.KafkaApisTest > shouldThrowUnsupportedVersionExceptionOnHandleWriteTxnMarkersRequestWhenInterBrokerProtocolNotSupported
PASSED

unit.kafka.server.KafkaApisTest > shouldRespondWithUnknownTopicWhenPartitionIsNotHosted
STARTED

unit.kafka.server.KafkaApisTest > shouldRespondWithUnknownTopicWhenPartitionIsNotHosted
PASSED

unit.kafka.server.KafkaApisTest > testReadCommittedConsumerListOffsetEarliestOffsetEqualsLastStableOffset
STARTED

unit.kafka.server.KafkaApisTest > testReadCommittedConsumerListOffsetEarliestOffsetEqualsLastStableOffset
PASSED

unit.kafka.server.KafkaApisTest > testReadCommittedConsumerListOffsetLatest STARTED

unit.kafka.server.KafkaApisTest > testReadCommittedConsumerListOffsetLatest PASSED

unit.kafka.server.KafkaApisTest > testReadCommittedConsumerListOffsetLimitedAtLastStableOffset
STARTED

unit.kafka.server.KafkaApisTest > testReadCommittedConsumerListOffsetLimitedAtLastStableOffset
PASSED

unit.kafka.server.KafkaApisTest > testReadUncommittedConsumerListOffsetEarliestOffsetEqualsHighWatermark
STARTED

unit.kafka.server.KafkaApisTest > testReadUncommittedConsumerListOffsetEarliestOffsetEqualsHighWatermark
PASSED

unit.kafka.server.KafkaApisTest > testReadUncommittedConsumerListOffsetLimitedAtHighWatermark
STARTED

unit.kafka.server.KafkaApisTest > testReadUncommittedConsumerListOffsetLimitedAtHighWatermark
PASSED

unit.kafka.server.KafkaApisTest > shouldThrowUnsupportedVersionExceptionOnHandleAddOffsetToTxnRequestWhenInterBrokerProtocolNotSupported
STARTED

unit.kafka.server.KafkaApisTest > shouldThrowUnsupportedVersionExceptionOnHandleAddOffsetToTxnRequestWhenInterBrokerProtocolNotSupported
PASSED

unit.kafka.server.KafkaApisTest > shouldRespondWithUnsupportedMessageFormatForBadPartitionAndNoErrorsForGoodPartition
STARTED

unit.kafka.server.KafkaApisTest > shouldRespondWithUnsupportedMessageFormatForBadPartitionAndNoErrorsForGoodPartition
PASSED

unit.kafka.server.KafkaApisTest > shouldThrowUnsupportedVersionExceptionOnHandleEndTxnRequestWhenInterBrokerProtocolNotSupported
STARTED

unit.kafka.server.KafkaApisTest > shouldThrowUnsupportedVersionExceptionOnHandleEndTxnRequestWhenInterBrokerProtocolNotSupported
PASSED

unit.kafka.server.KafkaApisTest > shouldRespondWithUnknownTopicOrPartitionForBadPartitionAndNoErrorsForGoodPartition
STARTED

unit.kafka.server.KafkaApisTest > shouldRespondWithUnknownTopicOrPartitionForBadPartitionAndNoErrorsForGoodPartition
PASSED

1546 tests completed, 1 failed, 4 skipped
:kafka-trunk-jdk7:core:test FAILED
:test_core_2_11 FAILED

FAILURE: Build failed with an exception.

* What went wrong:
Execution failed for task ':kafka-trunk-jdk7:core:test'.
> There were failing tests. See the report at: file://<https://builds.apache.org/job/kafka-trunk-jdk7/ws/core/build/reports/tests/test/index.html>

* Try:
Run with --stacktrace option to get the stack trace. Run with --info or --debug option to
get more log output.

* Get more help at https://help.gradle.org

BUILD FAILED in 44m 30s
16 actionable tasks: 13 executed, 3 up-to-date
Build step 'Execute shell' marked build as failure
[FINDBUGS] Collecting findbugs analysis files...
Setting GRADLE_3_4_RC_2_HOME=/home/jenkins/jenkins-slave/tools/hudson.plugins.gradle.GradleInstallation/Gradle_3.4-rc-2
[FINDBUGS] Searching for all files in <https://builds.apache.org/job/kafka-trunk-jdk7/ws/>
that match the pattern **/build/reports/findbugs/*.xml
[FINDBUGS] Parsing 1 file in <https://builds.apache.org/job/kafka-trunk-jdk7/ws/>
[FINDBUGS] Successfully parsed file <https://builds.apache.org/job/kafka-trunk-jdk7/ws/core/build/reports/findbugs/main.xml>
with 0 unique warnings and 0 duplicates.
Setting GRADLE_3_4_RC_2_HOME=/home/jenkins/jenkins-slave/tools/hudson.plugins.gradle.GradleInstallation/Gradle_3.4-rc-2
Setting GRADLE_3_4_RC_2_HOME=/home/jenkins/jenkins-slave/tools/hudson.plugins.gradle.GradleInstallation/Gradle_3.4-rc-2
<Git Blamer> Using GitBlamer to create author and commit information for all warnings.
<Git Blamer> GIT_COMMIT=a4720b25a372790b26a0b00fa18eb78f830b1311, workspace=<https://builds.apache.org/job/kafka-trunk-jdk7/ws/>
[FINDBUGS] Computing warning deltas based on reference build #2649
Recording test results
Setting GRADLE_3_4_RC_2_HOME=/home/jenkins/jenkins-slave/tools/hudson.plugins.gradle.GradleInstallation/Gradle_3.4-rc-2
Setting GRADLE_3_4_RC_2_HOME=/home/jenkins/jenkins-slave/tools/hudson.plugins.gradle.GradleInstallation/Gradle_3.4-rc-2
Not sending mail to unregistered user ismael@juma.me.uk

Mime
View raw message