kafka-dev mailing list archives

Site index · List index
Message view « Date » · « Thread »
Top « Date » · « Thread »
From Apache Jenkins Server <jenk...@builds.apache.org>
Subject Build failed in Jenkins: kafka-trunk-jdk7 #2621
Date Wed, 09 Aug 2017 17:08:41 GMT
See <https://builds.apache.org/job/kafka-trunk-jdk7/2621/display/redirect?page=changes>

Changes:

[me] MINOR: Standardize logging of Worker-level messages from Tasks and

------------------------------------------
[...truncated 1.97 MB...]
org.apache.kafka.common.header.internals.RecordHeadersTest > testLastHeader PASSED

org.apache.kafka.common.header.internals.RecordHeadersTest > testRemove STARTED

org.apache.kafka.common.header.internals.RecordHeadersTest > testRemove PASSED

org.apache.kafka.common.header.internals.RecordHeadersTest > testAddRemoveInterleaved STARTED

org.apache.kafka.common.header.internals.RecordHeadersTest > testAddRemoveInterleaved PASSED

org.apache.kafka.common.ClusterTest > testBootstrap STARTED

org.apache.kafka.common.ClusterTest > testBootstrap PASSED

org.apache.kafka.common.cache.LRUCacheTest > testEviction STARTED

org.apache.kafka.common.cache.LRUCacheTest > testEviction PASSED

org.apache.kafka.common.cache.LRUCacheTest > testPutGet STARTED

org.apache.kafka.common.cache.LRUCacheTest > testPutGet PASSED

org.apache.kafka.common.cache.LRUCacheTest > testRemove STARTED

org.apache.kafka.common.cache.LRUCacheTest > testRemove PASSED

org.apache.kafka.common.utils.ShellTest > testEchoHello STARTED

org.apache.kafka.common.utils.ShellTest > testEchoHello PASSED

org.apache.kafka.common.utils.ShellTest > testHeadDevZero STARTED

org.apache.kafka.common.utils.ShellTest > testHeadDevZero PASSED

org.apache.kafka.common.utils.UtilsTest > testAbs STARTED

org.apache.kafka.common.utils.UtilsTest > testAbs PASSED

org.apache.kafka.common.utils.UtilsTest > testMin STARTED

org.apache.kafka.common.utils.UtilsTest > testMin PASSED

org.apache.kafka.common.utils.UtilsTest > toArray STARTED

org.apache.kafka.common.utils.UtilsTest > toArray PASSED

org.apache.kafka.common.utils.UtilsTest > utf8ByteBufferSerde STARTED

org.apache.kafka.common.utils.UtilsTest > utf8ByteBufferSerde PASSED

org.apache.kafka.common.utils.UtilsTest > testJoin STARTED

org.apache.kafka.common.utils.UtilsTest > testJoin PASSED

org.apache.kafka.common.utils.UtilsTest > testReadFullyOrFailWithPartialFileChannelReads
STARTED

org.apache.kafka.common.utils.UtilsTest > testReadFullyOrFailWithPartialFileChannelReads
PASSED

org.apache.kafka.common.utils.UtilsTest > toArrayDirectByteBuffer STARTED

org.apache.kafka.common.utils.UtilsTest > toArrayDirectByteBuffer PASSED

org.apache.kafka.common.utils.UtilsTest > testReadBytes STARTED

org.apache.kafka.common.utils.UtilsTest > testReadBytes PASSED

org.apache.kafka.common.utils.UtilsTest > testGetHost STARTED

org.apache.kafka.common.utils.UtilsTest > testGetHost PASSED

org.apache.kafka.common.utils.UtilsTest > testGetPort STARTED

org.apache.kafka.common.utils.UtilsTest > testGetPort PASSED

org.apache.kafka.common.utils.UtilsTest > testReadFullyWithPartialFileChannelReads STARTED

org.apache.kafka.common.utils.UtilsTest > testReadFullyWithPartialFileChannelReads PASSED

org.apache.kafka.common.utils.UtilsTest > testRecursiveDelete STARTED

org.apache.kafka.common.utils.UtilsTest > testRecursiveDelete PASSED

org.apache.kafka.common.utils.UtilsTest > testReadFullyOrFailWithRealFile STARTED

org.apache.kafka.common.utils.UtilsTest > testReadFullyOrFailWithRealFile PASSED

org.apache.kafka.common.utils.UtilsTest > writeToBuffer STARTED

org.apache.kafka.common.utils.UtilsTest > writeToBuffer PASSED

org.apache.kafka.common.utils.UtilsTest > testReadFullyIfEofIsReached STARTED

org.apache.kafka.common.utils.UtilsTest > testReadFullyIfEofIsReached PASSED

org.apache.kafka.common.utils.UtilsTest > testFormatBytes STARTED

org.apache.kafka.common.utils.UtilsTest > testFormatBytes PASSED

org.apache.kafka.common.utils.UtilsTest > utf8ByteArraySerde STARTED

org.apache.kafka.common.utils.UtilsTest > utf8ByteArraySerde PASSED

org.apache.kafka.common.utils.UtilsTest > testCloseAll STARTED

org.apache.kafka.common.utils.UtilsTest > testCloseAll PASSED

org.apache.kafka.common.utils.UtilsTest > testFormatAddress STARTED

org.apache.kafka.common.utils.UtilsTest > testFormatAddress PASSED

org.apache.kafka.common.utils.JavaTest > testLoadKerberosLoginModule STARTED

org.apache.kafka.common.utils.JavaTest > testLoadKerberosLoginModule PASSED

org.apache.kafka.common.utils.JavaTest > testIsIBMJdk STARTED

org.apache.kafka.common.utils.JavaTest > testIsIBMJdk PASSED

org.apache.kafka.common.utils.ChecksumsTest > testUpdateInt STARTED

org.apache.kafka.common.utils.ChecksumsTest > testUpdateInt PASSED

org.apache.kafka.common.utils.ChecksumsTest > testUpdateLong STARTED

org.apache.kafka.common.utils.ChecksumsTest > testUpdateLong PASSED

org.apache.kafka.common.utils.ChecksumsTest > testUpdateByteBufferWithOffsetPosition STARTED

org.apache.kafka.common.utils.ChecksumsTest > testUpdateByteBufferWithOffsetPosition PASSED

org.apache.kafka.common.utils.ChecksumsTest > testUpdateByteBuffer STARTED

org.apache.kafka.common.utils.ChecksumsTest > testUpdateByteBuffer PASSED

org.apache.kafka.common.utils.ByteUtilsTest > testInvalidVarlong STARTED

org.apache.kafka.common.utils.ByteUtilsTest > testInvalidVarlong PASSED

org.apache.kafka.common.utils.ByteUtilsTest > testVarlongSerde STARTED

org.apache.kafka.common.utils.ByteUtilsTest > testVarlongSerde PASSED

org.apache.kafka.common.utils.ByteUtilsTest > testReadUnsignedInt STARTED

org.apache.kafka.common.utils.ByteUtilsTest > testReadUnsignedInt PASSED

org.apache.kafka.common.utils.ByteUtilsTest > testWriteUnsignedIntLEToArray STARTED

org.apache.kafka.common.utils.ByteUtilsTest > testWriteUnsignedIntLEToArray PASSED

org.apache.kafka.common.utils.ByteUtilsTest > testInvalidVarint STARTED

org.apache.kafka.common.utils.ByteUtilsTest > testInvalidVarint PASSED

org.apache.kafka.common.utils.ByteUtilsTest > testVarintSerde STARTED

org.apache.kafka.common.utils.ByteUtilsTest > testVarintSerde PASSED

org.apache.kafka.common.utils.ByteUtilsTest > testReadUnsignedIntLEFromArray STARTED

org.apache.kafka.common.utils.ByteUtilsTest > testReadUnsignedIntLEFromArray PASSED

org.apache.kafka.common.utils.ByteUtilsTest > testReadUnsignedIntLEFromInputStream STARTED

org.apache.kafka.common.utils.ByteUtilsTest > testReadUnsignedIntLEFromInputStream PASSED

org.apache.kafka.common.utils.ByteUtilsTest > testWriteUnsignedIntLEToOutputStream STARTED

org.apache.kafka.common.utils.ByteUtilsTest > testWriteUnsignedIntLEToOutputStream PASSED

org.apache.kafka.common.utils.Crc32CTest > testValue STARTED

org.apache.kafka.common.utils.Crc32CTest > testValue PASSED

org.apache.kafka.common.utils.Crc32CTest > testUpdate STARTED

org.apache.kafka.common.utils.Crc32CTest > testUpdate PASSED

org.apache.kafka.common.utils.AbstractIteratorTest > testEmptyIterator STARTED

org.apache.kafka.common.utils.AbstractIteratorTest > testEmptyIterator PASSED

org.apache.kafka.common.utils.AbstractIteratorTest > testIterator STARTED

org.apache.kafka.common.utils.AbstractIteratorTest > testIterator PASSED

org.apache.kafka.common.utils.Crc32Test > testValue STARTED

org.apache.kafka.common.utils.Crc32Test > testValue PASSED

org.apache.kafka.common.utils.Crc32Test > testUpdate STARTED

org.apache.kafka.common.utils.Crc32Test > testUpdate PASSED

org.apache.kafka.common.utils.ByteBufferOutputStreamTest > testExpandByteBufferOnWrite
STARTED

org.apache.kafka.common.utils.ByteBufferOutputStreamTest > testExpandByteBufferOnWrite
PASSED

org.apache.kafka.common.utils.ByteBufferOutputStreamTest > testWriteDirectByteBuffer STARTED

org.apache.kafka.common.utils.ByteBufferOutputStreamTest > testWriteDirectByteBuffer PASSED

org.apache.kafka.common.utils.ByteBufferOutputStreamTest > testExpandDirectByteBufferOnWrite
STARTED

org.apache.kafka.common.utils.ByteBufferOutputStreamTest > testExpandDirectByteBufferOnWrite
PASSED

org.apache.kafka.common.utils.ByteBufferOutputStreamTest > testWriteByteBuffer STARTED

org.apache.kafka.common.utils.ByteBufferOutputStreamTest > testWriteByteBuffer PASSED

org.apache.kafka.common.utils.ByteBufferOutputStreamTest > testExpandByteBufferOnPositionIncrease
STARTED

org.apache.kafka.common.utils.ByteBufferOutputStreamTest > testExpandByteBufferOnPositionIncrease
PASSED

org.apache.kafka.common.utils.ByteBufferOutputStreamTest > testExpandDirectByteBufferOnPositionIncrease
STARTED

org.apache.kafka.common.utils.ByteBufferOutputStreamTest > testExpandDirectByteBufferOnPositionIncrease
PASSED

3896 tests completed, 1 failed
:clients:test FAILED

FAILURE: Build failed with an exception.

* What went wrong:
Execution failed for task ':clients:test'.
> There were failing tests. See the report at: file://<https://builds.apache.org/job/kafka-trunk-jdk7/ws/clients/build/reports/tests/test/index.html>

* Try:
Run with --stacktrace option to get the stack trace. Run with --info or --debug option to
get more log output.

* Get more help at https://help.gradle.org

BUILD FAILED in 59m 40s
23 actionable tasks: 17 executed, 6 up-to-date
Build step 'Execute shell' marked build as failure
[FINDBUGS] Collecting findbugs analysis files...
Setting GRADLE_3_4_RC_2_HOME=/home/jenkins/jenkins-slave/tools/hudson.plugins.gradle.GradleInstallation/Gradle_3.4-rc-2
[FINDBUGS] Searching for all files in <https://builds.apache.org/job/kafka-trunk-jdk7/ws/>
that match the pattern **/build/reports/findbugs/*.xml
[FINDBUGS] Parsing 2 files in <https://builds.apache.org/job/kafka-trunk-jdk7/ws/>
[FINDBUGS] Successfully parsed file <https://builds.apache.org/job/kafka-trunk-jdk7/ws/clients/build/reports/findbugs/main.xml>
with 0 unique warnings and 0 duplicates.
[FINDBUGS] Successfully parsed file <https://builds.apache.org/job/kafka-trunk-jdk7/ws/core/build/reports/findbugs/main.xml>
with 0 unique warnings and 0 duplicates.
Setting GRADLE_3_4_RC_2_HOME=/home/jenkins/jenkins-slave/tools/hudson.plugins.gradle.GradleInstallation/Gradle_3.4-rc-2
Setting GRADLE_3_4_RC_2_HOME=/home/jenkins/jenkins-slave/tools/hudson.plugins.gradle.GradleInstallation/Gradle_3.4-rc-2
<Git Blamer> Using GitBlamer to create author and commit information for all warnings.
<Git Blamer> GIT_COMMIT=a593db6a2b6c3511215008b6d3dd6bd77f84e8c4, workspace=<https://builds.apache.org/job/kafka-trunk-jdk7/ws/>
[FINDBUGS] Computing warning deltas based on reference build #2620
Recording test results
Setting GRADLE_3_4_RC_2_HOME=/home/jenkins/jenkins-slave/tools/hudson.plugins.gradle.GradleInstallation/Gradle_3.4-rc-2
Setting GRADLE_3_4_RC_2_HOME=/home/jenkins/jenkins-slave/tools/hudson.plugins.gradle.GradleInstallation/Gradle_3.4-rc-2

Mime
View raw message