kafka-dev mailing list archives

Site index · List index
Message view « Date » · « Thread »
Top « Date » · « Thread »
From Apache Jenkins Server <jenk...@builds.apache.org>
Subject Build failed in Jenkins: kafka-trunk-jdk8 #1907
Date Mon, 14 Aug 2017 14:52:25 GMT
See <https://builds.apache.org/job/kafka-trunk-jdk8/1907/display/redirect?page=changes>

Changes:

[ismael] MINOR: Safer handling of requests prior to SASL authentication

------------------------------------------
[...truncated 913.07 KB...]

kafka.producer.AsyncProducerTest > testInvalidConfiguration PASSED

kafka.producer.AsyncProducerTest > testInvalidPartition STARTED

kafka.producer.AsyncProducerTest > testInvalidPartition PASSED

kafka.producer.AsyncProducerTest > testNoBroker STARTED

kafka.producer.AsyncProducerTest > testNoBroker PASSED

kafka.producer.AsyncProducerTest > testProduceAfterClosed STARTED

kafka.producer.AsyncProducerTest > testProduceAfterClosed PASSED

kafka.producer.AsyncProducerTest > testJavaProducer STARTED

kafka.producer.AsyncProducerTest > testJavaProducer PASSED

kafka.producer.AsyncProducerTest > testIncompatibleEncoder STARTED

kafka.producer.AsyncProducerTest > testIncompatibleEncoder PASSED

kafka.producer.SyncProducerTest > testReachableServer STARTED

kafka.producer.SyncProducerTest > testReachableServer PASSED

kafka.producer.SyncProducerTest > testMessageSizeTooLarge STARTED

kafka.producer.SyncProducerTest > testMessageSizeTooLarge PASSED

kafka.producer.SyncProducerTest > testNotEnoughReplicas STARTED

kafka.producer.SyncProducerTest > testNotEnoughReplicas PASSED

kafka.producer.SyncProducerTest > testMessageSizeTooLargeWithAckZero STARTED

kafka.producer.SyncProducerTest > testMessageSizeTooLargeWithAckZero PASSED

kafka.producer.SyncProducerTest > testProducerCanTimeout STARTED

kafka.producer.SyncProducerTest > testProducerCanTimeout PASSED

kafka.producer.SyncProducerTest > testProduceRequestWithNoResponse STARTED

kafka.producer.SyncProducerTest > testProduceRequestWithNoResponse PASSED

kafka.producer.SyncProducerTest > testEmptyProduceRequest STARTED

kafka.producer.SyncProducerTest > testEmptyProduceRequest PASSED

kafka.producer.SyncProducerTest > testProduceCorrectlyReceivesResponse STARTED

kafka.producer.SyncProducerTest > testProduceCorrectlyReceivesResponse PASSED

kafka.producer.ProducerTest > testSendToNewTopic STARTED

kafka.producer.ProducerTest > testSendToNewTopic PASSED

kafka.producer.ProducerTest > testAsyncSendCanCorrectlyFailWithTimeout STARTED

kafka.producer.ProducerTest > testAsyncSendCanCorrectlyFailWithTimeout PASSED

kafka.producer.ProducerTest > testSendNullMessage STARTED

kafka.producer.ProducerTest > testSendNullMessage PASSED

kafka.producer.ProducerTest > testUpdateBrokerPartitionInfo STARTED

kafka.producer.ProducerTest > testUpdateBrokerPartitionInfo PASSED

kafka.producer.ProducerTest > testSendWithDeadBroker STARTED

kafka.producer.ProducerTest > testSendWithDeadBroker PASSED

unit.kafka.server.KafkaApisTest > shouldRespondWithUnsupportedForMessageFormatOnHandleWriteTxnMarkersWhenMagicLowerThanRequired
STARTED

unit.kafka.server.KafkaApisTest > shouldRespondWithUnsupportedForMessageFormatOnHandleWriteTxnMarkersWhenMagicLowerThanRequired
PASSED

unit.kafka.server.KafkaApisTest > shouldThrowUnsupportedVersionExceptionOnHandleTxnOffsetCommitRequestWhenInterBrokerProtocolNotSupported
STARTED

unit.kafka.server.KafkaApisTest > shouldThrowUnsupportedVersionExceptionOnHandleTxnOffsetCommitRequestWhenInterBrokerProtocolNotSupported
PASSED

unit.kafka.server.KafkaApisTest > shouldThrowUnsupportedVersionExceptionOnHandleAddPartitionsToTxnRequestWhenInterBrokerProtocolNotSupported
STARTED

unit.kafka.server.KafkaApisTest > shouldThrowUnsupportedVersionExceptionOnHandleAddPartitionsToTxnRequestWhenInterBrokerProtocolNotSupported
PASSED

unit.kafka.server.KafkaApisTest > testReadUncommittedConsumerListOffsetLatest STARTED

unit.kafka.server.KafkaApisTest > testReadUncommittedConsumerListOffsetLatest PASSED

unit.kafka.server.KafkaApisTest > shouldAppendToLogOnWriteTxnMarkersWhenCorrectMagicVersion
STARTED

unit.kafka.server.KafkaApisTest > shouldAppendToLogOnWriteTxnMarkersWhenCorrectMagicVersion
PASSED

unit.kafka.server.KafkaApisTest > shouldThrowUnsupportedVersionExceptionOnHandleWriteTxnMarkersRequestWhenInterBrokerProtocolNotSupported
STARTED

unit.kafka.server.KafkaApisTest > shouldThrowUnsupportedVersionExceptionOnHandleWriteTxnMarkersRequestWhenInterBrokerProtocolNotSupported
PASSED

unit.kafka.server.KafkaApisTest > shouldRespondWithUnknownTopicWhenPartitionIsNotHosted
STARTED

unit.kafka.server.KafkaApisTest > shouldRespondWithUnknownTopicWhenPartitionIsNotHosted
PASSED

unit.kafka.server.KafkaApisTest > testReadCommittedConsumerListOffsetEarliestOffsetEqualsLastStableOffset
STARTED

unit.kafka.server.KafkaApisTest > testReadCommittedConsumerListOffsetEarliestOffsetEqualsLastStableOffset
PASSED

unit.kafka.server.KafkaApisTest > testReadCommittedConsumerListOffsetLatest STARTED

unit.kafka.server.KafkaApisTest > testReadCommittedConsumerListOffsetLatest PASSED

unit.kafka.server.KafkaApisTest > testReadCommittedConsumerListOffsetLimitedAtLastStableOffset
STARTED

unit.kafka.server.KafkaApisTest > testReadCommittedConsumerListOffsetLimitedAtLastStableOffset
PASSED

unit.kafka.server.KafkaApisTest > testReadUncommittedConsumerListOffsetEarliestOffsetEqualsHighWatermark
STARTED

unit.kafka.server.KafkaApisTest > testReadUncommittedConsumerListOffsetEarliestOffsetEqualsHighWatermark
PASSED

unit.kafka.server.KafkaApisTest > testReadUncommittedConsumerListOffsetLimitedAtHighWatermark
STARTED

unit.kafka.server.KafkaApisTest > testReadUncommittedConsumerListOffsetLimitedAtHighWatermark
PASSED

unit.kafka.server.KafkaApisTest > shouldThrowUnsupportedVersionExceptionOnHandleAddOffsetToTxnRequestWhenInterBrokerProtocolNotSupported
STARTED

unit.kafka.server.KafkaApisTest > shouldThrowUnsupportedVersionExceptionOnHandleAddOffsetToTxnRequestWhenInterBrokerProtocolNotSupported
PASSED

unit.kafka.server.KafkaApisTest > shouldRespondWithUnsupportedMessageFormatForBadPartitionAndNoErrorsForGoodPartition
STARTED

unit.kafka.server.KafkaApisTest > shouldRespondWithUnsupportedMessageFormatForBadPartitionAndNoErrorsForGoodPartition
PASSED

unit.kafka.server.KafkaApisTest > shouldThrowUnsupportedVersionExceptionOnHandleEndTxnRequestWhenInterBrokerProtocolNotSupported
STARTED

unit.kafka.server.KafkaApisTest > shouldThrowUnsupportedVersionExceptionOnHandleEndTxnRequestWhenInterBrokerProtocolNotSupported
PASSED

unit.kafka.server.KafkaApisTest > shouldRespondWithUnknownTopicOrPartitionForBadPartitionAndNoErrorsForGoodPartition
STARTED

unit.kafka.server.KafkaApisTest > shouldRespondWithUnknownTopicOrPartitionForBadPartitionAndNoErrorsForGoodPartition
PASSED

unit.kafka.admin.ResetConsumerGroupOffsetTest > testResetOffsetsShiftByHigherThanLatest
STARTED

unit.kafka.admin.ResetConsumerGroupOffsetTest > testResetOffsetsShiftByHigherThanLatest
PASSED

unit.kafka.admin.ResetConsumerGroupOffsetTest > testResetOffsetsShiftMinus STARTED

unit.kafka.admin.ResetConsumerGroupOffsetTest > testResetOffsetsShiftMinus PASSED

unit.kafka.admin.ResetConsumerGroupOffsetTest > testResetOffsetsToCurrentOffset STARTED

unit.kafka.admin.ResetConsumerGroupOffsetTest > testResetOffsetsToCurrentOffset PASSED

unit.kafka.admin.ResetConsumerGroupOffsetTest > testResetOffsetsToEarliestOnOneTopicAndPartition
STARTED

unit.kafka.admin.ResetConsumerGroupOffsetTest > testResetOffsetsToEarliestOnOneTopicAndPartition
PASSED

unit.kafka.admin.ResetConsumerGroupOffsetTest > testResetOffsetsByDurationToEarliest STARTED

unit.kafka.admin.ResetConsumerGroupOffsetTest > testResetOffsetsByDurationToEarliest PASSED

unit.kafka.admin.ResetConsumerGroupOffsetTest > testResetOffsetsToEarliestOnOneTopic STARTED

unit.kafka.admin.ResetConsumerGroupOffsetTest > testResetOffsetsToEarliestOnOneTopic PASSED

unit.kafka.admin.ResetConsumerGroupOffsetTest > testResetOffsetsNotExistingGroup STARTED

unit.kafka.admin.ResetConsumerGroupOffsetTest > testResetOffsetsNotExistingGroup PASSED

unit.kafka.admin.ResetConsumerGroupOffsetTest > testResetOffsetsToZonedDateTime STARTED

unit.kafka.admin.ResetConsumerGroupOffsetTest > testResetOffsetsToZonedDateTime PASSED

unit.kafka.admin.ResetConsumerGroupOffsetTest > testResetOffsetsToEarliest STARTED

unit.kafka.admin.ResetConsumerGroupOffsetTest > testResetOffsetsToEarliest PASSED

unit.kafka.admin.ResetConsumerGroupOffsetTest > testResetOffsetsExportImportPlan STARTED

unit.kafka.admin.ResetConsumerGroupOffsetTest > testResetOffsetsExportImportPlan PASSED

unit.kafka.admin.ResetConsumerGroupOffsetTest > testResetOffsetsToSpecificOffset STARTED

unit.kafka.admin.ResetConsumerGroupOffsetTest > testResetOffsetsToSpecificOffset PASSED

unit.kafka.admin.ResetConsumerGroupOffsetTest > testResetOffsetsShiftPlus STARTED

unit.kafka.admin.ResetConsumerGroupOffsetTest > testResetOffsetsShiftPlus PASSED

unit.kafka.admin.ResetConsumerGroupOffsetTest > testResetOffsetsToLatest STARTED

unit.kafka.admin.ResetConsumerGroupOffsetTest > testResetOffsetsToLatest PASSED

unit.kafka.admin.ResetConsumerGroupOffsetTest > testResetOffsetsNewConsumerExistingTopic
STARTED

unit.kafka.admin.ResetConsumerGroupOffsetTest > testResetOffsetsNewConsumerExistingTopic
PASSED

unit.kafka.admin.ResetConsumerGroupOffsetTest > testResetOffsetsShiftByLowerThanEarliest
STARTED

unit.kafka.admin.ResetConsumerGroupOffsetTest > testResetOffsetsShiftByLowerThanEarliest
PASSED

unit.kafka.admin.ResetConsumerGroupOffsetTest > testResetOffsetsByDuration STARTED

unit.kafka.admin.ResetConsumerGroupOffsetTest > testResetOffsetsByDuration PASSED

unit.kafka.admin.ResetConsumerGroupOffsetTest > testResetOffsetsToLocalDateTime STARTED

unit.kafka.admin.ResetConsumerGroupOffsetTest > testResetOffsetsToLocalDateTime PASSED

unit.kafka.admin.ResetConsumerGroupOffsetTest > testResetOffsetsToEarliestOnTopicsAndPartitions
STARTED

unit.kafka.admin.ResetConsumerGroupOffsetTest > testResetOffsetsToEarliestOnTopicsAndPartitions
PASSED

unit.kafka.admin.ResetConsumerGroupOffsetTest > testResetOffsetsToEarliestOnTopics STARTED

unit.kafka.admin.ResetConsumerGroupOffsetTest > testResetOffsetsToEarliestOnTopics PASSED

1539 tests completed, 1 failed, 4 skipped
:kafka-trunk-jdk8:core:test FAILED
:test_core_2_11 FAILED

FAILURE: Build failed with an exception.

* What went wrong:
Execution failed for task ':kafka-trunk-jdk8:core:test'.
> There were failing tests. See the report at: file://<https://builds.apache.org/job/kafka-trunk-jdk8/ws/core/build/reports/tests/test/index.html>

* Try:
Run with --stacktrace option to get the stack trace. Run with --info or --debug option to
get more log output.

* Get more help at https://help.gradle.org

BUILD FAILED in 53m 33s
16 actionable tasks: 3 executed, 13 up-to-date
Build step 'Execute shell' marked build as failure
[FINDBUGS] Collecting findbugs analysis files...
Setting GRADLE_3_4_RC_2_HOME=/home/jenkins/jenkins-slave/tools/hudson.plugins.gradle.GradleInstallation/Gradle_3.4-rc-2
[FINDBUGS] Searching for all files in <https://builds.apache.org/job/kafka-trunk-jdk8/ws/>
that match the pattern **/build/reports/findbugs/*.xml
[FINDBUGS] Parsing 1 file in <https://builds.apache.org/job/kafka-trunk-jdk8/ws/>
[FINDBUGS] Successfully parsed file <https://builds.apache.org/job/kafka-trunk-jdk8/ws/core/build/reports/findbugs/main.xml>
with 0 unique warnings and 0 duplicates.
Setting GRADLE_3_4_RC_2_HOME=/home/jenkins/jenkins-slave/tools/hudson.plugins.gradle.GradleInstallation/Gradle_3.4-rc-2
Setting GRADLE_3_4_RC_2_HOME=/home/jenkins/jenkins-slave/tools/hudson.plugins.gradle.GradleInstallation/Gradle_3.4-rc-2
<Git Blamer> Using GitBlamer to create author and commit information for all warnings.
<Git Blamer> GIT_COMMIT=8265a43897b3da88839df061ce22559820087ad9, workspace=<https://builds.apache.org/job/kafka-trunk-jdk8/ws/>
[FINDBUGS] Computing warning deltas based on reference build #1900
Recording test results
Setting GRADLE_3_4_RC_2_HOME=/home/jenkins/jenkins-slave/tools/hudson.plugins.gradle.GradleInstallation/Gradle_3.4-rc-2
Setting GRADLE_3_4_RC_2_HOME=/home/jenkins/jenkins-slave/tools/hudson.plugins.gradle.GradleInstallation/Gradle_3.4-rc-2
Not sending mail to unregistered user ismael@juma.me.uk
Not sending mail to unregistered user wangguoz@gmail.com
Not sending mail to unregistered user damian.guy@gmail.com

Mime
View raw message