kafka-dev mailing list archives

Site index · List index
Message view « Date » · « Thread »
Top « Date » · « Thread »
From Apache Jenkins Server <jenk...@builds.apache.org>
Subject Build failed in Jenkins: kafka-trunk-jdk7 #2591
Date Tue, 01 Aug 2017 18:37:29 GMT
See <https://builds.apache.org/job/kafka-trunk-jdk7/2591/display/redirect?page=changes>

Changes:

[jason] MINOR: Request log should be enabled by debug level

------------------------------------------
[...truncated 1.01 MB...]
kafka.log.ProducerStateManagerTest > testSkipSnapshotIfOffsetUnchanged PASSED

kafka.log.BrokerCompressionTest > testBrokerSideCompression[0] STARTED

kafka.log.BrokerCompressionTest > testBrokerSideCompression[0] PASSED

kafka.log.BrokerCompressionTest > testBrokerSideCompression[1] STARTED

kafka.log.BrokerCompressionTest > testBrokerSideCompression[1] PASSED

kafka.log.BrokerCompressionTest > testBrokerSideCompression[2] STARTED

kafka.log.BrokerCompressionTest > testBrokerSideCompression[2] PASSED

kafka.log.BrokerCompressionTest > testBrokerSideCompression[3] STARTED

kafka.log.BrokerCompressionTest > testBrokerSideCompression[3] PASSED

kafka.log.BrokerCompressionTest > testBrokerSideCompression[4] STARTED

kafka.log.BrokerCompressionTest > testBrokerSideCompression[4] PASSED

kafka.log.BrokerCompressionTest > testBrokerSideCompression[5] STARTED

kafka.log.BrokerCompressionTest > testBrokerSideCompression[5] PASSED

kafka.log.BrokerCompressionTest > testBrokerSideCompression[6] STARTED

kafka.log.BrokerCompressionTest > testBrokerSideCompression[6] PASSED

kafka.log.BrokerCompressionTest > testBrokerSideCompression[7] STARTED

kafka.log.BrokerCompressionTest > testBrokerSideCompression[7] PASSED

kafka.log.BrokerCompressionTest > testBrokerSideCompression[8] STARTED

kafka.log.BrokerCompressionTest > testBrokerSideCompression[8] PASSED

kafka.log.BrokerCompressionTest > testBrokerSideCompression[9] STARTED

kafka.log.BrokerCompressionTest > testBrokerSideCompression[9] PASSED

kafka.log.BrokerCompressionTest > testBrokerSideCompression[10] STARTED

kafka.log.BrokerCompressionTest > testBrokerSideCompression[10] PASSED

kafka.log.BrokerCompressionTest > testBrokerSideCompression[11] STARTED

kafka.log.BrokerCompressionTest > testBrokerSideCompression[11] PASSED

kafka.log.BrokerCompressionTest > testBrokerSideCompression[12] STARTED

kafka.log.BrokerCompressionTest > testBrokerSideCompression[12] PASSED

kafka.log.BrokerCompressionTest > testBrokerSideCompression[13] STARTED

kafka.log.BrokerCompressionTest > testBrokerSideCompression[13] PASSED

kafka.log.BrokerCompressionTest > testBrokerSideCompression[14] STARTED

kafka.log.BrokerCompressionTest > testBrokerSideCompression[14] PASSED

kafka.log.BrokerCompressionTest > testBrokerSideCompression[15] STARTED

kafka.log.BrokerCompressionTest > testBrokerSideCompression[15] PASSED

kafka.log.BrokerCompressionTest > testBrokerSideCompression[16] STARTED

kafka.log.BrokerCompressionTest > testBrokerSideCompression[16] PASSED

kafka.log.BrokerCompressionTest > testBrokerSideCompression[17] STARTED

kafka.log.BrokerCompressionTest > testBrokerSideCompression[17] PASSED

kafka.log.BrokerCompressionTest > testBrokerSideCompression[18] STARTED

kafka.log.BrokerCompressionTest > testBrokerSideCompression[18] PASSED

kafka.log.BrokerCompressionTest > testBrokerSideCompression[19] STARTED

kafka.log.BrokerCompressionTest > testBrokerSideCompression[19] PASSED

kafka.log.LogCleanerIntegrationTest > testCleansCombinedCompactAndDeleteTopic[0] STARTED

kafka.log.LogCleanerIntegrationTest > testCleansCombinedCompactAndDeleteTopic[0] PASSED

kafka.log.LogCleanerIntegrationTest > testCleaningNestedMessagesWithMultipleVersions[0]
STARTED

kafka.log.LogCleanerIntegrationTest > testCleaningNestedMessagesWithMultipleVersions[0]
PASSED

kafka.log.LogCleanerIntegrationTest > cleanerTest[0] STARTED

kafka.log.LogCleanerIntegrationTest > cleanerTest[0] PASSED

kafka.log.LogCleanerIntegrationTest > testCleanerWithMessageFormatV0[0] STARTED

kafka.log.LogCleanerIntegrationTest > testCleanerWithMessageFormatV0[0] PASSED

kafka.log.LogCleanerIntegrationTest > testCleansCombinedCompactAndDeleteTopic[1] STARTED

kafka.log.LogCleanerIntegrationTest > testCleansCombinedCompactAndDeleteTopic[1] PASSED

kafka.log.LogCleanerIntegrationTest > testCleaningNestedMessagesWithMultipleVersions[1]
STARTED

kafka.log.LogCleanerIntegrationTest > testCleaningNestedMessagesWithMultipleVersions[1]
PASSED

kafka.log.LogCleanerIntegrationTest > cleanerTest[1] STARTED

kafka.log.LogCleanerIntegrationTest > cleanerTest[1] PASSED

kafka.log.LogCleanerIntegrationTest > testCleanerWithMessageFormatV0[1] STARTED

kafka.log.LogCleanerIntegrationTest > testCleanerWithMessageFormatV0[1] PASSED

kafka.log.LogCleanerIntegrationTest > testCleansCombinedCompactAndDeleteTopic[2] STARTED

kafka.log.LogCleanerIntegrationTest > testCleansCombinedCompactAndDeleteTopic[2] PASSED

kafka.log.LogCleanerIntegrationTest > testCleaningNestedMessagesWithMultipleVersions[2]
STARTED

kafka.log.LogCleanerIntegrationTest > testCleaningNestedMessagesWithMultipleVersions[2]
PASSED

kafka.log.LogCleanerIntegrationTest > cleanerTest[2] STARTED

kafka.log.LogCleanerIntegrationTest > cleanerTest[2] PASSED

kafka.log.LogCleanerIntegrationTest > testCleanerWithMessageFormatV0[2] STARTED

kafka.log.LogCleanerIntegrationTest > testCleanerWithMessageFormatV0[2] PASSED

kafka.log.LogCleanerIntegrationTest > testCleansCombinedCompactAndDeleteTopic[3] STARTED

kafka.log.LogCleanerIntegrationTest > testCleansCombinedCompactAndDeleteTopic[3] PASSED

kafka.log.LogCleanerIntegrationTest > testCleaningNestedMessagesWithMultipleVersions[3]
STARTED

kafka.log.LogCleanerIntegrationTest > testCleaningNestedMessagesWithMultipleVersions[3]
PASSED

kafka.log.LogCleanerIntegrationTest > cleanerTest[3] STARTED

kafka.log.LogCleanerIntegrationTest > cleanerTest[3] PASSED

kafka.log.LogCleanerIntegrationTest > testCleanerWithMessageFormatV0[3] STARTED

kafka.log.LogCleanerIntegrationTest > testCleanerWithMessageFormatV0[3] PASSED

unit.kafka.admin.ResetConsumerGroupOffsetTest > classMethod STARTED

unit.kafka.admin.ResetConsumerGroupOffsetTest > classMethod FAILED
    java.lang.AssertionError: Found unexpected threads, allThreads=Set(ThrottledRequestReaper-Produce,
metrics-meter-tick-thread-2, main, Signal Dispatcher, Reference Handler, ForkJoinPool-1-worker-57,
ExpirationReaper-0-Produce, ExpirationReaper-0-DeleteRecords, ThrottledRequestReaper-Fetch,
/0:0:0:0:0:0:0:1:49620 to /0:0:0:0:0:0:0:1:37461 workers Thread 2, ThrottledRequestReaper-Request,
/0:0:0:0:0:0:0:1:49620 to /0:0:0:0:0:0:0:1:37461 workers Thread 3, Test worker, kafka-producer-network-thread
| producer-3, ExpirationReaper-0-Fetch, Finalizer, metrics-meter-tick-thread-1)

unit.kafka.admin.ResetConsumerGroupOffsetTest > classMethod STARTED

unit.kafka.admin.ResetConsumerGroupOffsetTest > classMethod FAILED
    java.lang.AssertionError: Found unexpected threads, allThreads=Set(ThrottledRequestReaper-Produce,
metrics-meter-tick-thread-2, main, Signal Dispatcher, Reference Handler, ForkJoinPool-1-worker-57,
ExpirationReaper-0-Produce, ExpirationReaper-0-DeleteRecords, ThrottledRequestReaper-Fetch,
/0:0:0:0:0:0:0:1:49620 to /0:0:0:0:0:0:0:1:37461 workers Thread 2, ThrottledRequestReaper-Request,
/0:0:0:0:0:0:0:1:49620 to /0:0:0:0:0:0:0:1:37461 workers Thread 3, Test worker, kafka-producer-network-thread
| producer-3, ExpirationReaper-0-Fetch, Finalizer, metrics-meter-tick-thread-1)

unit.kafka.server.KafkaApisTest > shouldRespondWithUnsupportedForMessageFormatOnHandleWriteTxnMarkersWhenMagicLowerThanRequired
STARTED

unit.kafka.server.KafkaApisTest > shouldRespondWithUnsupportedForMessageFormatOnHandleWriteTxnMarkersWhenMagicLowerThanRequired
PASSED

unit.kafka.server.KafkaApisTest > shouldThrowUnsupportedVersionExceptionOnHandleTxnOffsetCommitRequestWhenInterBrokerProtocolNotSupported
STARTED

unit.kafka.server.KafkaApisTest > shouldThrowUnsupportedVersionExceptionOnHandleTxnOffsetCommitRequestWhenInterBrokerProtocolNotSupported
PASSED

unit.kafka.server.KafkaApisTest > shouldThrowUnsupportedVersionExceptionOnHandleAddPartitionsToTxnRequestWhenInterBrokerProtocolNotSupported
STARTED

unit.kafka.server.KafkaApisTest > shouldThrowUnsupportedVersionExceptionOnHandleAddPartitionsToTxnRequestWhenInterBrokerProtocolNotSupported
PASSED

unit.kafka.server.KafkaApisTest > testReadUncommittedConsumerListOffsetLatest STARTED

unit.kafka.server.KafkaApisTest > testReadUncommittedConsumerListOffsetLatest PASSED

unit.kafka.server.KafkaApisTest > shouldAppendToLogOnWriteTxnMarkersWhenCorrectMagicVersion
STARTED

unit.kafka.server.KafkaApisTest > shouldAppendToLogOnWriteTxnMarkersWhenCorrectMagicVersion
PASSED

unit.kafka.server.KafkaApisTest > shouldThrowUnsupportedVersionExceptionOnHandleWriteTxnMarkersRequestWhenInterBrokerProtocolNotSupported
STARTED

unit.kafka.server.KafkaApisTest > shouldThrowUnsupportedVersionExceptionOnHandleWriteTxnMarkersRequestWhenInterBrokerProtocolNotSupported
PASSED

unit.kafka.server.KafkaApisTest > shouldRespondWithUnknownTopicWhenPartitionIsNotHosted
STARTED

unit.kafka.server.KafkaApisTest > shouldRespondWithUnknownTopicWhenPartitionIsNotHosted
PASSED

unit.kafka.server.KafkaApisTest > testReadCommittedConsumerListOffsetEarliestOffsetEqualsLastStableOffset
STARTED

unit.kafka.server.KafkaApisTest > testReadCommittedConsumerListOffsetEarliestOffsetEqualsLastStableOffset
PASSED

unit.kafka.server.KafkaApisTest > testReadCommittedConsumerListOffsetLatest STARTED

unit.kafka.server.KafkaApisTest > testReadCommittedConsumerListOffsetLatest PASSED

unit.kafka.server.KafkaApisTest > testReadCommittedConsumerListOffsetLimitedAtLastStableOffset
STARTED

unit.kafka.server.KafkaApisTest > testReadCommittedConsumerListOffsetLimitedAtLastStableOffset
PASSED

unit.kafka.server.KafkaApisTest > testReadUncommittedConsumerListOffsetEarliestOffsetEqualsHighWatermark
STARTED

unit.kafka.server.KafkaApisTest > testReadUncommittedConsumerListOffsetEarliestOffsetEqualsHighWatermark
PASSED

unit.kafka.server.KafkaApisTest > testReadUncommittedConsumerListOffsetLimitedAtHighWatermark
STARTED

unit.kafka.server.KafkaApisTest > testReadUncommittedConsumerListOffsetLimitedAtHighWatermark
PASSED

unit.kafka.server.KafkaApisTest > shouldThrowUnsupportedVersionExceptionOnHandleAddOffsetToTxnRequestWhenInterBrokerProtocolNotSupported
STARTED

unit.kafka.server.KafkaApisTest > shouldThrowUnsupportedVersionExceptionOnHandleAddOffsetToTxnRequestWhenInterBrokerProtocolNotSupported
PASSED

unit.kafka.server.KafkaApisTest > shouldRespondWithUnsupportedMessageFormatForBadPartitionAndNoErrorsForGoodPartition
STARTED

unit.kafka.server.KafkaApisTest > shouldRespondWithUnsupportedMessageFormatForBadPartitionAndNoErrorsForGoodPartition
PASSED

unit.kafka.server.KafkaApisTest > shouldThrowUnsupportedVersionExceptionOnHandleEndTxnRequestWhenInterBrokerProtocolNotSupported
STARTED

unit.kafka.server.KafkaApisTest > shouldThrowUnsupportedVersionExceptionOnHandleEndTxnRequestWhenInterBrokerProtocolNotSupported
PASSED

unit.kafka.server.KafkaApisTest > shouldRespondWithUnknownTopicOrPartitionForBadPartitionAndNoErrorsForGoodPartition
STARTED

unit.kafka.server.KafkaApisTest > shouldRespondWithUnknownTopicOrPartitionForBadPartitionAndNoErrorsForGoodPartition
PASSED

1137 tests completed, 172 failed, 1 skipped
:kafka-trunk-jdk7:core:test FAILED
:test_core_2_11 FAILED

FAILURE: Build failed with an exception.

* What went wrong:
Execution failed for task ':kafka-trunk-jdk7:core:test'.
> There were failing tests. See the report at: file://<https://builds.apache.org/job/kafka-trunk-jdk7/ws/core/build/reports/tests/test/index.html>

* Try:
Run with --stacktrace option to get the stack trace. Run with --info or --debug option to
get more log output.

BUILD FAILED

Total time: 1 hrs 5 mins 43.954 secs
Build step 'Execute shell' marked build as failure
[FINDBUGS] Collecting findbugs analysis files...
Setting GRADLE_3_4_RC_2_HOME=/home/jenkins/jenkins-slave/tools/hudson.plugins.gradle.GradleInstallation/Gradle_3.4-rc-2
[FINDBUGS] Searching for all files in <https://builds.apache.org/job/kafka-trunk-jdk7/ws/>
that match the pattern **/build/reports/findbugs/*.xml
[FINDBUGS] Parsing 1 file in <https://builds.apache.org/job/kafka-trunk-jdk7/ws/>
[FINDBUGS] Successfully parsed file <https://builds.apache.org/job/kafka-trunk-jdk7/ws/core/build/reports/findbugs/main.xml>
with 0 unique warnings and 0 duplicates.
Setting GRADLE_3_4_RC_2_HOME=/home/jenkins/jenkins-slave/tools/hudson.plugins.gradle.GradleInstallation/Gradle_3.4-rc-2
<Git Blamer> Using GitBlamer to create author and commit information for all warnings.
<Git Blamer> Getting blame results for all files in <https://builds.apache.org/job/kafka-trunk-jdk7/ws/.>
[FINDBUGS] Computing warning deltas based on reference build #2590
Recording test results
Setting GRADLE_3_4_RC_2_HOME=/home/jenkins/jenkins-slave/tools/hudson.plugins.gradle.GradleInstallation/Gradle_3.4-rc-2
Setting GRADLE_3_4_RC_2_HOME=/home/jenkins/jenkins-slave/tools/hudson.plugins.gradle.GradleInstallation/Gradle_3.4-rc-2

Mime
View raw message