kafka-dev mailing list archives

Site index · List index
Message view « Date » · « Thread »
Top « Date » · « Thread »
From Apache Jenkins Server <jenk...@builds.apache.org>
Subject Build failed in Jenkins: kafka-trunk-jdk8 #1784
Date Wed, 05 Jul 2017 23:43:10 GMT
See <https://builds.apache.org/job/kafka-trunk-jdk8/1784/display/redirect?page=changes>

Changes:

[wangguoz] MINOR: add IQ docs to streams documentation

[wangguoz] KAFKA-5525: Streams reset tool should have same console output with or

------------------------------------------
[...truncated 874.78 KB...]

kafka.coordinator.transaction.TransactionMarkerChannelManagerTest > shouldCreateMetricsOnStarting
STARTED

kafka.coordinator.transaction.TransactionMarkerChannelManagerTest > shouldCreateMetricsOnStarting
PASSED

kafka.coordinator.transaction.TransactionMarkerChannelManagerTest > shouldAbortAppendToLogOnEndTxnWhenNotCoordinatorError
STARTED

kafka.coordinator.transaction.TransactionMarkerChannelManagerTest > shouldAbortAppendToLogOnEndTxnWhenNotCoordinatorError
PASSED

kafka.coordinator.transaction.TransactionMarkerChannelManagerTest > shouldRetryAppendToLogOnEndTxnWhenCoordinatorNotAvailableError
STARTED

kafka.coordinator.transaction.TransactionMarkerChannelManagerTest > shouldRetryAppendToLogOnEndTxnWhenCoordinatorNotAvailableError
PASSED

kafka.coordinator.transaction.TransactionMarkerChannelManagerTest > shouldCompleteAppendToLogOnEndTxnWhenSendMarkersSucceed
STARTED

kafka.coordinator.transaction.TransactionMarkerChannelManagerTest > shouldCompleteAppendToLogOnEndTxnWhenSendMarkersSucceed
PASSED

kafka.coordinator.transaction.TransactionMarkerChannelManagerTest > shouldGenerateRequestPerPartitionPerBroker
STARTED

kafka.coordinator.transaction.TransactionMarkerChannelManagerTest > shouldGenerateRequestPerPartitionPerBroker
PASSED

kafka.coordinator.transaction.TransactionMarkerChannelManagerTest > shouldRemoveMarkersForTxnPartitionWhenPartitionEmigrated
STARTED

kafka.coordinator.transaction.TransactionMarkerChannelManagerTest > shouldRemoveMarkersForTxnPartitionWhenPartitionEmigrated
PASSED

kafka.coordinator.transaction.TransactionMarkerChannelManagerTest > shouldSkipSendMarkersWhenLeaderNotFound
STARTED

kafka.coordinator.transaction.TransactionMarkerChannelManagerTest > shouldSkipSendMarkersWhenLeaderNotFound
PASSED

kafka.api.SaslScramSslEndToEndAuthorizationTest > testTwoConsumersWithDifferentSaslCredentials
STARTED

kafka.api.SaslScramSslEndToEndAuthorizationTest > testTwoConsumersWithDifferentSaslCredentials
PASSED

kafka.api.SaslScramSslEndToEndAuthorizationTest > testNoConsumeWithoutDescribeAclViaSubscribe
STARTED

kafka.api.SaslScramSslEndToEndAuthorizationTest > testNoConsumeWithoutDescribeAclViaSubscribe
PASSED

kafka.api.SaslScramSslEndToEndAuthorizationTest > testProduceConsumeViaAssign STARTED

kafka.api.SaslScramSslEndToEndAuthorizationTest > testProduceConsumeViaAssign PASSED

kafka.api.SaslScramSslEndToEndAuthorizationTest > testNoConsumeWithDescribeAclViaAssign
STARTED

kafka.api.SaslScramSslEndToEndAuthorizationTest > testNoConsumeWithDescribeAclViaAssign
PASSED

kafka.api.SaslScramSslEndToEndAuthorizationTest > testNoConsumeWithDescribeAclViaSubscribe
STARTED

kafka.api.SaslScramSslEndToEndAuthorizationTest > testNoConsumeWithDescribeAclViaSubscribe
PASSED

kafka.api.SaslScramSslEndToEndAuthorizationTest > testNoConsumeWithoutDescribeAclViaAssign
STARTED

kafka.api.SaslScramSslEndToEndAuthorizationTest > testNoConsumeWithoutDescribeAclViaAssign
PASSED

kafka.api.SaslScramSslEndToEndAuthorizationTest > testNoGroupAcl STARTED

kafka.api.SaslScramSslEndToEndAuthorizationTest > testNoGroupAcl PASSED

kafka.api.SaslScramSslEndToEndAuthorizationTest > testNoProduceWithDescribeAcl STARTED

kafka.api.SaslScramSslEndToEndAuthorizationTest > testNoProduceWithDescribeAcl PASSED

kafka.api.SaslScramSslEndToEndAuthorizationTest > testProduceConsumeViaSubscribe STARTED

kafka.api.SaslScramSslEndToEndAuthorizationTest > testProduceConsumeViaSubscribe PASSED

kafka.api.SaslScramSslEndToEndAuthorizationTest > testNoProduceWithoutDescribeAcl STARTED

kafka.api.SaslScramSslEndToEndAuthorizationTest > testNoProduceWithoutDescribeAcl PASSED

kafka.api.ProducerBounceTest > testBrokerFailure STARTED

kafka.api.ProducerBounceTest > testBrokerFailure SKIPPED

kafka.api.SaslMultiMechanismConsumerTest > testMultipleBrokerMechanisms STARTED

kafka.api.SaslMultiMechanismConsumerTest > testMultipleBrokerMechanisms PASSED

kafka.api.SaslMultiMechanismConsumerTest > testCoordinatorFailover STARTED

kafka.api.SaslMultiMechanismConsumerTest > testCoordinatorFailover PASSED

kafka.api.SaslMultiMechanismConsumerTest > testSimpleConsumption STARTED

kafka.api.SaslMultiMechanismConsumerTest > testSimpleConsumption PASSED

kafka.api.PlaintextProducerSendTest > testSendCompressedMessageWithLogAppendTime STARTED

kafka.api.PlaintextProducerSendTest > testSendCompressedMessageWithLogAppendTime PASSED

kafka.api.PlaintextProducerSendTest > testAutoCreateTopic STARTED

kafka.api.PlaintextProducerSendTest > testAutoCreateTopic PASSED

kafka.api.PlaintextProducerSendTest > testSendWithInvalidCreateTime STARTED

kafka.api.PlaintextProducerSendTest > testSendWithInvalidCreateTime PASSED

kafka.api.PlaintextProducerSendTest > testBatchSizeZero STARTED

kafka.api.PlaintextProducerSendTest > testBatchSizeZero PASSED

kafka.api.PlaintextProducerSendTest > testWrongSerializer STARTED

kafka.api.PlaintextProducerSendTest > testWrongSerializer PASSED

kafka.api.PlaintextProducerSendTest > testSendNonCompressedMessageWithLogAppendTime STARTED

kafka.api.PlaintextProducerSendTest > testSendNonCompressedMessageWithLogAppendTime PASSED

kafka.api.PlaintextProducerSendTest > testSendNonCompressedMessageWithCreateTime STARTED

kafka.api.PlaintextProducerSendTest > testSendNonCompressedMessageWithCreateTime PASSED

kafka.api.PlaintextProducerSendTest > testClose STARTED

kafka.api.PlaintextProducerSendTest > testClose PASSED

kafka.api.PlaintextProducerSendTest > testFlush STARTED

kafka.api.PlaintextProducerSendTest > testFlush PASSED

kafka.api.PlaintextProducerSendTest > testSendToPartition STARTED

kafka.api.PlaintextProducerSendTest > testSendToPartition PASSED

kafka.api.PlaintextProducerSendTest > testSendOffset STARTED

kafka.api.PlaintextProducerSendTest > testSendOffset PASSED

kafka.api.PlaintextProducerSendTest > testSendCompressedMessageWithCreateTime STARTED

kafka.api.PlaintextProducerSendTest > testSendCompressedMessageWithCreateTime PASSED

kafka.api.PlaintextProducerSendTest > testCloseWithZeroTimeoutFromCallerThread STARTED

kafka.api.PlaintextProducerSendTest > testCloseWithZeroTimeoutFromCallerThread PASSED

kafka.api.PlaintextProducerSendTest > testCloseWithZeroTimeoutFromSenderThread STARTED

kafka.api.PlaintextProducerSendTest > testCloseWithZeroTimeoutFromSenderThread PASSED

kafka.api.PlaintextProducerSendTest > testSendBeforeAndAfterPartitionExpansion STARTED

kafka.api.PlaintextProducerSendTest > testSendBeforeAndAfterPartitionExpansion PASSED

kafka.api.FetchRequestTest > testShuffleWithSingleTopic STARTED

kafka.api.FetchRequestTest > testShuffleWithSingleTopic PASSED

kafka.api.FetchRequestTest > testShuffle STARTED

kafka.api.FetchRequestTest > testShuffle PASSED

kafka.api.ClientIdQuotaTest > testProducerConsumerOverrideUnthrottled STARTED

kafka.api.ClientIdQuotaTest > testProducerConsumerOverrideUnthrottled PASSED

kafka.api.ClientIdQuotaTest > testThrottledProducerConsumer STARTED

kafka.api.ClientIdQuotaTest > testThrottledProducerConsumer PASSED

kafka.api.ClientIdQuotaTest > testQuotaOverrideDelete STARTED

kafka.api.ClientIdQuotaTest > testQuotaOverrideDelete PASSED

kafka.api.ClientIdQuotaTest > testThrottledRequest STARTED

kafka.api.ClientIdQuotaTest > testThrottledRequest PASSED

kafka.api.ProducerFailureHandlingTest > testCannotSendToInternalTopic STARTED

kafka.api.ProducerFailureHandlingTest > testCannotSendToInternalTopic PASSED

kafka.api.ProducerFailureHandlingTest > testTooLargeRecordWithAckOne STARTED

kafka.api.ProducerFailureHandlingTest > testTooLargeRecordWithAckOne PASSED

kafka.api.ProducerFailureHandlingTest > testWrongBrokerList STARTED

kafka.api.ProducerFailureHandlingTest > testWrongBrokerList PASSED

kafka.api.ProducerFailureHandlingTest > testNotEnoughReplicas STARTED

kafka.api.ProducerFailureHandlingTest > testNotEnoughReplicas PASSED

kafka.api.ProducerFailureHandlingTest > testResponseTooLargeForReplicationWithAckAll STARTED

kafka.api.ProducerFailureHandlingTest > testResponseTooLargeForReplicationWithAckAll PASSED

kafka.api.ProducerFailureHandlingTest > testNonExistentTopic STARTED

kafka.api.ProducerFailureHandlingTest > testNonExistentTopic PASSED

kafka.api.ProducerFailureHandlingTest > testInvalidPartition STARTED

kafka.api.ProducerFailureHandlingTest > testInvalidPartition PASSED

kafka.api.ProducerFailureHandlingTest > testSendAfterClosed STARTED

kafka.api.ProducerFailureHandlingTest > testSendAfterClosed PASSED

kafka.api.ProducerFailureHandlingTest > testTooLargeRecordWithAckZero STARTED

kafka.api.ProducerFailureHandlingTest > testTooLargeRecordWithAckZero PASSED

kafka.api.ProducerFailureHandlingTest > testPartitionTooLargeForReplicationWithAckAll STARTED

kafka.api.ProducerFailureHandlingTest > testPartitionTooLargeForReplicationWithAckAll PASSED

kafka.api.ProducerFailureHandlingTest > testNotEnoughReplicasAfterBrokerShutdown STARTED

kafka.api.ProducerFailureHandlingTest > testNotEnoughReplicasAfterBrokerShutdown PASSED

kafka.api.AdminClientWithPoliciesIntegrationTest > testInvalidAlterConfigs STARTED

kafka.api.AdminClientWithPoliciesIntegrationTest > testInvalidAlterConfigs PASSED

kafka.api.AdminClientWithPoliciesIntegrationTest > testValidAlterConfigs STARTED

kafka.api.AdminClientWithPoliciesIntegrationTest > testValidAlterConfigs PASSED

kafka.api.AdminClientWithPoliciesIntegrationTest > testInvalidAlterConfigsDueToPolicy STARTED
:kafka-trunk-jdk8:core:test FAILED
:test_core_2_11 FAILED

FAILURE: Build failed with an exception.

* What went wrong:
Execution failed for task ':kafka-trunk-jdk8:core:test'.
> Process 'Gradle Test Executor 3' finished with non-zero exit value 137

* Try:
Run with --stacktrace option to get the stack trace. Run with --info or --debug option to
get more log output.

BUILD FAILED

Total time: 23 mins 26.364 secs
Build step 'Execute shell' marked build as failure
[FINDBUGS] Collecting findbugs analysis files...
Setting GRADLE_3_4_RC_2_HOME=/home/jenkins/jenkins-slave/tools/hudson.plugins.gradle.GradleInstallation/Gradle_3.4-rc-2
[FINDBUGS] Searching for all files in <https://builds.apache.org/job/kafka-trunk-jdk8/ws/>
that match the pattern **/build/reports/findbugs/*.xml
[FINDBUGS] Parsing 1 file in <https://builds.apache.org/job/kafka-trunk-jdk8/ws/>
[FINDBUGS] Successfully parsed file <https://builds.apache.org/job/kafka-trunk-jdk8/ws/core/build/reports/findbugs/main.xml>
with 0 unique warnings and 0 duplicates.
[FINDBUGS] Computing warning deltas based on reference build #1783
Recording test results
Setting GRADLE_3_4_RC_2_HOME=/home/jenkins/jenkins-slave/tools/hudson.plugins.gradle.GradleInstallation/Gradle_3.4-rc-2
ERROR: Step ‘Publish JUnit test result report’ failed: No test report files were found.
Configuration error?
Setting GRADLE_3_4_RC_2_HOME=/home/jenkins/jenkins-slave/tools/hudson.plugins.gradle.GradleInstallation/Gradle_3.4-rc-2
Not sending mail to unregistered user wangguoz@gmail.com

Mime
View raw message