kafka-dev mailing list archives

Site index · List index
Message view « Date » · « Thread »
Top « Date » · « Thread »
From Apache Jenkins Server <jenk...@builds.apache.org>
Subject Build failed in Jenkins: kafka-trunk-jdk8 #1780
Date Mon, 03 Jul 2017 18:48:55 GMT
See <https://builds.apache.org/job/kafka-trunk-jdk8/1780/display/redirect?page=changes>

Changes:

[damian.guy] MINOR: compatibility tests for streams

------------------------------------------
[...truncated 4.30 MB...]
kafka.tools.ConsoleProducerTest > testInvalidConfigs PASSED

kafka.tools.ConsoleProducerTest > testValidConfigsNewProducer STARTED

kafka.tools.ConsoleProducerTest > testValidConfigsNewProducer PASSED

kafka.tools.ReplicaVerificationToolTest > testReplicaBufferVerifyChecksum STARTED

kafka.tools.ReplicaVerificationToolTest > testReplicaBufferVerifyChecksum PASSED

kafka.tools.ConsoleConsumerTest > shouldLimitReadsToMaxMessageLimit STARTED

kafka.tools.ConsoleConsumerTest > shouldLimitReadsToMaxMessageLimit PASSED

kafka.tools.ConsoleConsumerTest > shouldParseValidNewConsumerValidConfig STARTED

kafka.tools.ConsoleConsumerTest > shouldParseValidNewConsumerValidConfig PASSED

kafka.tools.ConsoleConsumerTest > shouldStopWhenOutputCheckErrorFails STARTED

kafka.tools.ConsoleConsumerTest > shouldStopWhenOutputCheckErrorFails PASSED

kafka.tools.ConsoleConsumerTest > shouldParseValidNewSimpleConsumerValidConfigWithStringOffset
STARTED

kafka.tools.ConsoleConsumerTest > shouldParseValidNewSimpleConsumerValidConfigWithStringOffset
PASSED

kafka.tools.ConsoleConsumerTest > shouldParseConfigsFromFile STARTED

kafka.tools.ConsoleConsumerTest > shouldParseConfigsFromFile PASSED

kafka.tools.ConsoleConsumerTest > shouldParseValidNewSimpleConsumerValidConfigWithNumericOffset
STARTED

kafka.tools.ConsoleConsumerTest > shouldParseValidNewSimpleConsumerValidConfigWithNumericOffset
PASSED

kafka.tools.ConsoleConsumerTest > testDefaultConsumer STARTED

kafka.tools.ConsoleConsumerTest > testDefaultConsumer PASSED

kafka.tools.ConsoleConsumerTest > shouldParseValidOldConsumerValidConfig STARTED

kafka.tools.ConsoleConsumerTest > shouldParseValidOldConsumerValidConfig PASSED

kafka.security.auth.PermissionTypeTest > testJavaConversions STARTED

kafka.security.auth.PermissionTypeTest > testJavaConversions PASSED

kafka.security.auth.PermissionTypeTest > testFromString STARTED

kafka.security.auth.PermissionTypeTest > testFromString PASSED

kafka.security.auth.ResourceTypeTest > testJavaConversions STARTED

kafka.security.auth.ResourceTypeTest > testJavaConversions PASSED

kafka.security.auth.ResourceTypeTest > testFromString STARTED

kafka.security.auth.ResourceTypeTest > testFromString PASSED

kafka.security.auth.OperationTest > testJavaConversions STARTED

kafka.security.auth.OperationTest > testJavaConversions PASSED

kafka.security.auth.AclTest > testAclJsonConversion STARTED

kafka.security.auth.AclTest > testAclJsonConversion PASSED

kafka.security.auth.ZkAuthorizationTest > classMethod STARTED

kafka.security.auth.ZkAuthorizationTest > classMethod FAILED
    java.lang.AssertionError: Found unexpected threads, allThreads=Set(ZkClient-EventThread-41440-127.0.0.1:49291,
/0:0:0:0:0:0:0:1:58020 to /0:0:0:0:0:0:0:1:45393 workers Thread 2, ThrottledRequestReaper-Produce,
SessionTracker, metrics-meter-tick-thread-2, main, Signal Dispatcher, /0:0:0:0:0:0:0:1:58020
to /0:0:0:0:0:0:0:1:45393 workers Thread 3, Reference Handler, ExpirationReaper-0-Produce,
ExpirationReaper-0-DeleteRecords, ThrottledRequestReaper-Fetch, ThrottledRequestReaper-Request,
kafka-request-handler-2, Test worker, SyncThread:0, ReplicaFetcherThread-0-1, Test worker-SendThread(127.0.0.1:49291),
NIOServerCxn.Factory:/127.0.0.1:0, Test worker-EventThread, ExpirationReaper-0-Fetch, ProcessThread(sid:0
cport:49291):, Finalizer, kafka-coordinator-heartbeat-thread | group1, metrics-meter-tick-thread-1)

kafka.security.auth.ZkAuthorizationTest > classMethod STARTED

kafka.security.auth.ZkAuthorizationTest > classMethod FAILED
    java.lang.AssertionError: Found unexpected threads, allThreads=Set(ZkClient-EventThread-41440-127.0.0.1:49291,
/0:0:0:0:0:0:0:1:58020 to /0:0:0:0:0:0:0:1:45393 workers Thread 2, ThrottledRequestReaper-Produce,
SessionTracker, metrics-meter-tick-thread-2, main, Signal Dispatcher, /0:0:0:0:0:0:0:1:58020
to /0:0:0:0:0:0:0:1:45393 workers Thread 3, Reference Handler, ExpirationReaper-0-Produce,
ExpirationReaper-0-DeleteRecords, ThrottledRequestReaper-Fetch, ThrottledRequestReaper-Request,
kafka-request-handler-2, Test worker, SyncThread:0, ReplicaFetcherThread-0-1, Test worker-SendThread(127.0.0.1:49291),
NIOServerCxn.Factory:/127.0.0.1:0, Test worker-EventThread, ExpirationReaper-0-Fetch, ProcessThread(sid:0
cport:49291):, Finalizer, kafka-coordinator-heartbeat-thread | group1, metrics-meter-tick-thread-1)

kafka.security.auth.SimpleAclAuthorizerTest > classMethod STARTED

kafka.security.auth.SimpleAclAuthorizerTest > classMethod FAILED
    java.lang.AssertionError: Found unexpected threads, allThreads=Set(ZkClient-EventThread-41440-127.0.0.1:49291,
/0:0:0:0:0:0:0:1:58020 to /0:0:0:0:0:0:0:1:45393 workers Thread 2, ThrottledRequestReaper-Produce,
SessionTracker, metrics-meter-tick-thread-2, main, Signal Dispatcher, /0:0:0:0:0:0:0:1:58020
to /0:0:0:0:0:0:0:1:45393 workers Thread 3, Reference Handler, ExpirationReaper-0-Produce,
ExpirationReaper-0-DeleteRecords, ThrottledRequestReaper-Fetch, ThrottledRequestReaper-Request,
kafka-request-handler-2, Test worker, SyncThread:0, ReplicaFetcherThread-0-1, Test worker-SendThread(127.0.0.1:49291),
NIOServerCxn.Factory:/127.0.0.1:0, Test worker-EventThread, ExpirationReaper-0-Fetch, ProcessThread(sid:0
cport:49291):, Finalizer, kafka-coordinator-heartbeat-thread | group1, metrics-meter-tick-thread-1)

kafka.security.auth.SimpleAclAuthorizerTest > classMethod STARTED

kafka.security.auth.SimpleAclAuthorizerTest > classMethod FAILED
    java.lang.AssertionError: Found unexpected threads, allThreads=Set(ZkClient-EventThread-41440-127.0.0.1:49291,
/0:0:0:0:0:0:0:1:58020 to /0:0:0:0:0:0:0:1:45393 workers Thread 2, ThrottledRequestReaper-Produce,
SessionTracker, metrics-meter-tick-thread-2, main, Signal Dispatcher, /0:0:0:0:0:0:0:1:58020
to /0:0:0:0:0:0:0:1:45393 workers Thread 3, Reference Handler, ExpirationReaper-0-Produce,
ExpirationReaper-0-DeleteRecords, ThrottledRequestReaper-Fetch, ThrottledRequestReaper-Request,
kafka-request-handler-2, Test worker, SyncThread:0, ReplicaFetcherThread-0-1, Test worker-SendThread(127.0.0.1:49291),
NIOServerCxn.Factory:/127.0.0.1:0, Test worker-EventThread, ExpirationReaper-0-Fetch, ProcessThread(sid:0
cport:49291):, Finalizer, kafka-coordinator-heartbeat-thread | group1, metrics-meter-tick-thread-1)

kafka.integration.PrimitiveApiTest > classMethod STARTED

kafka.integration.PrimitiveApiTest > classMethod FAILED
    java.lang.AssertionError: Found unexpected threads, allThreads=Set(ZkClient-EventThread-41440-127.0.0.1:49291,
/0:0:0:0:0:0:0:1:58020 to /0:0:0:0:0:0:0:1:45393 workers Thread 2, ThrottledRequestReaper-Produce,
SessionTracker, metrics-meter-tick-thread-2, main, Signal Dispatcher, /0:0:0:0:0:0:0:1:58020
to /0:0:0:0:0:0:0:1:45393 workers Thread 3, Reference Handler, ExpirationReaper-0-Produce,
ExpirationReaper-0-DeleteRecords, ThrottledRequestReaper-Fetch, ThrottledRequestReaper-Request,
kafka-request-handler-2, Test worker, SyncThread:0, ReplicaFetcherThread-0-1, Test worker-SendThread(127.0.0.1:49291),
NIOServerCxn.Factory:/127.0.0.1:0, Test worker-EventThread, ExpirationReaper-0-Fetch, ProcessThread(sid:0
cport:49291):, Finalizer, kafka-coordinator-heartbeat-thread | group1, metrics-meter-tick-thread-1)

kafka.integration.PrimitiveApiTest > classMethod STARTED

kafka.integration.PrimitiveApiTest > classMethod FAILED
    java.lang.AssertionError: Found unexpected threads, allThreads=Set(ZkClient-EventThread-41440-127.0.0.1:49291,
/0:0:0:0:0:0:0:1:58020 to /0:0:0:0:0:0:0:1:45393 workers Thread 2, ThrottledRequestReaper-Produce,
SessionTracker, metrics-meter-tick-thread-2, main, Signal Dispatcher, /0:0:0:0:0:0:0:1:58020
to /0:0:0:0:0:0:0:1:45393 workers Thread 3, Reference Handler, ExpirationReaper-0-Produce,
ExpirationReaper-0-DeleteRecords, ThrottledRequestReaper-Fetch, ThrottledRequestReaper-Request,
kafka-request-handler-2, Test worker, SyncThread:0, ReplicaFetcherThread-0-1, Test worker-SendThread(127.0.0.1:49291),
NIOServerCxn.Factory:/127.0.0.1:0, Test worker-EventThread, ExpirationReaper-0-Fetch, ProcessThread(sid:0
cport:49291):, Finalizer, kafka-coordinator-heartbeat-thread | group1, metrics-meter-tick-thread-1)

kafka.integration.MetricsDuringTopicCreationDeletionTest > classMethod STARTED

kafka.integration.MetricsDuringTopicCreationDeletionTest > classMethod FAILED
    java.lang.AssertionError: Found unexpected threads, allThreads=Set(ZkClient-EventThread-41440-127.0.0.1:49291,
/0:0:0:0:0:0:0:1:58020 to /0:0:0:0:0:0:0:1:45393 workers Thread 2, ThrottledRequestReaper-Produce,
SessionTracker, metrics-meter-tick-thread-2, main, Signal Dispatcher, /0:0:0:0:0:0:0:1:58020
to /0:0:0:0:0:0:0:1:45393 workers Thread 3, Reference Handler, ExpirationReaper-0-Produce,
ExpirationReaper-0-DeleteRecords, ThrottledRequestReaper-Fetch, ThrottledRequestReaper-Request,
kafka-request-handler-2, Test worker, SyncThread:0, ReplicaFetcherThread-0-1, Test worker-SendThread(127.0.0.1:49291),
NIOServerCxn.Factory:/127.0.0.1:0, Test worker-EventThread, ExpirationReaper-0-Fetch, ProcessThread(sid:0
cport:49291):, Finalizer, kafka-coordinator-heartbeat-thread | group1, metrics-meter-tick-thread-1)

kafka.integration.MetricsDuringTopicCreationDeletionTest > classMethod STARTED

kafka.integration.MetricsDuringTopicCreationDeletionTest > classMethod FAILED
    java.lang.AssertionError: Found unexpected threads, allThreads=Set(ZkClient-EventThread-41440-127.0.0.1:49291,
/0:0:0:0:0:0:0:1:58020 to /0:0:0:0:0:0:0:1:45393 workers Thread 2, ThrottledRequestReaper-Produce,
SessionTracker, metrics-meter-tick-thread-2, main, Signal Dispatcher, /0:0:0:0:0:0:0:1:58020
to /0:0:0:0:0:0:0:1:45393 workers Thread 3, Reference Handler, ExpirationReaper-0-Produce,
ExpirationReaper-0-DeleteRecords, ThrottledRequestReaper-Fetch, ThrottledRequestReaper-Request,
kafka-request-handler-2, Test worker, SyncThread:0, ReplicaFetcherThread-0-1, Test worker-SendThread(127.0.0.1:49291),
NIOServerCxn.Factory:/127.0.0.1:0, Test worker-EventThread, ExpirationReaper-0-Fetch, ProcessThread(sid:0
cport:49291):, Finalizer, kafka-coordinator-heartbeat-thread | group1, metrics-meter-tick-thread-1)

kafka.integration.AutoOffsetResetTest > classMethod STARTED

kafka.integration.AutoOffsetResetTest > classMethod FAILED
    java.lang.AssertionError: Found unexpected threads, allThreads=Set(ZkClient-EventThread-41440-127.0.0.1:49291,
/0:0:0:0:0:0:0:1:58020 to /0:0:0:0:0:0:0:1:45393 workers Thread 2, ThrottledRequestReaper-Produce,
SessionTracker, metrics-meter-tick-thread-2, main, Signal Dispatcher, /0:0:0:0:0:0:0:1:58020
to /0:0:0:0:0:0:0:1:45393 workers Thread 3, Reference Handler, ExpirationReaper-0-Produce,
ExpirationReaper-0-DeleteRecords, ThrottledRequestReaper-Fetch, ThrottledRequestReaper-Request,
kafka-request-handler-2, Test worker, SyncThread:0, ReplicaFetcherThread-0-1, Test worker-SendThread(127.0.0.1:49291),
NIOServerCxn.Factory:/127.0.0.1:0, Test worker-EventThread, ExpirationReaper-0-Fetch, ProcessThread(sid:0
cport:49291):, Finalizer, kafka-coordinator-heartbeat-thread | group1, metrics-meter-tick-thread-1)

kafka.integration.AutoOffsetResetTest > classMethod STARTED

kafka.integration.AutoOffsetResetTest > classMethod FAILED
    java.lang.AssertionError: Found unexpected threads, allThreads=Set(ZkClient-EventThread-41440-127.0.0.1:49291,
/0:0:0:0:0:0:0:1:58020 to /0:0:0:0:0:0:0:1:45393 workers Thread 2, ThrottledRequestReaper-Produce,
SessionTracker, metrics-meter-tick-thread-2, main, Signal Dispatcher, /0:0:0:0:0:0:0:1:58020
to /0:0:0:0:0:0:0:1:45393 workers Thread 3, Reference Handler, ExpirationReaper-0-Produce,
ExpirationReaper-0-DeleteRecords, ThrottledRequestReaper-Fetch, ThrottledRequestReaper-Request,
kafka-request-handler-2, Test worker, SyncThread:0, ReplicaFetcherThread-0-1, Test worker-SendThread(127.0.0.1:49291),
NIOServerCxn.Factory:/127.0.0.1:0, Test worker-EventThread, ExpirationReaper-0-Fetch, ProcessThread(sid:0
cport:49291):, Finalizer, kafka-coordinator-heartbeat-thread | group1, metrics-meter-tick-thread-1)

kafka.integration.TopicMetadataTest > classMethod STARTED

kafka.integration.TopicMetadataTest > classMethod FAILED
    java.lang.AssertionError: Found unexpected threads, allThreads=Set(ZkClient-EventThread-41440-127.0.0.1:49291,
/0:0:0:0:0:0:0:1:58020 to /0:0:0:0:0:0:0:1:45393 workers Thread 2, ThrottledRequestReaper-Produce,
SessionTracker, metrics-meter-tick-thread-2, main, Signal Dispatcher, /0:0:0:0:0:0:0:1:58020
to /0:0:0:0:0:0:0:1:45393 workers Thread 3, Reference Handler, ExpirationReaper-0-Produce,
ExpirationReaper-0-DeleteRecords, ThrottledRequestReaper-Fetch, ThrottledRequestReaper-Request,
kafka-request-handler-2, Test worker, SyncThread:0, ReplicaFetcherThread-0-1, Test worker-SendThread(127.0.0.1:49291),
NIOServerCxn.Factory:/127.0.0.1:0, Test worker-EventThread, ExpirationReaper-0-Fetch, ProcessThread(sid:0
cport:49291):, Finalizer, kafka-coordinator-heartbeat-thread | group1, metrics-meter-tick-thread-1)

kafka.integration.TopicMetadataTest > classMethod STARTED

kafka.integration.TopicMetadataTest > classMethod FAILED
    java.lang.AssertionError: Found unexpected threads, allThreads=Set(ZkClient-EventThread-41440-127.0.0.1:49291,
/0:0:0:0:0:0:0:1:58020 to /0:0:0:0:0:0:0:1:45393 workers Thread 2, ThrottledRequestReaper-Produce,
SessionTracker, metrics-meter-tick-thread-2, main, Signal Dispatcher, /0:0:0:0:0:0:0:1:58020
to /0:0:0:0:0:0:0:1:45393 workers Thread 3, Reference Handler, ExpirationReaper-0-Produce,
ExpirationReaper-0-DeleteRecords, ThrottledRequestReaper-Fetch, ThrottledRequestReaper-Request,
kafka-request-handler-2, Test worker, SyncThread:0, ReplicaFetcherThread-0-1, Test worker-SendThread(127.0.0.1:49291),
NIOServerCxn.Factory:/127.0.0.1:0, Test worker-EventThread, ExpirationReaper-0-Fetch, ProcessThread(sid:0
cport:49291):, Finalizer, kafka-coordinator-heartbeat-thread | group1, metrics-meter-tick-thread-1)

kafka.integration.FetcherTest > classMethod STARTED

kafka.integration.FetcherTest > classMethod FAILED
    java.lang.AssertionError: Found unexpected threads, allThreads=Set(ZkClient-EventThread-41440-127.0.0.1:49291,
/0:0:0:0:0:0:0:1:58020 to /0:0:0:0:0:0:0:1:45393 workers Thread 2, ThrottledRequestReaper-Produce,
SessionTracker, metrics-meter-tick-thread-2, main, Signal Dispatcher, /0:0:0:0:0:0:0:1:58020
to /0:0:0:0:0:0:0:1:45393 workers Thread 3, Reference Handler, ExpirationReaper-0-Produce,
ExpirationReaper-0-DeleteRecords, ThrottledRequestReaper-Fetch, ThrottledRequestReaper-Request,
kafka-request-handler-2, Test worker, SyncThread:0, ReplicaFetcherThread-0-1, Test worker-SendThread(127.0.0.1:49291),
NIOServerCxn.Factory:/127.0.0.1:0, Test worker-EventThread, ExpirationReaper-0-Fetch, ProcessThread(sid:0
cport:49291):, Finalizer, kafka-coordinator-heartbeat-thread | group1, metrics-meter-tick-thread-1)

kafka.integration.FetcherTest > classMethod STARTED

kafka.integration.FetcherTest > classMethod FAILED
    java.lang.AssertionError: Found unexpected threads, allThreads=Set(ZkClient-EventThread-41440-127.0.0.1:49291,
/0:0:0:0:0:0:0:1:58020 to /0:0:0:0:0:0:0:1:45393 workers Thread 2, ThrottledRequestReaper-Produce,
SessionTracker, metrics-meter-tick-thread-2, main, Signal Dispatcher, /0:0:0:0:0:0:0:1:58020
to /0:0:0:0:0:0:0:1:45393 workers Thread 3, Reference Handler, ExpirationReaper-0-Produce,
ExpirationReaper-0-DeleteRecords, ThrottledRequestReaper-Fetch, ThrottledRequestReaper-Request,
kafka-request-handler-2, Test worker, SyncThread:0, ReplicaFetcherThread-0-1, Test worker-SendThread(127.0.0.1:49291),
NIOServerCxn.Factory:/127.0.0.1:0, Test worker-EventThread, ExpirationReaper-0-Fetch, ProcessThread(sid:0
cport:49291):, Finalizer, kafka-coordinator-heartbeat-thread | group1, metrics-meter-tick-thread-1)

kafka.integration.UncleanLeaderElectionTest > classMethod STARTED

kafka.integration.UncleanLeaderElectionTest > classMethod FAILED
    java.lang.AssertionError: Found unexpected threads, allThreads=Set(ZkClient-EventThread-41440-127.0.0.1:49291,
/0:0:0:0:0:0:0:1:58020 to /0:0:0:0:0:0:0:1:45393 workers Thread 2, ThrottledRequestReaper-Produce,
SessionTracker, metrics-meter-tick-thread-2, main, Signal Dispatcher, /0:0:0:0:0:0:0:1:58020
to /0:0:0:0:0:0:0:1:45393 workers Thread 3, Reference Handler, ExpirationReaper-0-Produce,
ExpirationReaper-0-DeleteRecords, ThrottledRequestReaper-Fetch, ThrottledRequestReaper-Request,
kafka-request-handler-2, Test worker, SyncThread:0, ReplicaFetcherThread-0-1, Test worker-SendThread(127.0.0.1:49291),
NIOServerCxn.Factory:/127.0.0.1:0, Test worker-EventThread, ExpirationReaper-0-Fetch, ProcessThread(sid:0
cport:49291):, Finalizer, kafka-coordinator-heartbeat-thread | group1, metrics-meter-tick-thread-1)

kafka.integration.UncleanLeaderElectionTest > classMethod STARTED

kafka.integration.UncleanLeaderElectionTest > classMethod FAILED
    java.lang.AssertionError: Found unexpected threads, allThreads=Set(ZkClient-EventThread-41440-127.0.0.1:49291,
/0:0:0:0:0:0:0:1:58020 to /0:0:0:0:0:0:0:1:45393 workers Thread 2, ThrottledRequestReaper-Produce,
SessionTracker, metrics-meter-tick-thread-2, main, Signal Dispatcher, /0:0:0:0:0:0:0:1:58020
to /0:0:0:0:0:0:0:1:45393 workers Thread 3, Reference Handler, ExpirationReaper-0-Produce,
ExpirationReaper-0-DeleteRecords, ThrottledRequestReaper-Fetch, ThrottledRequestReaper-Request,
kafka-request-handler-2, Test worker, SyncThread:0, ReplicaFetcherThread-0-1, Test worker-SendThread(127.0.0.1:49291),
NIOServerCxn.Factory:/127.0.0.1:0, Test worker-EventThread, ExpirationReaper-0-Fetch, ProcessThread(sid:0
cport:49291):, Finalizer, kafka-coordinator-heartbeat-thread | group1, metrics-meter-tick-thread-1)

kafka.integration.MinIsrConfigTest > classMethod STARTED

kafka.integration.MinIsrConfigTest > classMethod FAILED
    java.lang.AssertionError: Found unexpected threads, allThreads=Set(ZkClient-EventThread-41440-127.0.0.1:49291,
/0:0:0:0:0:0:0:1:58020 to /0:0:0:0:0:0:0:1:45393 workers Thread 2, ThrottledRequestReaper-Produce,
SessionTracker, metrics-meter-tick-thread-2, main, Signal Dispatcher, /0:0:0:0:0:0:0:1:58020
to /0:0:0:0:0:0:0:1:45393 workers Thread 3, Reference Handler, ExpirationReaper-0-Produce,
ExpirationReaper-0-DeleteRecords, ThrottledRequestReaper-Fetch, ThrottledRequestReaper-Request,
kafka-request-handler-2, Test worker, SyncThread:0, ReplicaFetcherThread-0-1, Test worker-SendThread(127.0.0.1:49291),
NIOServerCxn.Factory:/127.0.0.1:0, Test worker-EventThread, ExpirationReaper-0-Fetch, ProcessThread(sid:0
cport:49291):, Finalizer, kafka-coordinator-heartbeat-thread | group1, metrics-meter-tick-thread-1)

kafka.integration.MinIsrConfigTest > classMethod STARTED

kafka.integration.MinIsrConfigTest > classMethod FAILED
    java.lang.AssertionError: Found unexpected threads, allThreads=Set(ZkClient-EventThread-41440-127.0.0.1:49291,
/0:0:0:0:0:0:0:1:58020 to /0:0:0:0:0:0:0:1:45393 workers Thread 2, ThrottledRequestReaper-Produce,
SessionTracker, metrics-meter-tick-thread-2, main, Signal Dispatcher, /0:0:0:0:0:0:0:1:58020
to /0:0:0:0:0:0:0:1:45393 workers Thread 3, Reference Handler, ExpirationReaper-0-Produce,
ExpirationReaper-0-DeleteRecords, ThrottledRequestReaper-Fetch, ThrottledRequestReaper-Request,
kafka-request-handler-2, Test worker, SyncThread:0, ReplicaFetcherThread-0-1, Test worker-SendThread(127.0.0.1:49291),
NIOServerCxn.Factory:/127.0.0.1:0, Test worker-EventThread, ExpirationReaper-0-Fetch, ProcessThread(sid:0
cport:49291):, Finalizer, kafka-coordinator-heartbeat-thread | group1, metrics-meter-tick-thread-1)

unit.kafka.server.KafkaApisTest > shouldRespondWithUnsupportedForMessageFormatOnHandleWriteTxnMarkersWhenMagicLowerThanRequired
STARTED

unit.kafka.server.KafkaApisTest > shouldRespondWithUnsupportedForMessageFormatOnHandleWriteTxnMarkersWhenMagicLowerThanRequired
PASSED

unit.kafka.server.KafkaApisTest > shouldThrowUnsupportedVersionExceptionOnHandleTxnOffsetCommitRequestWhenInterBrokerProtocolNotSupported
STARTED

unit.kafka.server.KafkaApisTest > shouldThrowUnsupportedVersionExceptionOnHandleTxnOffsetCommitRequestWhenInterBrokerProtocolNotSupported
PASSED

unit.kafka.server.KafkaApisTest > shouldThrowUnsupportedVersionExceptionOnHandleAddPartitionsToTxnRequestWhenInterBrokerProtocolNotSupported
STARTED

unit.kafka.server.KafkaApisTest > shouldThrowUnsupportedVersionExceptionOnHandleAddPartitionsToTxnRequestWhenInterBrokerProtocolNotSupported
PASSED

unit.kafka.server.KafkaApisTest > testReadUncommittedConsumerListOffsetLatest STARTED

unit.kafka.server.KafkaApisTest > testReadUncommittedConsumerListOffsetLatest PASSED

unit.kafka.server.KafkaApisTest > shouldAppendToLogOnWriteTxnMarkersWhenCorrectMagicVersion
STARTED

unit.kafka.server.KafkaApisTest > shouldAppendToLogOnWriteTxnMarkersWhenCorrectMagicVersion
PASSED

unit.kafka.server.KafkaApisTest > shouldThrowUnsupportedVersionExceptionOnHandleWriteTxnMarkersRequestWhenInterBrokerProtocolNotSupported
STARTED

unit.kafka.server.KafkaApisTest > shouldThrowUnsupportedVersionExceptionOnHandleWriteTxnMarkersRequestWhenInterBrokerProtocolNotSupported
PASSED

unit.kafka.server.KafkaApisTest > testReadCommittedConsumerListOffsetEarliestOffsetEqualsLastStableOffset
STARTED

unit.kafka.server.KafkaApisTest > testReadCommittedConsumerListOffsetEarliestOffsetEqualsLastStableOffset
PASSED

unit.kafka.server.KafkaApisTest > testReadCommittedConsumerListOffsetLatest STARTED

unit.kafka.server.KafkaApisTest > testReadCommittedConsumerListOffsetLatest PASSED

unit.kafka.server.KafkaApisTest > testReadCommittedConsumerListOffsetLimitedAtLastStableOffset
STARTED

unit.kafka.server.KafkaApisTest > testReadCommittedConsumerListOffsetLimitedAtLastStableOffset
PASSED

unit.kafka.server.KafkaApisTest > testReadUncommittedConsumerListOffsetEarliestOffsetEqualsHighWatermark
STARTED

unit.kafka.server.KafkaApisTest > testReadUncommittedConsumerListOffsetEarliestOffsetEqualsHighWatermark
PASSED

unit.kafka.server.KafkaApisTest > testReadUncommittedConsumerListOffsetLimitedAtHighWatermark
STARTED

unit.kafka.server.KafkaApisTest > testReadUncommittedConsumerListOffsetLimitedAtHighWatermark
PASSED

unit.kafka.server.KafkaApisTest > shouldThrowUnsupportedVersionExceptionOnHandleAddOffsetToTxnRequestWhenInterBrokerProtocolNotSupported
STARTED

unit.kafka.server.KafkaApisTest > shouldThrowUnsupportedVersionExceptionOnHandleAddOffsetToTxnRequestWhenInterBrokerProtocolNotSupported
PASSED

unit.kafka.server.KafkaApisTest > shouldRespondWithUnsupportedMessageFormatForBadPartitionAndNoErrorsForGoodPartition
STARTED

unit.kafka.server.KafkaApisTest > shouldRespondWithUnsupportedMessageFormatForBadPartitionAndNoErrorsForGoodPartition
PASSED

unit.kafka.server.KafkaApisTest > shouldThrowUnsupportedVersionExceptionOnHandleEndTxnRequestWhenInterBrokerProtocolNotSupported
STARTED

unit.kafka.server.KafkaApisTest > shouldThrowUnsupportedVersionExceptionOnHandleEndTxnRequestWhenInterBrokerProtocolNotSupported
PASSED

unit.kafka.admin.ResetConsumerGroupOffsetTest > classMethod STARTED

unit.kafka.admin.ResetConsumerGroupOffsetTest > classMethod FAILED
    java.lang.AssertionError: Found unexpected threads, allThreads=Set(ZkClient-EventThread-41440-127.0.0.1:49291,
/0:0:0:0:0:0:0:1:58020 to /0:0:0:0:0:0:0:1:45393 workers Thread 2, ThrottledRequestReaper-Produce,
SessionTracker, metrics-meter-tick-thread-2, main, Signal Dispatcher, /0:0:0:0:0:0:0:1:58020
to /0:0:0:0:0:0:0:1:45393 workers Thread 3, Reference Handler, ExpirationReaper-0-Produce,
ExpirationReaper-0-DeleteRecords, ThrottledRequestReaper-Fetch, ThrottledRequestReaper-Request,
kafka-request-handler-2, Test worker, SyncThread:0, ReplicaFetcherThread-0-1, Test worker-SendThread(127.0.0.1:49291),
NIOServerCxn.Factory:/127.0.0.1:0, Test worker-EventThread, ExpirationReaper-0-Fetch, ProcessThread(sid:0
cport:49291):, Finalizer, kafka-coordinator-heartbeat-thread | group1, metrics-meter-tick-thread-1)

unit.kafka.admin.ResetConsumerGroupOffsetTest > classMethod STARTED

unit.kafka.admin.ResetConsumerGroupOffsetTest > classMethod FAILED
    java.lang.AssertionError: Found unexpected threads, allThreads=Set(ZkClient-EventThread-41440-127.0.0.1:49291,
/0:0:0:0:0:0:0:1:58020 to /0:0:0:0:0:0:0:1:45393 workers Thread 2, ThrottledRequestReaper-Produce,
SessionTracker, metrics-meter-tick-thread-2, main, Signal Dispatcher, /0:0:0:0:0:0:0:1:58020
to /0:0:0:0:0:0:0:1:45393 workers Thread 3, Reference Handler, ExpirationReaper-0-Produce,
ExpirationReaper-0-DeleteRecords, ThrottledRequestReaper-Fetch, ThrottledRequestReaper-Request,
kafka-request-handler-2, Test worker, SyncThread:0, ReplicaFetcherThread-0-1, Test worker-SendThread(127.0.0.1:49291),
NIOServerCxn.Factory:/127.0.0.1:0, Test worker-EventThread, ExpirationReaper-0-Fetch, ProcessThread(sid:0
cport:49291):, Finalizer, kafka-coordinator-heartbeat-thread | group1, metrics-meter-tick-thread-1)

1264 tests completed, 74 failed, 2 skipped
:core:test FAILED

FAILURE: Build failed with an exception.

* What went wrong:
Execution failed for task ':core:test'.
> There were failing tests. See the report at: file://<https://builds.apache.org/job/kafka-trunk-jdk8/ws/core/build/reports/tests/test/index.html>

* Try:
Run with --stacktrace option to get the stack trace. Run with --info or --debug option to
get more log output.

BUILD FAILED

Total time: 55 mins 48.337 secs
Build step 'Execute shell' marked build as failure
[FINDBUGS] Collecting findbugs analysis files...
Setting GRADLE_3_4_RC_2_HOME=/home/jenkins/jenkins-slave/tools/hudson.plugins.gradle.GradleInstallation/Gradle_3.4-rc-2
[FINDBUGS] Searching for all files in <https://builds.apache.org/job/kafka-trunk-jdk8/ws/>
that match the pattern **/build/reports/findbugs/*.xml
[FINDBUGS] Parsing 2 files in <https://builds.apache.org/job/kafka-trunk-jdk8/ws/>
[FINDBUGS] Successfully parsed file <https://builds.apache.org/job/kafka-trunk-jdk8/ws/clients/build/reports/findbugs/main.xml>
with 0 unique warnings and 0 duplicates.
[FINDBUGS] Successfully parsed file <https://builds.apache.org/job/kafka-trunk-jdk8/ws/core/build/reports/findbugs/main.xml>
with 0 unique warnings and 0 duplicates.
[FINDBUGS] Computing warning deltas based on reference build #1779
Recording test results
Setting GRADLE_3_4_RC_2_HOME=/home/jenkins/jenkins-slave/tools/hudson.plugins.gradle.GradleInstallation/Gradle_3.4-rc-2
Setting GRADLE_3_4_RC_2_HOME=/home/jenkins/jenkins-slave/tools/hudson.plugins.gradle.GradleInstallation/Gradle_3.4-rc-2
Not sending mail to unregistered user damian.guy@gmail.com

Mime
View raw message