kafka-dev mailing list archives

Site index · List index
Message view « Date » · « Thread »
Top « Date » · « Thread »
From Apache Jenkins Server <jenk...@builds.apache.org>
Subject Build failed in Jenkins: kafka-0.10.2-jdk7 #66
Date Mon, 06 Feb 2017 22:11:45 GMT
See <https://builds.apache.org/job/kafka-0.10.2-jdk7/66/changes>

Changes:

[junrao] KAFKA-4441; Monitoring incorrect during topic creation and deletion

------------------------------------------
[...truncated 4100 lines...]

kafka.api.ProducerFailureHandlingTest > testNotEnoughReplicas STARTED

kafka.api.ProducerFailureHandlingTest > testNotEnoughReplicas PASSED

kafka.api.ProducerFailureHandlingTest > testResponseTooLargeForReplicationWithAckAll STARTED

kafka.api.ProducerFailureHandlingTest > testResponseTooLargeForReplicationWithAckAll PASSED

kafka.api.ProducerFailureHandlingTest > testNonExistentTopic STARTED

kafka.api.ProducerFailureHandlingTest > testNonExistentTopic PASSED

kafka.api.ProducerFailureHandlingTest > testInvalidPartition STARTED

kafka.api.ProducerFailureHandlingTest > testInvalidPartition PASSED

kafka.api.ProducerFailureHandlingTest > testSendAfterClosed STARTED

kafka.api.ProducerFailureHandlingTest > testSendAfterClosed PASSED

kafka.api.ProducerFailureHandlingTest > testTooLargeRecordWithAckZero STARTED

kafka.api.ProducerFailureHandlingTest > testTooLargeRecordWithAckZero PASSED

kafka.api.ProducerFailureHandlingTest > testPartitionTooLargeForReplicationWithAckAll STARTED

kafka.api.ProducerFailureHandlingTest > testPartitionTooLargeForReplicationWithAckAll PASSED

kafka.api.ProducerFailureHandlingTest > testNotEnoughReplicasAfterBrokerShutdown STARTED

kafka.api.ProducerFailureHandlingTest > testNotEnoughReplicasAfterBrokerShutdown PASSED

kafka.api.SslConsumerTest > testCoordinatorFailover STARTED

kafka.api.SslConsumerTest > testCoordinatorFailover PASSED

kafka.api.SslConsumerTest > testSimpleConsumption STARTED

kafka.api.SslConsumerTest > testSimpleConsumption PASSED

kafka.api.RequestResponseSerializationTest > testSerializationAndDeserialization STARTED

kafka.api.RequestResponseSerializationTest > testSerializationAndDeserialization PASSED

kafka.api.RequestResponseSerializationTest > testFetchResponseVersion STARTED

kafka.api.RequestResponseSerializationTest > testFetchResponseVersion PASSED

kafka.api.RequestResponseSerializationTest > testProduceResponseVersion STARTED

kafka.api.RequestResponseSerializationTest > testProduceResponseVersion PASSED

kafka.api.SaslPlainPlaintextConsumerTest > testCoordinatorFailover STARTED

kafka.api.SaslPlainPlaintextConsumerTest > testCoordinatorFailover PASSED

kafka.api.SaslPlainPlaintextConsumerTest > testSimpleConsumption STARTED

kafka.api.SaslPlainPlaintextConsumerTest > testSimpleConsumption PASSED

kafka.api.SslEndToEndAuthorizationTest > testNoConsumeWithoutDescribeAclViaSubscribe STARTED

kafka.api.SslEndToEndAuthorizationTest > testNoConsumeWithoutDescribeAclViaSubscribe PASSED

kafka.api.SslEndToEndAuthorizationTest > testProduceConsumeViaAssign STARTED

kafka.api.SslEndToEndAuthorizationTest > testProduceConsumeViaAssign PASSED

kafka.api.SslEndToEndAuthorizationTest > testNoConsumeWithDescribeAclViaAssign STARTED

kafka.api.SslEndToEndAuthorizationTest > testNoConsumeWithDescribeAclViaAssign PASSED

kafka.api.SslEndToEndAuthorizationTest > testNoConsumeWithDescribeAclViaSubscribe STARTED

kafka.api.SslEndToEndAuthorizationTest > testNoConsumeWithDescribeAclViaSubscribe PASSED

kafka.api.SslEndToEndAuthorizationTest > testNoConsumeWithoutDescribeAclViaAssign STARTED

kafka.api.SslEndToEndAuthorizationTest > testNoConsumeWithoutDescribeAclViaAssign PASSED

kafka.api.SslEndToEndAuthorizationTest > testNoGroupAcl STARTED

kafka.api.SslEndToEndAuthorizationTest > testNoGroupAcl PASSED

kafka.api.SslEndToEndAuthorizationTest > testNoProduceWithDescribeAcl STARTED

kafka.api.SslEndToEndAuthorizationTest > testNoProduceWithDescribeAcl PASSED

kafka.api.SslEndToEndAuthorizationTest > testProduceConsumeViaSubscribe STARTED

kafka.api.SslEndToEndAuthorizationTest > testProduceConsumeViaSubscribe PASSED

kafka.api.SslEndToEndAuthorizationTest > testNoProduceWithoutDescribeAcl STARTED

kafka.api.SslEndToEndAuthorizationTest > testNoProduceWithoutDescribeAcl PASSED

kafka.api.SaslMultiMechanismConsumerTest > testMultipleBrokerMechanisms STARTED

kafka.api.SaslMultiMechanismConsumerTest > testMultipleBrokerMechanisms PASSED

kafka.api.SaslMultiMechanismConsumerTest > testCoordinatorFailover STARTED

kafka.api.SaslMultiMechanismConsumerTest > testCoordinatorFailover PASSED

kafka.api.SaslMultiMechanismConsumerTest > testSimpleConsumption STARTED

kafka.api.SaslMultiMechanismConsumerTest > testSimpleConsumption PASSED

kafka.api.SaslPlainSslEndToEndAuthorizationTest > testTwoConsumersWithDifferentSaslCredentials
STARTED

kafka.api.SaslPlainSslEndToEndAuthorizationTest > testTwoConsumersWithDifferentSaslCredentials
PASSED

kafka.api.SaslPlainSslEndToEndAuthorizationTest > testNoConsumeWithoutDescribeAclViaSubscribe
STARTED

kafka.api.SaslPlainSslEndToEndAuthorizationTest > testNoConsumeWithoutDescribeAclViaSubscribe
PASSED

kafka.api.SaslPlainSslEndToEndAuthorizationTest > testProduceConsumeViaAssign STARTED

kafka.api.SaslPlainSslEndToEndAuthorizationTest > testProduceConsumeViaAssign PASSED

kafka.api.SaslPlainSslEndToEndAuthorizationTest > testNoConsumeWithDescribeAclViaAssign
STARTED

kafka.api.SaslPlainSslEndToEndAuthorizationTest > testNoConsumeWithDescribeAclViaAssign
PASSED

kafka.api.SaslPlainSslEndToEndAuthorizationTest > testNoConsumeWithDescribeAclViaSubscribe
STARTED

kafka.api.SaslPlainSslEndToEndAuthorizationTest > testNoConsumeWithDescribeAclViaSubscribe
PASSED

kafka.api.SaslPlainSslEndToEndAuthorizationTest > testNoConsumeWithoutDescribeAclViaAssign
STARTED

kafka.api.SaslPlainSslEndToEndAuthorizationTest > testNoConsumeWithoutDescribeAclViaAssign
PASSED

kafka.api.SaslPlainSslEndToEndAuthorizationTest > testNoGroupAcl STARTED

kafka.api.SaslPlainSslEndToEndAuthorizationTest > testNoGroupAcl PASSED

kafka.api.SaslPlainSslEndToEndAuthorizationTest > testNoProduceWithDescribeAcl STARTED

kafka.api.SaslPlainSslEndToEndAuthorizationTest > testNoProduceWithDescribeAcl PASSED

kafka.api.SaslPlainSslEndToEndAuthorizationTest > testProduceConsumeViaSubscribe STARTED

kafka.api.SaslPlainSslEndToEndAuthorizationTest > testProduceConsumeViaSubscribe PASSED

kafka.api.SaslPlainSslEndToEndAuthorizationTest > testNoProduceWithoutDescribeAcl STARTED

kafka.api.SaslPlainSslEndToEndAuthorizationTest > testNoProduceWithoutDescribeAcl PASSED

kafka.api.SaslSslConsumerTest > testCoordinatorFailover STARTED

kafka.api.SaslSslConsumerTest > testCoordinatorFailover PASSED

kafka.api.SaslSslConsumerTest > testSimpleConsumption STARTED

kafka.api.SaslSslConsumerTest > testSimpleConsumption PASSED

kafka.api.SaslScramSslEndToEndAuthorizationTest > testTwoConsumersWithDifferentSaslCredentials
STARTED

kafka.api.SaslScramSslEndToEndAuthorizationTest > testTwoConsumersWithDifferentSaslCredentials
PASSED

kafka.api.SaslScramSslEndToEndAuthorizationTest > testNoConsumeWithoutDescribeAclViaSubscribe
STARTED

kafka.api.SaslScramSslEndToEndAuthorizationTest > testNoConsumeWithoutDescribeAclViaSubscribe
PASSED

kafka.api.SaslScramSslEndToEndAuthorizationTest > testProduceConsumeViaAssign STARTED

kafka.api.SaslScramSslEndToEndAuthorizationTest > testProduceConsumeViaAssign PASSED

kafka.api.SaslScramSslEndToEndAuthorizationTest > testNoConsumeWithDescribeAclViaAssign
STARTED

kafka.api.SaslScramSslEndToEndAuthorizationTest > testNoConsumeWithDescribeAclViaAssign
PASSED

kafka.api.SaslScramSslEndToEndAuthorizationTest > testNoConsumeWithDescribeAclViaSubscribe
STARTED

kafka.api.SaslScramSslEndToEndAuthorizationTest > testNoConsumeWithDescribeAclViaSubscribe
PASSED

kafka.api.SaslScramSslEndToEndAuthorizationTest > testNoConsumeWithoutDescribeAclViaAssign
STARTED

kafka.api.SaslScramSslEndToEndAuthorizationTest > testNoConsumeWithoutDescribeAclViaAssign
PASSED

kafka.api.SaslScramSslEndToEndAuthorizationTest > testNoGroupAcl STARTED

kafka.api.SaslScramSslEndToEndAuthorizationTest > testNoGroupAcl PASSED

kafka.api.SaslScramSslEndToEndAuthorizationTest > testNoProduceWithDescribeAcl STARTED

kafka.api.SaslScramSslEndToEndAuthorizationTest > testNoProduceWithDescribeAcl PASSED

kafka.api.SaslScramSslEndToEndAuthorizationTest > testProduceConsumeViaSubscribe STARTED

kafka.api.SaslScramSslEndToEndAuthorizationTest > testProduceConsumeViaSubscribe PASSED

kafka.api.SaslScramSslEndToEndAuthorizationTest > testNoProduceWithoutDescribeAcl STARTED

kafka.api.SaslScramSslEndToEndAuthorizationTest > testNoProduceWithoutDescribeAcl PASSED

kafka.javaapi.consumer.ZookeeperConsumerConnectorTest > testBasic STARTED

kafka.javaapi.consumer.ZookeeperConsumerConnectorTest > testBasic PASSED

kafka.javaapi.message.ByteBufferMessageSetTest > testSizeInBytesWithCompression STARTED

kafka.javaapi.message.ByteBufferMessageSetTest > testSizeInBytesWithCompression PASSED

kafka.javaapi.message.ByteBufferMessageSetTest > testIteratorIsConsistentWithCompression
STARTED

kafka.javaapi.message.ByteBufferMessageSetTest > testIteratorIsConsistentWithCompression
PASSED

kafka.javaapi.message.ByteBufferMessageSetTest > testIteratorIsConsistent STARTED

kafka.javaapi.message.ByteBufferMessageSetTest > testIteratorIsConsistent PASSED

kafka.javaapi.message.ByteBufferMessageSetTest > testEqualsWithCompression STARTED

kafka.javaapi.message.ByteBufferMessageSetTest > testEqualsWithCompression PASSED

kafka.javaapi.message.ByteBufferMessageSetTest > testWrittenEqualsRead STARTED

kafka.javaapi.message.ByteBufferMessageSetTest > testWrittenEqualsRead PASSED

kafka.javaapi.message.ByteBufferMessageSetTest > testEquals STARTED

kafka.javaapi.message.ByteBufferMessageSetTest > testEquals PASSED

kafka.javaapi.message.ByteBufferMessageSetTest > testSizeInBytes STARTED

kafka.javaapi.message.ByteBufferMessageSetTest > testSizeInBytes PASSED

1042 tests completed, 1 failed
:kafka-0.10.2-jdk7:core:test FAILED
:test_core_2_10 FAILED

FAILURE: Build failed with an exception.

* What went wrong:
Execution failed for task ':core:test'.
> There were failing tests. See the report at: file://<https://builds.apache.org/job/kafka-0.10.2-jdk7/ws/core/build/reports/tests/test/index.html>

* Try:
Run with --stacktrace option to get the stack trace. Run with --info or --debug option to
get more log output.

BUILD FAILED

Total time: 41 mins 39.361 secs
Build step 'Execute shell' marked build as failure
Recording test results
Setting GRADLE_2_4_RC_2_HOME=/home/jenkins/jenkins-slave/tools/hudson.plugins.gradle.GradleInstallation/Gradle_2.4-rc-2
Setting GRADLE_2_4_RC_2_HOME=/home/jenkins/jenkins-slave/tools/hudson.plugins.gradle.GradleInstallation/Gradle_2.4-rc-2

Mime
View raw message