kafka-dev mailing list archives

Site index · List index
Message view « Date » · « Thread »
Top « Date » · « Thread »
From "Guozhang Wang (JIRA)" <j...@apache.org>
Subject [jira] [Commented] (KAFKA-3877) Gradle compiler daemon exits with non-zero exit code while running LogOffsetTest
Date Fri, 01 Jul 2016 17:29:11 GMT

    [ https://issues.apache.org/jira/browse/KAFKA-3877?page=com.atlassian.jira.plugin.system.issuetabpanels:comment-tabpanel&focusedCommentId=15359335#comment-15359335
] 

Guozhang Wang commented on KAFKA-3877:
--------------------------------------

Just saw another one of this test case failure: https://builds.apache.org/job/kafka-trunk-git-pr-jdk7/4497/console

> Gradle compiler daemon exits with non-zero exit code while running LogOffsetTest
> --------------------------------------------------------------------------------
>
>                 Key: KAFKA-3877
>                 URL: https://issues.apache.org/jira/browse/KAFKA-3877
>             Project: Kafka
>          Issue Type: Sub-task
>            Reporter: Ismael Juma
>              Labels: transient-unit-test-failure
>
> This happened in a recent build:
> {code}
> kafka.server.LogOffsetTest > testGetOffsetsBeforeNow STARTED
> :kafka-trunk-jdk8:core:test FAILED
> :test_core_2_11 FAILED
> FAILURE: Build failed with an exception.
> * What went wrong:
> Execution failed for task ':test_core_2_11'.
> > Process 'Gradle Compiler Daemon 1' finished with non-zero exit value 137
> {code}
> https://builds.apache.org/job/kafka-trunk-jdk8/702



--
This message was sent by Atlassian JIRA
(v6.3.4#6332)

Mime
View raw message