kafka-dev mailing list archives

Site index · List index
Message view « Date » · « Thread »
Top « Date » · « Thread »
From Apache Jenkins Server <jenk...@builds.apache.org>
Subject Build failed in Jenkins: kafka-trunk-jdk8 #733
Date Tue, 05 Jul 2016 03:31:16 GMT
See <https://builds.apache.org/job/kafka-trunk-jdk8/733/changes>

Changes:

[wangguoz] MINOR: Fix few documentation errors in streams quickstart

------------------------------------------
[...truncated 1909 lines...]
kafka.api.SaslMultiMechanismConsumerTest > testSimpleConsumption PASSED

kafka.api.SaslMultiMechanismConsumerTest > testPartitionReassignmentCallback STARTED

kafka.api.SaslMultiMechanismConsumerTest > testPartitionReassignmentCallback PASSED

kafka.api.SaslMultiMechanismConsumerTest > testCommitSpecifiedOffsets STARTED

kafka.api.SaslMultiMechanismConsumerTest > testCommitSpecifiedOffsets PASSED

kafka.api.PlaintextProducerSendTest > testSerializerConstructors STARTED

kafka.api.PlaintextProducerSendTest > testSerializerConstructors PASSED

kafka.api.PlaintextProducerSendTest > testWrongSerializer STARTED

kafka.api.PlaintextProducerSendTest > testWrongSerializer PASSED

kafka.api.PlaintextProducerSendTest > testSendNonCompressedMessageWithCreateTime STARTED

kafka.api.PlaintextProducerSendTest > testSendNonCompressedMessageWithCreateTime PASSED

kafka.api.PlaintextProducerSendTest > testSendCompressedMessageWithLogAppendTime STARTED

kafka.api.PlaintextProducerSendTest > testSendCompressedMessageWithLogAppendTime PASSED

kafka.api.PlaintextProducerSendTest > testClose STARTED

kafka.api.PlaintextProducerSendTest > testClose PASSED

kafka.api.PlaintextProducerSendTest > testFlush STARTED

kafka.api.PlaintextProducerSendTest > testFlush PASSED

kafka.api.PlaintextProducerSendTest > testSendToPartition STARTED

kafka.api.PlaintextProducerSendTest > testSendToPartition PASSED

kafka.api.PlaintextProducerSendTest > testSendOffset STARTED

kafka.api.PlaintextProducerSendTest > testSendOffset PASSED

kafka.api.PlaintextProducerSendTest > testAutoCreateTopic STARTED

kafka.api.PlaintextProducerSendTest > testAutoCreateTopic PASSED

kafka.api.PlaintextProducerSendTest > testSendWithInvalidCreateTime STARTED

kafka.api.PlaintextProducerSendTest > testSendWithInvalidCreateTime PASSED

kafka.api.PlaintextProducerSendTest > testSendCompressedMessageWithCreateTime STARTED

kafka.api.PlaintextProducerSendTest > testSendCompressedMessageWithCreateTime PASSED

kafka.api.PlaintextProducerSendTest > testCloseWithZeroTimeoutFromCallerThread STARTED

kafka.api.PlaintextProducerSendTest > testCloseWithZeroTimeoutFromCallerThread PASSED

kafka.api.PlaintextProducerSendTest > testCloseWithZeroTimeoutFromSenderThread STARTED

kafka.api.PlaintextProducerSendTest > testCloseWithZeroTimeoutFromSenderThread PASSED

kafka.api.PlaintextProducerSendTest > testSendNonCompressedMessageWithLogApendTime STARTED

kafka.api.PlaintextProducerSendTest > testSendNonCompressedMessageWithLogApendTime PASSED

kafka.api.ProducerFailureHandlingTest > testCannotSendToInternalTopic STARTED

kafka.api.ProducerFailureHandlingTest > testCannotSendToInternalTopic PASSED

kafka.api.ProducerFailureHandlingTest > testTooLargeRecordWithAckOne STARTED

kafka.api.ProducerFailureHandlingTest > testTooLargeRecordWithAckOne PASSED

kafka.api.ProducerFailureHandlingTest > testWrongBrokerList STARTED

kafka.api.ProducerFailureHandlingTest > testWrongBrokerList PASSED

kafka.api.ProducerFailureHandlingTest > testNotEnoughReplicas STARTED

kafka.api.ProducerFailureHandlingTest > testNotEnoughReplicas PASSED

kafka.api.ProducerFailureHandlingTest > testNonExistentTopic STARTED

kafka.api.ProducerFailureHandlingTest > testNonExistentTopic PASSED

kafka.api.ProducerFailureHandlingTest > testInvalidPartition STARTED

kafka.api.ProducerFailureHandlingTest > testInvalidPartition PASSED

kafka.api.ProducerFailureHandlingTest > testSendAfterClosed STARTED

kafka.api.ProducerFailureHandlingTest > testSendAfterClosed PASSED

kafka.api.ProducerFailureHandlingTest > testTooLargeRecordWithAckZero STARTED

kafka.api.ProducerFailureHandlingTest > testTooLargeRecordWithAckZero PASSED

kafka.api.ProducerFailureHandlingTest > testNotEnoughReplicasAfterBrokerShutdown STARTED

kafka.api.ProducerFailureHandlingTest > testNotEnoughReplicasAfterBrokerShutdown PASSED

kafka.api.SslProducerSendTest > testSendNonCompressedMessageWithCreateTime STARTED

kafka.api.SslProducerSendTest > testSendNonCompressedMessageWithCreateTime PASSED

kafka.api.SslProducerSendTest > testSendCompressedMessageWithLogAppendTime STARTED

kafka.api.SslProducerSendTest > testSendCompressedMessageWithLogAppendTime PASSED

kafka.api.SslProducerSendTest > testClose STARTED

kafka.api.SslProducerSendTest > testClose PASSED

kafka.api.SslProducerSendTest > testFlush STARTED

kafka.api.SslProducerSendTest > testFlush PASSED

kafka.api.SslProducerSendTest > testSendToPartition STARTED

kafka.api.SslProducerSendTest > testSendToPartition PASSED

kafka.api.SslProducerSendTest > testSendOffset STARTED

kafka.api.SslProducerSendTest > testSendOffset PASSED

kafka.api.SslProducerSendTest > testAutoCreateTopic STARTED

kafka.api.SslProducerSendTest > testAutoCreateTopic PASSED

kafka.api.SslProducerSendTest > testSendWithInvalidCreateTime STARTED

kafka.api.SslProducerSendTest > testSendWithInvalidCreateTime PASSED

kafka.api.SslProducerSendTest > testSendCompressedMessageWithCreateTime STARTED

kafka.api.SslProducerSendTest > testSendCompressedMessageWithCreateTime PASSED

kafka.api.SslProducerSendTest > testCloseWithZeroTimeoutFromCallerThread STARTED

kafka.api.SslProducerSendTest > testCloseWithZeroTimeoutFromCallerThread PASSED

kafka.api.SslProducerSendTest > testCloseWithZeroTimeoutFromSenderThread STARTED

kafka.api.SslProducerSendTest > testCloseWithZeroTimeoutFromSenderThread PASSED

kafka.api.SslProducerSendTest > testSendNonCompressedMessageWithLogApendTime STARTED

kafka.api.SslProducerSendTest > testSendNonCompressedMessageWithLogApendTime PASSED

kafka.api.SaslPlainPlaintextConsumerTest > testPauseStateNotPreservedByRebalance STARTED

kafka.api.SaslPlainPlaintextConsumerTest > testPauseStateNotPreservedByRebalance PASSED

kafka.api.SaslPlainPlaintextConsumerTest > testUnsubscribeTopic STARTED

kafka.api.SaslPlainPlaintextConsumerTest > testUnsubscribeTopic PASSED

kafka.api.SaslPlainPlaintextConsumerTest > testListTopics STARTED

kafka.api.SaslPlainPlaintextConsumerTest > testListTopics PASSED

kafka.api.SaslPlainPlaintextConsumerTest > testAutoCommitOnRebalance STARTED

kafka.api.SaslPlainPlaintextConsumerTest > testAutoCommitOnRebalance PASSED

kafka.api.SaslPlainPlaintextConsumerTest > testSimpleConsumption STARTED

kafka.api.SaslPlainPlaintextConsumerTest > testSimpleConsumption PASSED

kafka.api.SaslPlainPlaintextConsumerTest > testPartitionReassignmentCallback STARTED

kafka.api.SaslPlainPlaintextConsumerTest > testPartitionReassignmentCallback PASSED

kafka.api.SaslPlainPlaintextConsumerTest > testCommitSpecifiedOffsets STARTED

kafka.api.SaslPlainPlaintextConsumerTest > testCommitSpecifiedOffsets PASSED

kafka.api.SaslPlaintextConsumerTest > testPauseStateNotPreservedByRebalance STARTED

kafka.api.SaslPlaintextConsumerTest > testPauseStateNotPreservedByRebalance PASSED

kafka.api.SaslPlaintextConsumerTest > testUnsubscribeTopic STARTED

kafka.api.SaslPlaintextConsumerTest > testUnsubscribeTopic PASSED

kafka.api.SaslPlaintextConsumerTest > testListTopics STARTED

kafka.api.SaslPlaintextConsumerTest > testListTopics PASSED

kafka.api.SaslPlaintextConsumerTest > testAutoCommitOnRebalance STARTED

kafka.api.SaslPlaintextConsumerTest > testAutoCommitOnRebalance PASSED

kafka.api.SaslPlaintextConsumerTest > testSimpleConsumption STARTED

kafka.api.SaslPlaintextConsumerTest > testSimpleConsumption PASSED

kafka.api.SaslPlaintextConsumerTest > testPartitionReassignmentCallback STARTED

kafka.api.SaslPlaintextConsumerTest > testPartitionReassignmentCallback PASSED

kafka.api.SaslPlaintextConsumerTest > testCommitSpecifiedOffsets STARTED

kafka.api.SaslPlaintextConsumerTest > testCommitSpecifiedOffsets PASSED

kafka.api.SaslSslConsumerTest > testPauseStateNotPreservedByRebalance STARTED

kafka.api.SaslSslConsumerTest > testPauseStateNotPreservedByRebalance PASSED

kafka.api.SaslSslConsumerTest > testUnsubscribeTopic STARTED

kafka.api.SaslSslConsumerTest > testUnsubscribeTopic PASSED

kafka.api.SaslSslConsumerTest > testListTopics STARTED

kafka.api.SaslSslConsumerTest > testListTopics PASSED

kafka.api.SaslSslConsumerTest > testAutoCommitOnRebalance STARTED

kafka.api.SaslSslConsumerTest > testAutoCommitOnRebalance PASSED

kafka.api.SaslSslConsumerTest > testSimpleConsumption STARTED

kafka.api.SaslSslConsumerTest > testSimpleConsumption PASSED

kafka.api.SaslSslConsumerTest > testPartitionReassignmentCallback STARTED
:kafka-trunk-jdk8:core:test FAILED
:test_core_2_10 FAILED

FAILURE: Build failed with an exception.

* What went wrong:
Execution failed for task ':core:test'.
> Process 'Gradle Test Executor 1' finished with non-zero exit value 137

* Try:
Run with --stacktrace option to get the stack trace. Run with --info or --debug option to
get more log output.

BUILD FAILED

Total time: 18 mins 2.93 secs
Build step 'Execute shell' marked build as failure
Recording test results
Setting GRADLE_2_4_RC_2_HOME=/home/jenkins/jenkins-slave/tools/hudson.plugins.gradle.GradleInstallation/Gradle_2.4-rc-2
Setting JDK1_8_0_66_HOME=/home/jenkins/jenkins-slave/tools/hudson.model.JDK/jdk1.8.0_66
ERROR: Step ‘Publish JUnit test result report’ failed: No test report files were found.
Configuration error?
Setting GRADLE_2_4_RC_2_HOME=/home/jenkins/jenkins-slave/tools/hudson.plugins.gradle.GradleInstallation/Gradle_2.4-rc-2
Setting JDK1_8_0_66_HOME=/home/jenkins/jenkins-slave/tools/hudson.model.JDK/jdk1.8.0_66

Mime
View raw message