kafka-dev mailing list archives

Site index · List index
Message view « Date » · « Thread »
Top « Date » · « Thread »
From Apache Jenkins Server <jenk...@builds.apache.org>
Subject Build failed in Jenkins: kafka-trunk-jdk8 #729
Date Sat, 02 Jul 2016 00:21:24 GMT
See <https://builds.apache.org/job/kafka-trunk-jdk8/729/changes>

Changes:

[wangguoz] KAFKA-3902: Optimize KTable.filter in Streams DSL to avoid forwarding if

------------------------------------------
[...truncated 1113 lines...]
kafka.server.KafkaConfigTest > testDuplicateListeners PASSED

kafka.server.KafkaConfigTest > testLogRetentionUnlimited STARTED

kafka.server.KafkaConfigTest > testLogRetentionUnlimited PASSED

kafka.server.KafkaConfigTest > testLogRetentionTimeMsProvided STARTED

kafka.server.KafkaConfigTest > testLogRetentionTimeMsProvided PASSED

kafka.server.KafkaConfigTest > testLogRollTimeNoConfigProvided STARTED

kafka.server.KafkaConfigTest > testLogRollTimeNoConfigProvided PASSED

kafka.server.KafkaConfigTest > testInvalidInterBrokerSecurityProtocol STARTED

kafka.server.KafkaConfigTest > testInvalidInterBrokerSecurityProtocol PASSED

kafka.server.KafkaConfigTest > testAdvertiseDefaults STARTED

kafka.server.KafkaConfigTest > testAdvertiseDefaults PASSED

kafka.server.KafkaConfigTest > testBadListenerProtocol STARTED

kafka.server.KafkaConfigTest > testBadListenerProtocol PASSED

kafka.server.KafkaConfigTest > testListenerDefaults STARTED

kafka.server.KafkaConfigTest > testListenerDefaults PASSED

kafka.server.KafkaConfigTest > testLogRetentionTimeBothMinutesAndHoursProvided STARTED

kafka.server.KafkaConfigTest > testLogRetentionTimeBothMinutesAndHoursProvided PASSED

kafka.server.KafkaConfigTest > testUncleanElectionDisabled STARTED

kafka.server.KafkaConfigTest > testUncleanElectionDisabled PASSED

kafka.server.KafkaConfigTest > testLogRetentionTimeNoConfigProvided STARTED

kafka.server.KafkaConfigTest > testLogRetentionTimeNoConfigProvided PASSED

kafka.server.KafkaConfigTest > testCaseInsensitiveListenerProtocol STARTED

kafka.server.KafkaConfigTest > testCaseInsensitiveListenerProtocol PASSED

kafka.server.KafkaConfigTest > testFromPropsInvalid STARTED

kafka.server.KafkaConfigTest > testFromPropsInvalid PASSED

kafka.server.KafkaConfigTest > testInvalidCompressionType STARTED

kafka.server.KafkaConfigTest > testInvalidCompressionType PASSED

kafka.server.KafkaConfigTest > testAdvertiseHostNameDefault STARTED

kafka.server.KafkaConfigTest > testAdvertiseHostNameDefault PASSED

kafka.server.KafkaConfigTest > testLogRetentionTimeMinutesProvided STARTED

kafka.server.KafkaConfigTest > testLogRetentionTimeMinutesProvided PASSED

kafka.server.KafkaConfigTest > testValidCompressionType STARTED

kafka.server.KafkaConfigTest > testValidCompressionType PASSED

kafka.server.KafkaConfigTest > testUncleanElectionInvalid STARTED

kafka.server.KafkaConfigTest > testUncleanElectionInvalid PASSED

kafka.server.KafkaConfigTest > testLogRetentionTimeBothMinutesAndMsProvided STARTED

kafka.server.KafkaConfigTest > testLogRetentionTimeBothMinutesAndMsProvided PASSED

kafka.server.KafkaConfigTest > testLogRollTimeMsProvided STARTED

kafka.server.KafkaConfigTest > testLogRollTimeMsProvided PASSED

kafka.server.KafkaConfigTest > testUncleanLeaderElectionDefault STARTED

kafka.server.KafkaConfigTest > testUncleanLeaderElectionDefault PASSED

kafka.server.KafkaConfigTest > testInvalidAdvertisedListenersProtocol STARTED

kafka.server.KafkaConfigTest > testInvalidAdvertisedListenersProtocol PASSED

kafka.server.KafkaConfigTest > testUncleanElectionEnabled STARTED

kafka.server.KafkaConfigTest > testUncleanElectionEnabled PASSED

kafka.server.KafkaConfigTest > testAdvertisePortDefault STARTED

kafka.server.KafkaConfigTest > testAdvertisePortDefault PASSED

kafka.server.KafkaConfigTest > testVersionConfiguration STARTED

kafka.server.KafkaConfigTest > testVersionConfiguration PASSED

kafka.server.KafkaConfigTest > testEqualAdvertisedListenersProtocol STARTED

kafka.server.KafkaConfigTest > testEqualAdvertisedListenersProtocol PASSED

kafka.server.MetadataRequestTest > testReplicaDownResponse STARTED

kafka.server.MetadataRequestTest > testReplicaDownResponse PASSED

kafka.server.MetadataRequestTest > testRack STARTED

kafka.server.MetadataRequestTest > testRack PASSED

kafka.server.MetadataRequestTest > testIsInternal STARTED

kafka.server.MetadataRequestTest > testIsInternal PASSED

kafka.server.MetadataRequestTest > testControllerId STARTED

kafka.server.MetadataRequestTest > testControllerId PASSED

kafka.server.MetadataRequestTest > testAllTopicsRequest STARTED

kafka.server.MetadataRequestTest > testAllTopicsRequest PASSED

kafka.server.MetadataRequestTest > testNoTopicsRequest STARTED

kafka.server.MetadataRequestTest > testNoTopicsRequest PASSED

kafka.server.SimpleFetchTest > testReadFromLog STARTED

kafka.server.SimpleFetchTest > testReadFromLog PASSED

kafka.server.ProduceRequestTest > testSimpleProduceRequest STARTED

kafka.server.ProduceRequestTest > testSimpleProduceRequest PASSED

kafka.server.ProduceRequestTest > testCorruptLz4ProduceRequest STARTED

kafka.server.ProduceRequestTest > testCorruptLz4ProduceRequest PASSED

kafka.server.DelayedOperationTest > testRequestPurge STARTED

kafka.server.DelayedOperationTest > testRequestPurge PASSED

kafka.server.DelayedOperationTest > testRequestExpiry STARTED

kafka.server.DelayedOperationTest > testRequestExpiry PASSED

kafka.server.DelayedOperationTest > testRequestSatisfaction STARTED

kafka.server.DelayedOperationTest > testRequestSatisfaction PASSED

kafka.server.LogRecoveryTest > testHWCheckpointNoFailuresMultipleLogSegments STARTED

kafka.server.LogRecoveryTest > testHWCheckpointNoFailuresMultipleLogSegments PASSED

kafka.server.LogRecoveryTest > testHWCheckpointWithFailuresMultipleLogSegments STARTED

kafka.server.LogRecoveryTest > testHWCheckpointWithFailuresMultipleLogSegments PASSED

kafka.server.LogRecoveryTest > testHWCheckpointNoFailuresSingleLogSegment STARTED

kafka.server.LogRecoveryTest > testHWCheckpointNoFailuresSingleLogSegment PASSED

kafka.server.LogRecoveryTest > testHWCheckpointWithFailuresSingleLogSegment STARTED

kafka.server.LogRecoveryTest > testHWCheckpointWithFailuresSingleLogSegment PASSED

kafka.server.AbstractFetcherThreadTest > testConsumerLagRemovedWithPartition STARTED

kafka.server.AbstractFetcherThreadTest > testConsumerLagRemovedWithPartition PASSED

kafka.server.AbstractFetcherThreadTest > testMetricsRemovedOnShutdown STARTED

kafka.server.AbstractFetcherThreadTest > testMetricsRemovedOnShutdown PASSED

kafka.server.ServerShutdownTest > testCleanShutdownAfterFailedStartup STARTED

kafka.server.ServerShutdownTest > testCleanShutdownAfterFailedStartup PASSED

kafka.server.ServerShutdownTest > testConsecutiveShutdown STARTED

kafka.server.ServerShutdownTest > testConsecutiveShutdown PASSED

kafka.server.ServerShutdownTest > testCleanShutdown STARTED

kafka.server.ServerShutdownTest > testCleanShutdown PASSED

kafka.server.ServerShutdownTest > testCleanShutdownWithDeleteTopicEnabled STARTED

kafka.server.ServerShutdownTest > testCleanShutdownWithDeleteTopicEnabled PASSED

kafka.server.ServerStartupTest > testBrokerStateRunningAfterZK STARTED

kafka.server.ServerStartupTest > testBrokerStateRunningAfterZK PASSED

kafka.server.ServerStartupTest > testBrokerCreatesZKChroot STARTED

kafka.server.ServerStartupTest > testBrokerCreatesZKChroot PASSED

kafka.server.ServerStartupTest > testConflictBrokerRegistration STARTED

kafka.server.ServerStartupTest > testConflictBrokerRegistration PASSED

kafka.server.ServerStartupTest > testBrokerSelfAware STARTED

kafka.server.ServerStartupTest > testBrokerSelfAware PASSED

kafka.server.EdgeCaseRequestTest > testInvalidApiVersionRequest STARTED

kafka.server.EdgeCaseRequestTest > testInvalidApiVersionRequest PASSED

kafka.server.EdgeCaseRequestTest > testMalformedHeaderRequest STARTED

kafka.server.EdgeCaseRequestTest > testMalformedHeaderRequest PASSED

kafka.server.EdgeCaseRequestTest > testProduceRequestWithNullClientId STARTED

kafka.server.EdgeCaseRequestTest > testProduceRequestWithNullClientId PASSED

kafka.server.EdgeCaseRequestTest > testInvalidApiKeyRequest STARTED

kafka.server.EdgeCaseRequestTest > testInvalidApiKeyRequest PASSED

kafka.server.EdgeCaseRequestTest > testHeaderOnlyRequest STARTED

kafka.server.EdgeCaseRequestTest > testHeaderOnlyRequest PASSED

kafka.server.OffsetCommitTest > testUpdateOffsets STARTED
:kafka-trunk-jdk8:core:test FAILED
:test_core_2_10 FAILED

FAILURE: Build failed with an exception.

* What went wrong:
Execution failed for task ':core:test'.
> Process 'Gradle Test Executor 1' finished with non-zero exit value 137

* Try:
Run with --stacktrace option to get the stack trace. Run with --info or --debug option to
get more log output.

BUILD FAILED

Total time: 8 mins 35.594 secs
Build step 'Execute shell' marked build as failure
Recording test results
Setting GRADLE_2_4_RC_2_HOME=/home/jenkins/jenkins-slave/tools/hudson.plugins.gradle.GradleInstallation/Gradle_2.4-rc-2
Setting JDK1_8_0_66_HOME=/home/jenkins/jenkins-slave/tools/hudson.model.JDK/jdk1.8.0_66
ERROR: Step ‘Publish JUnit test result report’ failed: No test report files were found.
Configuration error?
Setting GRADLE_2_4_RC_2_HOME=/home/jenkins/jenkins-slave/tools/hudson.plugins.gradle.GradleInstallation/Gradle_2.4-rc-2
Setting JDK1_8_0_66_HOME=/home/jenkins/jenkins-slave/tools/hudson.model.JDK/jdk1.8.0_66

Mime
View raw message