kafka-dev mailing list archives

Site index · List index
Message view « Date » · « Thread »
Top « Date » · « Thread »
From Apache Jenkins Server <jenk...@builds.apache.org>
Subject Build failed in Jenkins: kafka-trunk-jdk8 #731
Date Sat, 02 Jul 2016 03:25:06 GMT
See <https://builds.apache.org/job/kafka-trunk-jdk8/731/changes>

Changes:

[ismael] MINOR: Typo fix in docs ops

[ismael] MINOR: Warning instead of error if TGT cannot be renewed beyond the next

------------------------------------------
[...truncated 1195 lines...]
kafka.server.KafkaConfigTest > testInvalidAdvertisedListenersProtocol STARTED

kafka.server.KafkaConfigTest > testInvalidAdvertisedListenersProtocol PASSED

kafka.server.KafkaConfigTest > testUncleanElectionEnabled STARTED

kafka.server.KafkaConfigTest > testUncleanElectionEnabled PASSED

kafka.server.KafkaConfigTest > testAdvertisePortDefault STARTED

kafka.server.KafkaConfigTest > testAdvertisePortDefault PASSED

kafka.server.KafkaConfigTest > testVersionConfiguration STARTED

kafka.server.KafkaConfigTest > testVersionConfiguration PASSED

kafka.server.KafkaConfigTest > testEqualAdvertisedListenersProtocol STARTED

kafka.server.KafkaConfigTest > testEqualAdvertisedListenersProtocol PASSED

kafka.server.MetadataRequestTest > testReplicaDownResponse STARTED

kafka.server.MetadataRequestTest > testReplicaDownResponse PASSED

kafka.server.MetadataRequestTest > testRack STARTED

kafka.server.MetadataRequestTest > testRack PASSED

kafka.server.MetadataRequestTest > testIsInternal STARTED

kafka.server.MetadataRequestTest > testIsInternal PASSED

kafka.server.MetadataRequestTest > testControllerId STARTED

kafka.server.MetadataRequestTest > testControllerId PASSED

kafka.server.MetadataRequestTest > testAllTopicsRequest STARTED

kafka.server.MetadataRequestTest > testAllTopicsRequest PASSED

kafka.server.MetadataRequestTest > testNoTopicsRequest STARTED

kafka.server.MetadataRequestTest > testNoTopicsRequest PASSED

kafka.server.SimpleFetchTest > testReadFromLog STARTED

kafka.server.SimpleFetchTest > testReadFromLog PASSED

kafka.server.ProduceRequestTest > testSimpleProduceRequest STARTED

kafka.server.ProduceRequestTest > testSimpleProduceRequest PASSED

kafka.server.ProduceRequestTest > testCorruptLz4ProduceRequest STARTED

kafka.server.ProduceRequestTest > testCorruptLz4ProduceRequest PASSED

kafka.server.DelayedOperationTest > testRequestPurge STARTED

kafka.server.DelayedOperationTest > testRequestPurge PASSED

kafka.server.DelayedOperationTest > testRequestExpiry STARTED

kafka.server.DelayedOperationTest > testRequestExpiry PASSED

kafka.server.DelayedOperationTest > testRequestSatisfaction STARTED

kafka.server.DelayedOperationTest > testRequestSatisfaction PASSED

kafka.server.LogRecoveryTest > testHWCheckpointNoFailuresMultipleLogSegments STARTED

kafka.server.LogRecoveryTest > testHWCheckpointNoFailuresMultipleLogSegments PASSED

kafka.server.LogRecoveryTest > testHWCheckpointWithFailuresMultipleLogSegments STARTED

kafka.server.LogRecoveryTest > testHWCheckpointWithFailuresMultipleLogSegments PASSED

kafka.server.LogRecoveryTest > testHWCheckpointNoFailuresSingleLogSegment STARTED

kafka.server.LogRecoveryTest > testHWCheckpointNoFailuresSingleLogSegment PASSED

kafka.server.LogRecoveryTest > testHWCheckpointWithFailuresSingleLogSegment STARTED

kafka.server.LogRecoveryTest > testHWCheckpointWithFailuresSingleLogSegment PASSED

kafka.server.AbstractFetcherThreadTest > testConsumerLagRemovedWithPartition STARTED

kafka.server.AbstractFetcherThreadTest > testConsumerLagRemovedWithPartition PASSED

kafka.server.AbstractFetcherThreadTest > testMetricsRemovedOnShutdown STARTED

kafka.server.AbstractFetcherThreadTest > testMetricsRemovedOnShutdown PASSED

kafka.server.ServerShutdownTest > testCleanShutdownAfterFailedStartup STARTED

kafka.server.ServerShutdownTest > testCleanShutdownAfterFailedStartup PASSED

kafka.server.ServerShutdownTest > testConsecutiveShutdown STARTED

kafka.server.ServerShutdownTest > testConsecutiveShutdown PASSED

kafka.server.ServerShutdownTest > testCleanShutdown STARTED

kafka.server.ServerShutdownTest > testCleanShutdown PASSED

kafka.server.ServerShutdownTest > testCleanShutdownWithDeleteTopicEnabled STARTED

kafka.server.ServerShutdownTest > testCleanShutdownWithDeleteTopicEnabled PASSED

kafka.server.ServerStartupTest > testBrokerStateRunningAfterZK STARTED

kafka.server.ServerStartupTest > testBrokerStateRunningAfterZK PASSED

kafka.server.ServerStartupTest > testBrokerCreatesZKChroot STARTED

kafka.server.ServerStartupTest > testBrokerCreatesZKChroot PASSED

kafka.server.ServerStartupTest > testConflictBrokerRegistration STARTED
ERROR: Could not install GRADLE_2_4_RC_2_HOME
java.lang.NullPointerException
	at hudson.plugins.toolenv.ToolEnvBuildWrapper$1.buildEnvVars(ToolEnvBuildWrapper.java:46)
	at hudson.model.AbstractBuild.getEnvironment(AbstractBuild.java:947)
	at hudson.plugins.git.GitSCM.getParamExpandedRepos(GitSCM.java:390)
	at hudson.plugins.git.GitSCM.compareRemoteRevisionWithImpl(GitSCM.java:577)
	at hudson.plugins.git.GitSCM.compareRemoteRevisionWith(GitSCM.java:527)
	at hudson.scm.SCM.compareRemoteRevisionWith(SCM.java:381)
	at hudson.scm.SCM.poll(SCM.java:398)
	at hudson.model.AbstractProject._poll(AbstractProject.java:1453)
	at hudson.model.AbstractProject.poll(AbstractProject.java:1356)
	at hudson.triggers.SCMTrigger$Runner.runPolling(SCMTrigger.java:526)
	at hudson.triggers.SCMTrigger$Runner.run(SCMTrigger.java:555)
	at hudson.util.SequentialExecutionQueue$QueueEntry.run(SequentialExecutionQueue.java:119)
	at java.util.concurrent.Executors$RunnableAdapter.call(Executors.java:471)
	at java.util.concurrent.FutureTask.run(FutureTask.java:262)
	at java.util.concurrent.ThreadPoolExecutor.runWorker(ThreadPoolExecutor.java:1145)
	at java.util.concurrent.ThreadPoolExecutor$Worker.run(ThreadPoolExecutor.java:615)
	at java.lang.Thread.run(Thread.java:745)
ERROR: Could not install JDK1_8_0_66_HOME
java.lang.NullPointerException
	at hudson.plugins.toolenv.ToolEnvBuildWrapper$1.buildEnvVars(ToolEnvBuildWrapper.java:46)
	at hudson.model.AbstractBuild.getEnvironment(AbstractBuild.java:947)
	at hudson.plugins.git.GitSCM.getParamExpandedRepos(GitSCM.java:390)
	at hudson.plugins.git.GitSCM.compareRemoteRevisionWithImpl(GitSCM.java:577)
	at hudson.plugins.git.GitSCM.compareRemoteRevisionWith(GitSCM.java:527)
	at hudson.scm.SCM.compareRemoteRevisionWith(SCM.java:381)
	at hudson.scm.SCM.poll(SCM.java:398)
	at hudson.model.AbstractProject._poll(AbstractProject.java:1453)
	at hudson.model.AbstractProject.poll(AbstractProject.java:1356)
	at hudson.triggers.SCMTrigger$Runner.runPolling(SCMTrigger.java:526)
	at hudson.triggers.SCMTrigger$Runner.run(SCMTrigger.java:555)
	at hudson.util.SequentialExecutionQueue$QueueEntry.run(SequentialExecutionQueue.java:119)
	at java.util.concurrent.Executors$RunnableAdapter.call(Executors.java:471)
	at java.util.concurrent.FutureTask.run(FutureTask.java:262)
	at java.util.concurrent.ThreadPoolExecutor.runWorker(ThreadPoolExecutor.java:1145)
	at java.util.concurrent.ThreadPoolExecutor$Worker.run(ThreadPoolExecutor.java:615)
	at java.lang.Thread.run(Thread.java:745)

kafka.server.ServerStartupTest > testConflictBrokerRegistration PASSED

kafka.server.ServerStartupTest > testBrokerSelfAware STARTED

kafka.server.ServerStartupTest > testBrokerSelfAware PASSED

kafka.server.EdgeCaseRequestTest > testInvalidApiVersionRequest STARTED

kafka.server.EdgeCaseRequestTest > testInvalidApiVersionRequest PASSED

kafka.server.EdgeCaseRequestTest > testMalformedHeaderRequest STARTED

kafka.server.EdgeCaseRequestTest > testMalformedHeaderRequest PASSED

kafka.server.EdgeCaseRequestTest > testProduceRequestWithNullClientId STARTED

kafka.server.EdgeCaseRequestTest > testProduceRequestWithNullClientId PASSED

kafka.server.EdgeCaseRequestTest > testInvalidApiKeyRequest STARTED

kafka.server.EdgeCaseRequestTest > testInvalidApiKeyRequest PASSED

kafka.server.EdgeCaseRequestTest > testHeaderOnlyRequest STARTED

kafka.server.EdgeCaseRequestTest > testHeaderOnlyRequest PASSED

kafka.server.OffsetCommitTest > testUpdateOffsets STARTED

kafka.server.OffsetCommitTest > testUpdateOffsets PASSED

kafka.server.OffsetCommitTest > testLargeMetadataPayload STARTED

kafka.server.OffsetCommitTest > testLargeMetadataPayload PASSED

kafka.server.OffsetCommitTest > testCommitAndFetchOffsets STARTED

kafka.server.OffsetCommitTest > testCommitAndFetchOffsets FAILED
    java.lang.AssertionError: Partition [topic-1,0] metadata not propagated after 5000 ms
        at org.junit.Assert.fail(Assert.java:88)
        at kafka.utils.TestUtils$.waitUntilTrue(TestUtils.scala:771)
        at kafka.utils.TestUtils$.waitUntilMetadataIsPropagated(TestUtils.scala:812)
        at kafka.utils.TestUtils$$anonfun$createTopic$1.apply(TestUtils.scala:240)
        at kafka.utils.TestUtils$$anonfun$createTopic$1.apply(TestUtils.scala:239)
        at scala.collection.TraversableLike$$anonfun$map$1.apply(TraversableLike.scala:244)
        at scala.collection.TraversableLike$$anonfun$map$1.apply(TraversableLike.scala:244)
        at scala.collection.immutable.Range.foreach(Range.scala:141)
        at scala.collection.TraversableLike$class.map(TraversableLike.scala:244)
        at scala.collection.AbstractTraversable.map(Traversable.scala:105)
        at kafka.utils.TestUtils$.createTopic(TestUtils.scala:239)
        at kafka.server.OffsetCommitTest.testCommitAndFetchOffsets(OffsetCommitTest.scala:134)

kafka.server.OffsetCommitTest > testOffsetExpiration STARTED

kafka.server.OffsetCommitTest > testOffsetExpiration FAILED
    java.lang.AssertionError: Partition [topic,0] metadata not propagated after 5000 ms
        at org.junit.Assert.fail(Assert.java:88)
        at kafka.utils.TestUtils$.waitUntilTrue(TestUtils.scala:771)
        at kafka.utils.TestUtils$.waitUntilMetadataIsPropagated(TestUtils.scala:812)
        at kafka.utils.TestUtils$$anonfun$createTopic$1.apply(TestUtils.scala:240)
        at kafka.utils.TestUtils$$anonfun$createTopic$1.apply(TestUtils.scala:239)
        at scala.collection.TraversableLike$$anonfun$map$1.apply(TraversableLike.scala:244)
        at scala.collection.TraversableLike$$anonfun$map$1.apply(TraversableLike.scala:244)
        at scala.collection.immutable.Range.foreach(Range.scala:141)
        at scala.collection.TraversableLike$class.map(TraversableLike.scala:244)
        at scala.collection.AbstractTraversable.map(Traversable.scala:105)
        at kafka.utils.TestUtils$.createTopic(TestUtils.scala:239)
        at kafka.server.OffsetCommitTest.testOffsetExpiration(OffsetCommitTest.scala:225)

kafka.server.OffsetCommitTest > testNonExistingTopicOffsetCommit STARTED

251 tests completed, 2 failed
:kafka-trunk-jdk8:core:test FAILED
:test_core_2_10 FAILED

FAILURE: Build failed with an exception.

* What went wrong:
Execution failed for task ':core:test'.
> Process 'Gradle Test Executor 1' finished with non-zero exit value 137

* Try:
Run with --stacktrace option to get the stack trace. Run with --info or --debug option to
get more log output.

BUILD FAILED

Total time: 21 mins 32.953 secs
Build step 'Execute shell' marked build as failure
Recording test results
Setting GRADLE_2_4_RC_2_HOME=/home/jenkins/jenkins-slave/tools/hudson.plugins.gradle.GradleInstallation/Gradle_2.4-rc-2
Setting JDK1_8_0_66_HOME=/home/jenkins/jenkins-slave/tools/hudson.model.JDK/jdk1.8.0_66
ERROR: Step ‘Publish JUnit test result report’ failed: No test report files were found.
Configuration error?
Setting GRADLE_2_4_RC_2_HOME=/home/jenkins/jenkins-slave/tools/hudson.plugins.gradle.GradleInstallation/Gradle_2.4-rc-2
Setting JDK1_8_0_66_HOME=/home/jenkins/jenkins-slave/tools/hudson.model.JDK/jdk1.8.0_66

Mime
View raw message