kafka-dev mailing list archives

Site index · List index
Message view « Date » · « Thread »
Top « Date » · « Thread »
From Apache Jenkins Server <jenk...@builds.apache.org>
Subject Build failed in Jenkins: kafka-trunk-jdk8 #734
Date Tue, 05 Jul 2016 20:14:33 GMT
See <https://builds.apache.org/job/kafka-trunk-jdk8/734/changes>

Changes:

[wangguoz] HOTFIX: Auto-repartitioning for merge() and code simplifications

[wangguoz] MINOR: Fix generics in KStream.groupBy(...)

------------------------------------------
[...truncated 2043 lines...]
	at java.util.concurrent.ThreadPoolExecutor$Worker.run(ThreadPoolExecutor.java:615)
	at java.lang.Thread.run(Thread.java:745)

kafka.api.PlaintextProducerSendTest > testSendNonCompressedMessageWithCreateTime PASSED

kafka.api.PlaintextProducerSendTest > testSendCompressedMessageWithLogAppendTime STARTED

kafka.api.PlaintextProducerSendTest > testSendCompressedMessageWithLogAppendTime FAILED
    java.lang.AssertionError: Partition [topic,0] metadata not propagated after 5000 ms

kafka.api.PlaintextProducerSendTest > testClose STARTED

kafka.api.PlaintextProducerSendTest > testClose FAILED
    java.lang.AssertionError: Partition [topic,0] metadata not propagated after 5000 ms

kafka.api.PlaintextProducerSendTest > testFlush STARTED

kafka.api.PlaintextProducerSendTest > testFlush FAILED
    java.lang.AssertionError: No request is complete.

kafka.api.PlaintextProducerSendTest > testSendToPartition STARTED

kafka.api.PlaintextProducerSendTest > testSendToPartition PASSED

kafka.api.PlaintextProducerSendTest > testSendOffset STARTED

kafka.api.PlaintextProducerSendTest > testSendOffset FAILED
    java.lang.AssertionError: Partition [topic,0] metadata not propagated after 5000 ms

kafka.api.PlaintextProducerSendTest > testAutoCreateTopic STARTED

kafka.api.PlaintextProducerSendTest > testAutoCreateTopic PASSED

kafka.api.PlaintextProducerSendTest > testSendWithInvalidCreateTime STARTED

kafka.api.PlaintextProducerSendTest > testSendWithInvalidCreateTime FAILED
    java.lang.AssertionError: Partition [topic,0] metadata not propagated after 5000 ms

kafka.api.PlaintextProducerSendTest > testSendCompressedMessageWithCreateTime STARTED

kafka.api.PlaintextProducerSendTest > testSendCompressedMessageWithCreateTime FAILED
    java.lang.AssertionError: Partition [topic,0] metadata not propagated after 5000 ms

kafka.api.PlaintextProducerSendTest > testCloseWithZeroTimeoutFromCallerThread STARTED

kafka.api.PlaintextProducerSendTest > testCloseWithZeroTimeoutFromCallerThread FAILED
    java.lang.AssertionError: Partition [topic,0] metadata not propagated after 5000 ms

kafka.api.PlaintextProducerSendTest > testCloseWithZeroTimeoutFromSenderThread STARTED

kafka.api.PlaintextProducerSendTest > testCloseWithZeroTimeoutFromSenderThread FAILED
    java.lang.IllegalStateException: Cannot send after the producer is closed.

kafka.api.PlaintextProducerSendTest > testSendNonCompressedMessageWithLogApendTime STARTED

kafka.api.PlaintextProducerSendTest > testSendNonCompressedMessageWithLogApendTime PASSED

kafka.api.ProducerFailureHandlingTest > testCannotSendToInternalTopic STARTED

kafka.api.ProducerFailureHandlingTest > testCannotSendToInternalTopic PASSED

kafka.api.ProducerFailureHandlingTest > testTooLargeRecordWithAckOne STARTED

kafka.api.ProducerFailureHandlingTest > testTooLargeRecordWithAckOne PASSED

kafka.api.ProducerFailureHandlingTest > testWrongBrokerList STARTED

kafka.api.ProducerFailureHandlingTest > testWrongBrokerList PASSED

kafka.api.ProducerFailureHandlingTest > testNotEnoughReplicas STARTED

kafka.api.ProducerFailureHandlingTest > testNotEnoughReplicas PASSED

kafka.api.ProducerFailureHandlingTest > testNonExistentTopic STARTED

kafka.api.ProducerFailureHandlingTest > testNonExistentTopic PASSED

kafka.api.ProducerFailureHandlingTest > testInvalidPartition STARTED

kafka.api.ProducerFailureHandlingTest > testInvalidPartition FAILED
    java.lang.AssertionError: Partition [topic-1,0] metadata not propagated after 5000 ms
        at org.junit.Assert.fail(Assert.java:88)
        at kafka.utils.TestUtils$.waitUntilTrue(TestUtils.scala:771)
        at kafka.utils.TestUtils$.waitUntilMetadataIsPropagated(TestUtils.scala:812)
        at kafka.utils.TestUtils$$anonfun$createTopic$1.apply(TestUtils.scala:240)
        at kafka.utils.TestUtils$$anonfun$createTopic$1.apply(TestUtils.scala:239)
        at scala.collection.TraversableLike$$anonfun$map$1.apply(TraversableLike.scala:244)
        at scala.collection.TraversableLike$$anonfun$map$1.apply(TraversableLike.scala:244)
        at scala.collection.immutable.Range.foreach(Range.scala:141)
        at scala.collection.TraversableLike$class.map(TraversableLike.scala:244)
        at scala.collection.AbstractTraversable.map(Traversable.scala:105)
        at kafka.utils.TestUtils$.createTopic(TestUtils.scala:239)
        at kafka.api.ProducerFailureHandlingTest.testInvalidPartition(ProducerFailureHandlingTest.scala:155)

kafka.api.ProducerFailureHandlingTest > testSendAfterClosed STARTED

kafka.api.ProducerFailureHandlingTest > testSendAfterClosed PASSED

kafka.api.ProducerFailureHandlingTest > testTooLargeRecordWithAckZero STARTED

kafka.api.ProducerFailureHandlingTest > testTooLargeRecordWithAckZero PASSED

kafka.api.ProducerFailureHandlingTest > testNotEnoughReplicasAfterBrokerShutdown STARTED

kafka.api.ProducerFailureHandlingTest > testNotEnoughReplicasAfterBrokerShutdown PASSED

kafka.api.SslProducerSendTest > testSendNonCompressedMessageWithCreateTime STARTED

kafka.api.SslProducerSendTest > testSendNonCompressedMessageWithCreateTime FAILED
    java.lang.AssertionError: Partition [topic,0] metadata not propagated after 5000 ms

kafka.api.SslProducerSendTest > testSendCompressedMessageWithLogAppendTime STARTED

kafka.api.SslProducerSendTest > testSendCompressedMessageWithLogAppendTime FAILED
    java.lang.AssertionError: Partition [topic,0] metadata not propagated after 5000 ms

kafka.api.SslProducerSendTest > testClose STARTED

kafka.api.SslProducerSendTest > testClose PASSED

kafka.api.SslProducerSendTest > testFlush STARTED

kafka.api.SslProducerSendTest > testFlush PASSED

kafka.api.SslProducerSendTest > testSendToPartition STARTED

kafka.api.SslProducerSendTest > testSendToPartition PASSED

kafka.api.SslProducerSendTest > testSendOffset STARTED

kafka.api.SslProducerSendTest > testSendOffset PASSED

kafka.api.SslProducerSendTest > testAutoCreateTopic STARTED

kafka.api.SslProducerSendTest > testAutoCreateTopic PASSED

kafka.api.SslProducerSendTest > testSendWithInvalidCreateTime STARTED

kafka.api.SslProducerSendTest > testSendWithInvalidCreateTime FAILED
    java.lang.AssertionError: Partition [topic,0] metadata not propagated after 5000 ms

kafka.api.SslProducerSendTest > testSendCompressedMessageWithCreateTime STARTED

kafka.api.SslProducerSendTest > testSendCompressedMessageWithCreateTime PASSED

kafka.api.SslProducerSendTest > testCloseWithZeroTimeoutFromCallerThread STARTED

kafka.api.SslProducerSendTest > testCloseWithZeroTimeoutFromCallerThread FAILED
    java.lang.AssertionError: Partition [topic,0] metadata not propagated after 5000 ms

kafka.api.SslProducerSendTest > testCloseWithZeroTimeoutFromSenderThread STARTED

kafka.api.SslProducerSendTest > testCloseWithZeroTimeoutFromSenderThread FAILED
    java.lang.AssertionError: Partition [topic,0] metadata not propagated after 5000 ms

kafka.api.SslProducerSendTest > testSendNonCompressedMessageWithLogApendTime STARTED

kafka.api.SslProducerSendTest > testSendNonCompressedMessageWithLogApendTime PASSED

kafka.api.SaslPlainPlaintextConsumerTest > testPauseStateNotPreservedByRebalance STARTED

kafka.api.SaslPlainPlaintextConsumerTest > testPauseStateNotPreservedByRebalance PASSED

kafka.api.SaslPlainPlaintextConsumerTest > testUnsubscribeTopic STARTED

kafka.api.SaslPlainPlaintextConsumerTest > testUnsubscribeTopic PASSED

kafka.api.SaslPlainPlaintextConsumerTest > testListTopics STARTED

kafka.api.SaslPlainPlaintextConsumerTest > testListTopics PASSED

kafka.api.SaslPlainPlaintextConsumerTest > testAutoCommitOnRebalance STARTED

kafka.api.SaslPlainPlaintextConsumerTest > testAutoCommitOnRebalance PASSED

kafka.api.SaslPlainPlaintextConsumerTest > testSimpleConsumption STARTED

kafka.api.SaslPlainPlaintextConsumerTest > testSimpleConsumption PASSED

kafka.api.SaslPlainPlaintextConsumerTest > testPartitionReassignmentCallback STARTED

kafka.api.SaslPlainPlaintextConsumerTest > testPartitionReassignmentCallback FAILED
    org.I0Itec.zkclient.exception.ZkTimeoutException: Unable to connect to zookeeper server
within timeout: 6000
        at org.I0Itec.zkclient.ZkClient.connect(ZkClient.java:1232)
        at org.I0Itec.zkclient.ZkClient.<init>(ZkClient.java:156)
        at org.I0Itec.zkclient.ZkClient.<init>(ZkClient.java:130)
        at kafka.utils.ZkUtils$.createZkClientAndConnection(ZkUtils.scala:75)
        at kafka.utils.ZkUtils$.apply(ZkUtils.scala:57)
        at kafka.zk.ZooKeeperTestHarness$class.setUp(ZooKeeperTestHarness.scala:40)
        at kafka.api.BaseConsumerTest.kafka$integration$KafkaServerTestHarness$$super$setUp(BaseConsumerTest.scala:34)
        at kafka.integration.KafkaServerTestHarness$class.setUp(KafkaServerTestHarness.scala:75)
        at kafka.api.BaseConsumerTest.kafka$api$IntegrationTestHarness$$super$setUp(BaseConsumerTest.scala:34)
        at kafka.api.IntegrationTestHarness$class.setUp(IntegrationTestHarness.scala:58)
        at kafka.api.BaseConsumerTest.setUp(BaseConsumerTest.scala:60)
        at kafka.api.SaslPlainPlaintextConsumerTest.kafka$api$SaslTestHarness$$super$setUp(SaslPlainPlaintextConsumerTest.scala:19)
        at kafka.api.SaslTestHarness$class.setUp(SaslTestHarness.scala:33)
        at kafka.api.SaslPlainPlaintextConsumerTest.setUp(SaslPlainPlaintextConsumerTest.scala:19)

kafka.api.SaslPlainPlaintextConsumerTest > testCommitSpecifiedOffsets STARTED
Build timed out (after 180 minutes). Marking the build as failed.
Build was aborted
Recording test results
ERROR: Could not install GRADLE_2_4_RC_2_HOME
java.lang.NullPointerException
	at hudson.plugins.toolenv.ToolEnvBuildWrapper$1.buildEnvVars(ToolEnvBuildWrapper.java:46)
	at hudson.model.AbstractBuild.getEnvironment(AbstractBuild.java:947)
	at hudson.plugins.git.GitSCM.getParamExpandedRepos(GitSCM.java:390)
	at hudson.plugins.git.GitSCM.compareRemoteRevisionWithImpl(GitSCM.java:577)
	at hudson.plugins.git.GitSCM.compareRemoteRevisionWith(GitSCM.java:527)
	at hudson.scm.SCM.compareRemoteRevisionWith(SCM.java:381)
	at hudson.scm.SCM.poll(SCM.java:398)
	at hudson.model.AbstractProject._poll(AbstractProject.java:1453)
	at hudson.model.AbstractProject.poll(AbstractProject.java:1356)
	at hudson.triggers.SCMTrigger$Runner.runPolling(SCMTrigger.java:526)
	at hudson.triggers.SCMTrigger$Runner.run(SCMTrigger.java:555)
	at hudson.util.SequentialExecutionQueue$QueueEntry.run(SequentialExecutionQueue.java:119)
	at java.util.concurrent.Executors$RunnableAdapter.call(Executors.java:471)
	at java.util.concurrent.FutureTask.run(FutureTask.java:262)
	at java.util.concurrent.ThreadPoolExecutor.runWorker(ThreadPoolExecutor.java:1145)
	at java.util.concurrent.ThreadPoolExecutor$Worker.run(ThreadPoolExecutor.java:615)
	at java.lang.Thread.run(Thread.java:745)
ERROR: Could not install JDK1_8_0_66_HOME
java.lang.NullPointerException
	at hudson.plugins.toolenv.ToolEnvBuildWrapper$1.buildEnvVars(ToolEnvBuildWrapper.java:46)
	at hudson.model.AbstractBuild.getEnvironment(AbstractBuild.java:947)
	at hudson.plugins.git.GitSCM.getParamExpandedRepos(GitSCM.java:390)
	at hudson.plugins.git.GitSCM.compareRemoteRevisionWithImpl(GitSCM.java:577)
	at hudson.plugins.git.GitSCM.compareRemoteRevisionWith(GitSCM.java:527)
	at hudson.scm.SCM.compareRemoteRevisionWith(SCM.java:381)
	at hudson.scm.SCM.poll(SCM.java:398)
	at hudson.model.AbstractProject._poll(AbstractProject.java:1453)
	at hudson.model.AbstractProject.poll(AbstractProject.java:1356)
	at hudson.triggers.SCMTrigger$Runner.runPolling(SCMTrigger.java:526)
	at hudson.triggers.SCMTrigger$Runner.run(SCMTrigger.java:555)
	at hudson.util.SequentialExecutionQueue$QueueEntry.run(SequentialExecutionQueue.java:119)
	at java.util.concurrent.Executors$RunnableAdapter.call(Executors.java:471)
	at java.util.concurrent.FutureTask.run(FutureTask.java:262)
	at java.util.concurrent.ThreadPoolExecutor.runWorker(ThreadPoolExecutor.java:1145)
	at java.util.concurrent.ThreadPoolExecutor$Worker.run(ThreadPoolExecutor.java:615)
	at java.lang.Thread.run(Thread.java:745)
Setting GRADLE_2_4_RC_2_HOME=/home/jenkins/jenkins-slave/tools/hudson.plugins.gradle.GradleInstallation/Gradle_2.4-rc-2
Setting JDK1_8_0_66_HOME=/home/jenkins/jenkins-slave/tools/hudson.model.JDK/jdk1.8.0_66

kafka.api.SaslPlainPlaintextConsumerTest > testCommitSpecifiedOffsets PASSED

kafka.api.SaslPlaintextConsumerTest > testPauseStateNotPreservedByRebalance STARTED
ERROR: Step ‘Publish JUnit test result report’ failed: No test report files were found.
Configuration error?
Setting GRADLE_2_4_RC_2_HOME=/home/jenkins/jenkins-slave/tools/hudson.plugins.gradle.GradleInstallation/Gradle_2.4-rc-2
Setting JDK1_8_0_66_HOME=/home/jenkins/jenkins-slave/tools/hudson.model.JDK/jdk1.8.0_66

Mime
View raw message