kafka-dev mailing list archives

Site index · List index
Message view « Date » · « Thread »
Top « Date » · « Thread »
From Apache Jenkins Server <jenk...@builds.apache.org>
Subject Build failed in Jenkins: kafka-trunk-jdk8 #727
Date Fri, 01 Jul 2016 07:13:26 GMT
See <https://builds.apache.org/job/kafka-trunk-jdk8/727/changes>

Changes:

[me] MINOR: bug fixes to ducktape services

------------------------------------------
[...truncated 6656 lines...]

kafka.utils.SchedulerTest > testReentrantTaskInMockScheduler PASSED

kafka.utils.SchedulerTest > testPeriodicTask STARTED

kafka.utils.SchedulerTest > testPeriodicTask PASSED

kafka.utils.CommandLineUtilsTest > testParseEmptyArg STARTED

kafka.utils.CommandLineUtilsTest > testParseEmptyArg PASSED

kafka.utils.CommandLineUtilsTest > testParseSingleArg STARTED

kafka.utils.CommandLineUtilsTest > testParseSingleArg PASSED

kafka.utils.CommandLineUtilsTest > testParseArgs STARTED

kafka.utils.CommandLineUtilsTest > testParseArgs PASSED

kafka.utils.CommandLineUtilsTest > testParseEmptyArgAsValid STARTED

kafka.utils.CommandLineUtilsTest > testParseEmptyArgAsValid PASSED

kafka.utils.UtilsTest > testAbs STARTED

kafka.utils.UtilsTest > testAbs PASSED

kafka.utils.UtilsTest > testReplaceSuffix STARTED

kafka.utils.UtilsTest > testReplaceSuffix PASSED

kafka.utils.UtilsTest > testCircularIterator STARTED

kafka.utils.UtilsTest > testCircularIterator PASSED

kafka.utils.UtilsTest > testReadBytes STARTED

kafka.utils.UtilsTest > testReadBytes PASSED

kafka.utils.UtilsTest > testCsvList STARTED

kafka.utils.UtilsTest > testCsvList PASSED

kafka.utils.UtilsTest > testReadInt STARTED

kafka.utils.UtilsTest > testReadInt PASSED

kafka.utils.UtilsTest > testCsvMap STARTED

kafka.utils.UtilsTest > testCsvMap PASSED

kafka.utils.UtilsTest > testInLock STARTED

kafka.utils.UtilsTest > testInLock PASSED

kafka.utils.UtilsTest > testSwallow STARTED

kafka.utils.UtilsTest > testSwallow PASSED

kafka.utils.JsonTest > testJsonEncoding STARTED

kafka.utils.JsonTest > testJsonEncoding PASSED

kafka.utils.IteratorTemplateTest > testIterator STARTED

kafka.utils.IteratorTemplateTest > testIterator PASSED

kafka.metrics.KafkaTimerTest > testKafkaTimer STARTED

kafka.metrics.KafkaTimerTest > testKafkaTimer PASSED

kafka.metrics.MetricsTest > testMetricsReporterAfterDeletingTopic STARTED

kafka.metrics.MetricsTest > testMetricsReporterAfterDeletingTopic PASSED

kafka.metrics.MetricsTest > testBrokerTopicMetricsUnregisteredAfterDeletingTopic STARTED

kafka.metrics.MetricsTest > testBrokerTopicMetricsUnregisteredAfterDeletingTopic PASSED

kafka.metrics.MetricsTest > testMetricsLeak STARTED

kafka.metrics.MetricsTest > testMetricsLeak PASSED

kafka.consumer.TopicFilterTest > testWhitelists STARTED

kafka.consumer.TopicFilterTest > testWhitelists PASSED

kafka.consumer.TopicFilterTest > testWildcardTopicCountGetTopicCountMapEscapeJson STARTED

kafka.consumer.TopicFilterTest > testWildcardTopicCountGetTopicCountMapEscapeJson PASSED

kafka.consumer.TopicFilterTest > testBlacklists STARTED

kafka.consumer.TopicFilterTest > testBlacklists PASSED

kafka.consumer.PartitionAssignorTest > testRoundRobinPartitionAssignor STARTED
ERROR: Could not install GRADLE_2_4_RC_2_HOME
java.lang.NullPointerException
	at hudson.plugins.toolenv.ToolEnvBuildWrapper$1.buildEnvVars(ToolEnvBuildWrapper.java:46)
	at hudson.model.AbstractBuild.getEnvironment(AbstractBuild.java:947)
	at hudson.plugins.git.GitSCM.getParamExpandedRepos(GitSCM.java:390)
	at hudson.plugins.git.GitSCM.compareRemoteRevisionWithImpl(GitSCM.java:577)
	at hudson.plugins.git.GitSCM.compareRemoteRevisionWith(GitSCM.java:527)
	at hudson.scm.SCM.compareRemoteRevisionWith(SCM.java:381)
	at hudson.scm.SCM.poll(SCM.java:398)
	at hudson.model.AbstractProject._poll(AbstractProject.java:1453)
	at hudson.model.AbstractProject.poll(AbstractProject.java:1356)
	at hudson.triggers.SCMTrigger$Runner.runPolling(SCMTrigger.java:526)
	at hudson.triggers.SCMTrigger$Runner.run(SCMTrigger.java:555)
	at hudson.util.SequentialExecutionQueue$QueueEntry.run(SequentialExecutionQueue.java:119)
	at java.util.concurrent.Executors$RunnableAdapter.call(Executors.java:471)
	at java.util.concurrent.FutureTask.run(FutureTask.java:262)
	at java.util.concurrent.ThreadPoolExecutor.runWorker(ThreadPoolExecutor.java:1145)
	at java.util.concurrent.ThreadPoolExecutor$Worker.run(ThreadPoolExecutor.java:615)
	at java.lang.Thread.run(Thread.java:745)
ERROR: Could not install JDK1_8_0_66_HOME
java.lang.NullPointerException
	at hudson.plugins.toolenv.ToolEnvBuildWrapper$1.buildEnvVars(ToolEnvBuildWrapper.java:46)
	at hudson.model.AbstractBuild.getEnvironment(AbstractBuild.java:947)
	at hudson.plugins.git.GitSCM.getParamExpandedRepos(GitSCM.java:390)
	at hudson.plugins.git.GitSCM.compareRemoteRevisionWithImpl(GitSCM.java:577)
	at hudson.plugins.git.GitSCM.compareRemoteRevisionWith(GitSCM.java:527)
	at hudson.scm.SCM.compareRemoteRevisionWith(SCM.java:381)
	at hudson.scm.SCM.poll(SCM.java:398)
	at hudson.model.AbstractProject._poll(AbstractProject.java:1453)
	at hudson.model.AbstractProject.poll(AbstractProject.java:1356)
	at hudson.triggers.SCMTrigger$Runner.runPolling(SCMTrigger.java:526)
	at hudson.triggers.SCMTrigger$Runner.run(SCMTrigger.java:555)
	at hudson.util.SequentialExecutionQueue$QueueEntry.run(SequentialExecutionQueue.java:119)
	at java.util.concurrent.Executors$RunnableAdapter.call(Executors.java:471)
	at java.util.concurrent.FutureTask.run(FutureTask.java:262)
	at java.util.concurrent.ThreadPoolExecutor.runWorker(ThreadPoolExecutor.java:1145)
	at java.util.concurrent.ThreadPoolExecutor$Worker.run(ThreadPoolExecutor.java:615)
	at java.lang.Thread.run(Thread.java:745)

kafka.consumer.PartitionAssignorTest > testRoundRobinPartitionAssignor PASSED

kafka.consumer.PartitionAssignorTest > testRangePartitionAssignor STARTED

kafka.consumer.PartitionAssignorTest > testRangePartitionAssignor PASSED

kafka.consumer.ZookeeperConsumerConnectorTest > testBasic STARTED

kafka.consumer.ZookeeperConsumerConnectorTest > testBasic PASSED

kafka.consumer.ZookeeperConsumerConnectorTest > testCompressionSetConsumption STARTED

kafka.consumer.ZookeeperConsumerConnectorTest > testCompressionSetConsumption PASSED

kafka.consumer.ZookeeperConsumerConnectorTest > testLeaderSelectionForPartition STARTED

kafka.consumer.ZookeeperConsumerConnectorTest > testLeaderSelectionForPartition PASSED

kafka.consumer.ZookeeperConsumerConnectorTest > testConsumerDecoder STARTED

kafka.consumer.ZookeeperConsumerConnectorTest > testConsumerDecoder PASSED

kafka.consumer.ZookeeperConsumerConnectorTest > testConsumerRebalanceListener STARTED

kafka.consumer.ZookeeperConsumerConnectorTest > testConsumerRebalanceListener PASSED

kafka.consumer.ZookeeperConsumerConnectorTest > testCompression STARTED

kafka.consumer.ZookeeperConsumerConnectorTest > testCompression PASSED

kafka.consumer.ConsumerIteratorTest > testConsumerIteratorDeduplicationDeepIterator STARTED

kafka.consumer.ConsumerIteratorTest > testConsumerIteratorDeduplicationDeepIterator PASSED

kafka.consumer.ConsumerIteratorTest > testConsumerIteratorDecodingFailure STARTED

kafka.consumer.ConsumerIteratorTest > testConsumerIteratorDecodingFailure PASSED

kafka.javaapi.consumer.ZookeeperConsumerConnectorTest > testBasic STARTED

kafka.javaapi.consumer.ZookeeperConsumerConnectorTest > testBasic PASSED

kafka.javaapi.message.ByteBufferMessageSetTest > testSizeInBytesWithCompression STARTED

kafka.javaapi.message.ByteBufferMessageSetTest > testSizeInBytesWithCompression PASSED

kafka.javaapi.message.ByteBufferMessageSetTest > testIteratorIsConsistentWithCompression
STARTED

kafka.javaapi.message.ByteBufferMessageSetTest > testIteratorIsConsistentWithCompression
PASSED

kafka.javaapi.message.ByteBufferMessageSetTest > testIteratorIsConsistent STARTED

kafka.javaapi.message.ByteBufferMessageSetTest > testIteratorIsConsistent PASSED

kafka.javaapi.message.ByteBufferMessageSetTest > testEqualsWithCompression STARTED

kafka.javaapi.message.ByteBufferMessageSetTest > testEqualsWithCompression PASSED

kafka.javaapi.message.ByteBufferMessageSetTest > testWrittenEqualsRead STARTED

kafka.javaapi.message.ByteBufferMessageSetTest > testWrittenEqualsRead PASSED

kafka.javaapi.message.ByteBufferMessageSetTest > testEquals STARTED

kafka.javaapi.message.ByteBufferMessageSetTest > testEquals PASSED

kafka.javaapi.message.ByteBufferMessageSetTest > testSizeInBytes STARTED

kafka.javaapi.message.ByteBufferMessageSetTest > testSizeInBytes PASSED

kafka.server.LogOffsetTest > testFetchOffsetsBeforeWithChangingSegmentSize STARTED

kafka.server.LogOffsetTest > testFetchOffsetsBeforeWithChangingSegmentSize PASSED

kafka.server.LogOffsetTest > testGetOffsetsBeforeEarliestTime STARTED

kafka.server.LogOffsetTest > testGetOffsetsBeforeEarliestTime PASSED

kafka.server.LogOffsetTest > testGetOffsetsForUnknownTopic STARTED

kafka.server.LogOffsetTest > testGetOffsetsForUnknownTopic PASSED

kafka.server.LogOffsetTest > testEmptyLogsGetOffsets STARTED

kafka.server.LogOffsetTest > testEmptyLogsGetOffsets PASSED

kafka.server.LogOffsetTest > testGetOffsetsBeforeLatestTime STARTED
Java HotSpot(TM) 64-Bit Server VM warning: INFO: os::commit_memory(0x00000000e0900000, 74973184,
0) failed; error='Cannot allocate memory' (errno=12)
#
# There is insufficient memory for the Java Runtime Environment to continue.
# Native memory allocation (mmap) failed to map 74973184 bytes for committing reserved memory.
# An error report file with more information is saved as:
# <https://builds.apache.org/job/kafka-trunk-jdk8/ws/core/hs_err_pid20446.log>
:kafka-trunk-jdk8:core:test FAILED
:test_core_2_11 FAILED

FAILURE: Build failed with an exception.

* What went wrong:
Execution failed for task ':test_core_2_11'.
> Process 'Gradle Compiler Daemon 1' finished with non-zero exit value 137

* Try:
Run with --stacktrace option to get the stack trace. Run with --info or --debug option to
get more log output.

BUILD FAILED

Total time: 40 mins 28.83 secs
Build step 'Execute shell' marked build as failure
Recording test results
Setting GRADLE_2_4_RC_2_HOME=/home/jenkins/jenkins-slave/tools/hudson.plugins.gradle.GradleInstallation/Gradle_2.4-rc-2
Setting JDK1_8_0_66_HOME=/home/jenkins/jenkins-slave/tools/hudson.model.JDK/jdk1.8.0_66
Setting GRADLE_2_4_RC_2_HOME=/home/jenkins/jenkins-slave/tools/hudson.plugins.gradle.GradleInstallation/Gradle_2.4-rc-2
Setting JDK1_8_0_66_HOME=/home/jenkins/jenkins-slave/tools/hudson.model.JDK/jdk1.8.0_66

Mime
View raw message