kafka-dev mailing list archives

Site index · List index
Message view « Date » · « Thread »
Top « Date » · « Thread »
From Apache Jenkins Server <jenk...@builds.apache.org>
Subject Build failed in Jenkins: kafka_0.9.0_jdk7 #102
Date Fri, 29 Jan 2016 14:28:13 GMT
See <https://builds.apache.org/job/kafka_0.9.0_jdk7/102/changes>

Changes:

[harsha] KAFKA-3166; Disable SSL client authentication for SASL_SSL security

------------------------------------------
[...truncated 2834 lines...]
kafka.log.LogManagerTest > testCheckpointRecoveryPoints PASSED

kafka.log.LogManagerTest > testTimeBasedFlush PASSED

kafka.log.LogManagerTest > testCreateLog PASSED

kafka.log.LogManagerTest > testRecoveryDirectoryMappingWithTrailingSlash PASSED

kafka.log.LogCleanerIntegrationTest > cleanerTest[0] PASSED

kafka.log.LogCleanerIntegrationTest > cleanerTest[1] PASSED

kafka.log.LogCleanerIntegrationTest > cleanerTest[2] PASSED

kafka.log.LogCleanerIntegrationTest > cleanerTest[3] PASSED

kafka.security.auth.ZkAuthorizationTest > testIsZkSecurityEnabled PASSED

kafka.security.auth.ZkAuthorizationTest > testZkUtils PASSED

kafka.security.auth.ZkAuthorizationTest > testZkAntiMigration PASSED

kafka.security.auth.ZkAuthorizationTest > testZkMigration PASSED

kafka.security.auth.ZkAuthorizationTest > testChroot PASSED

kafka.security.auth.ZkAuthorizationTest > testDelete PASSED

kafka.security.auth.ZkAuthorizationTest > testDeleteRecursive PASSED

kafka.security.auth.SimpleAclAuthorizerTest > testAllowAllAccess PASSED

kafka.security.auth.SimpleAclAuthorizerTest > testNoAclFound PASSED

kafka.security.auth.SimpleAclAuthorizerTest > testAclManagementAPIs PASSED

kafka.security.auth.SimpleAclAuthorizerTest > testWildCardAcls PASSED

kafka.security.auth.SimpleAclAuthorizerTest > testTopicAcl PASSED

kafka.security.auth.SimpleAclAuthorizerTest > testSuperUserHasAccess PASSED

kafka.security.auth.SimpleAclAuthorizerTest > testDenyTakesPrecedence PASSED

kafka.security.auth.SimpleAclAuthorizerTest > testNoAclFoundOverride PASSED

kafka.security.auth.SimpleAclAuthorizerTest > testLoadCache PASSED

kafka.admin.AdminTest > testBasicPreferredReplicaElection PASSED

kafka.admin.AdminTest > testPreferredReplicaJsonData PASSED

kafka.admin.AdminTest > testReassigningNonExistingPartition PASSED

kafka.admin.AdminTest > testBootstrapClientIdConfig PASSED

kafka.admin.AdminTest > testPartitionReassignmentNonOverlappingReplicas PASSED

kafka.admin.AdminTest > testReplicaAssignment PASSED

kafka.admin.AdminTest > testPartitionReassignmentWithLeaderNotInNewReplicas PASSED

kafka.admin.AdminTest > testTopicConfigChange PASSED

kafka.admin.AdminTest > testResumePartitionReassignmentThatWasCompleted PASSED

kafka.admin.AdminTest > testManualReplicaAssignment PASSED

kafka.admin.AdminTest > testPartitionReassignmentWithLeaderInNewReplicas PASSED

kafka.admin.AdminTest > testShutdownBroker PASSED

kafka.admin.AdminTest > testTopicCreationWithCollision PASSED

kafka.admin.AdminTest > testTopicCreationInZK PASSED

kafka.admin.TopicCommandTest > testTopicDeletion PASSED

kafka.admin.TopicCommandTest > testConfigPreservationAcrossPartitionAlteration PASSED

kafka.admin.DeleteTopicTest > testDeleteTopicWithCleaner PASSED

kafka.admin.DeleteTopicTest > testResumeDeleteTopicOnControllerFailover PASSED

kafka.admin.DeleteTopicTest > testResumeDeleteTopicWithRecoveredFollower PASSED

kafka.admin.DeleteTopicTest > testDeleteTopicAlreadyMarkedAsDeleted PASSED

kafka.admin.DeleteTopicTest > testPartitionReassignmentDuringDeleteTopic PASSED

kafka.admin.DeleteTopicTest > testDeleteNonExistingTopic PASSED

kafka.admin.DeleteTopicTest > testRecreateTopicAfterDeletion PASSED

kafka.admin.DeleteTopicTest > testAddPartitionDuringDeleteTopic PASSED

kafka.admin.DeleteTopicTest > testDeleteTopicWithAllAliveReplicas PASSED

kafka.admin.DeleteTopicTest > testDeleteTopicDuringAddPartition PASSED

kafka.admin.DeleteConsumerGroupTest > testGroupWideDeleteInZKDoesNothingForActiveConsumerGroup
PASSED

kafka.admin.DeleteConsumerGroupTest > testGroupTopicWideDeleteInZKDoesNothingForActiveGroupConsumingMultipleTopics
PASSED

kafka.admin.DeleteConsumerGroupTest > testConsumptionOnRecreatedTopicAfterTopicWideDeleteInZK
PASSED

kafka.admin.DeleteConsumerGroupTest > testTopicWideDeleteInZK PASSED

kafka.admin.DeleteConsumerGroupTest > testGroupTopicWideDeleteInZKForGroupConsumingOneTopic
PASSED

kafka.admin.DeleteConsumerGroupTest > testGroupTopicWideDeleteInZKForGroupConsumingMultipleTopics
PASSED

kafka.admin.DeleteConsumerGroupTest > testGroupWideDeleteInZK PASSED

kafka.admin.AddPartitionsTest > testWrongReplicaCount PASSED

kafka.admin.AddPartitionsTest > testTopicDoesNotExist PASSED

kafka.admin.AddPartitionsTest > testIncrementPartitions PASSED

kafka.admin.AddPartitionsTest > testManualAssignmentOfReplicas PASSED

kafka.admin.AddPartitionsTest > testReplicaPlacement PASSED

kafka.admin.ConfigCommandTest > testArgumentParse PASSED
:clients:checkstyleMain
FAILURE: Build failed with an exception.

* What went wrong:
Failed to capture snapshot of input files for task 'checkstyleMain' during up-to-date check.
 See stacktrace for details.
> Could not read entry '<https://builds.apache.org/job/kafka_0.9.0_jdk7/ws/checkstyle/checkstyle.xml'>
from cache fileHashes.bin (<https://builds.apache.org/job/kafka_0.9.0_jdk7/ws/.gradle/2.8/taskArtifacts/fileHashes.bin).>

* Try:
Run with --info or --debug option to get more log output.

* Exception is:
org.gradle.api.UncheckedIOException: Failed to capture snapshot of input files for task 'checkstyleMain'
during up-to-date check.  See stacktrace for details.
	at org.gradle.api.internal.changedetection.rules.TaskUpToDateState.<init>(TaskUpToDateState.java:59)
	at org.gradle.api.internal.changedetection.changes.DefaultTaskArtifactStateRepository$TaskArtifactStateImpl.getStates(DefaultTaskArtifactStateRepository.java:126)
	at org.gradle.api.internal.changedetection.changes.DefaultTaskArtifactStateRepository$TaskArtifactStateImpl.isUpToDate(DefaultTaskArtifactStateRepository.java:69)
	at org.gradle.api.internal.tasks.execution.SkipUpToDateTaskExecuter.execute(SkipUpToDateTaskExecuter.java:52)
	at org.gradle.api.internal.tasks.execution.ValidatingTaskExecuter.execute(ValidatingTaskExecuter.java:58)
	at org.gradle.api.internal.tasks.execution.SkipEmptySourceFilesTaskExecuter.execute(SkipEmptySourceFilesTaskExecuter.java:52)
	at org.gradle.api.internal.tasks.execution.SkipTaskWithNoActionsExecuter.execute(SkipTaskWithNoActionsExecuter.java:52)
	at org.gradle.api.internal.tasks.execution.SkipOnlyIfTaskExecuter.execute(SkipOnlyIfTaskExecuter.java:53)
	at org.gradle.api.internal.tasks.execution.ExecuteAtMostOnceTaskExecuter.execute(ExecuteAtMostOnceTaskExecuter.java:43)
	at org.gradle.execution.taskgraph.DefaultTaskGraphExecuter$EventFiringTaskWorker.execute(DefaultTaskGraphExecuter.java:203)
	at org.gradle.execution.taskgraph.DefaultTaskGraphExecuter$EventFiringTaskWorker.execute(DefaultTaskGraphExecuter.java:185)
	at org.gradle.execution.taskgraph.AbstractTaskPlanExecutor$TaskExecutorWorker.processTask(AbstractTaskPlanExecutor.java:62)
	at org.gradle.execution.taskgraph.AbstractTaskPlanExecutor$TaskExecutorWorker.run(AbstractTaskPlanExecutor.java:50)
	at org.gradle.execution.taskgraph.DefaultTaskPlanExecutor.process(DefaultTaskPlanExecutor.java:25)
	at org.gradle.execution.taskgraph.DefaultTaskGraphExecuter.execute(DefaultTaskGraphExecuter.java:110)
	at org.gradle.execution.SelectedTaskExecutionAction.execute(SelectedTaskExecutionAction.java:37)
	at org.gradle.execution.DefaultBuildExecuter.execute(DefaultBuildExecuter.java:37)
	at org.gradle.execution.DefaultBuildExecuter.access$000(DefaultBuildExecuter.java:23)
	at org.gradle.execution.DefaultBuildExecuter$1.proceed(DefaultBuildExecuter.java:43)
	at org.gradle.execution.DryRunBuildExecutionAction.execute(DryRunBuildExecutionAction.java:32)
	at org.gradle.execution.DefaultBuildExecuter.execute(DefaultBuildExecuter.java:37)
	at org.gradle.execution.DefaultBuildExecuter.execute(DefaultBuildExecuter.java:30)
	at org.gradle.initialization.DefaultGradleLauncher$4.run(DefaultGradleLauncher.java:154)
	at org.gradle.internal.Factories$1.create(Factories.java:22)
	at org.gradle.internal.progress.DefaultBuildOperationExecutor.run(DefaultBuildOperationExecutor.java:90)
	at org.gradle.internal.progress.DefaultBuildOperationExecutor.run(DefaultBuildOperationExecutor.java:52)
	at org.gradle.initialization.DefaultGradleLauncher.doBuildStages(DefaultGradleLauncher.java:151)
	at org.gradle.initialization.DefaultGradleLauncher.access$200(DefaultGradleLauncher.java:32)
	at org.gradle.initialization.DefaultGradleLauncher$1.create(DefaultGradleLauncher.java:99)
	at org.gradle.initialization.DefaultGradleLauncher$1.create(DefaultGradleLauncher.java:93)
	at org.gradle.internal.progress.DefaultBuildOperationExecutor.run(DefaultBuildOperationExecutor.java:90)
	at org.gradle.internal.progress.DefaultBuildOperationExecutor.run(DefaultBuildOperationExecutor.java:62)
	at org.gradle.initialization.DefaultGradleLauncher.doBuild(DefaultGradleLauncher.java:93)
	at org.gradle.initialization.DefaultGradleLauncher.run(DefaultGradleLauncher.java:82)
	at org.gradle.launcher.exec.InProcessBuildActionExecuter$DefaultBuildController.run(InProcessBuildActionExecuter.java:94)
	at org.gradle.tooling.internal.provider.ExecuteBuildActionRunner.run(ExecuteBuildActionRunner.java:28)
	at org.gradle.launcher.exec.ChainingBuildActionRunner.run(ChainingBuildActionRunner.java:35)
	at org.gradle.launcher.exec.InProcessBuildActionExecuter.execute(InProcessBuildActionExecuter.java:43)
	at org.gradle.launcher.exec.InProcessBuildActionExecuter.execute(InProcessBuildActionExecuter.java:28)
	at org.gradle.launcher.exec.ContinuousBuildActionExecuter.execute(ContinuousBuildActionExecuter.java:77)
	at org.gradle.launcher.exec.ContinuousBuildActionExecuter.execute(ContinuousBuildActionExecuter.java:47)
	at org.gradle.launcher.daemon.server.exec.ExecuteBuild.doBuild(ExecuteBuild.java:52)
	at org.gradle.launcher.daemon.server.exec.BuildCommandOnly.execute(BuildCommandOnly.java:36)
	at org.gradle.launcher.daemon.server.api.DaemonCommandExecution.proceed(DaemonCommandExecution.java:120)
	at org.gradle.launcher.daemon.server.exec.WatchForDisconnection.execute(WatchForDisconnection.java:37)
	at org.gradle.launcher.daemon.server.api.DaemonCommandExecution.proceed(DaemonCommandExecution.java:120)
	at org.gradle.launcher.daemon.server.exec.ResetDeprecationLogger.execute(ResetDeprecationLogger.java:26)
	at org.gradle.launcher.daemon.server.api.DaemonCommandExecution.proceed(DaemonCommandExecution.java:120)
	at org.gradle.launcher.daemon.server.exec.RequestStopIfSingleUsedDaemon.execute(RequestStopIfSingleUsedDaemon.java:34)
	at org.gradle.launcher.daemon.server.api.DaemonCommandExecution.proceed(DaemonCommandExecution.java:120)
	at org.gradle.launcher.daemon.server.exec.ForwardClientInput$2.call(ForwardClientInput.java:74)
	at org.gradle.launcher.daemon.server.exec.ForwardClientInput$2.call(ForwardClientInput.java:72)
	at org.gradle.util.Swapper.swap(Swapper.java:38)
	at org.gradle.launcher.daemon.server.exec.ForwardClientInput.execute(ForwardClientInput.java:72)
	at org.gradle.launcher.daemon.server.api.DaemonCommandExecution.proceed(DaemonCommandExecution.java:120)
	at org.gradle.launcher.daemon.server.health.DaemonHealthTracker.execute(DaemonHealthTracker.java:40)
	at org.gradle.launcher.daemon.server.api.DaemonCommandExecution.proceed(DaemonCommandExecution.java:120)
	at org.gradle.launcher.daemon.server.exec.LogToClient.doBuild(LogToClient.java:66)
	at org.gradle.launcher.daemon.server.exec.BuildCommandOnly.execute(BuildCommandOnly.java:36)
	at org.gradle.launcher.daemon.server.api.DaemonCommandExecution.proceed(DaemonCommandExecution.java:120)
	at org.gradle.launcher.daemon.server.exec.EstablishBuildEnvironment.doBuild(EstablishBuildEnvironment.java:71)
	at org.gradle.launcher.daemon.server.exec.BuildCommandOnly.execute(BuildCommandOnly.java:36)
	at org.gradle.launcher.daemon.server.api.DaemonCommandExecution.proceed(DaemonCommandExecution.java:120)
	at org.gradle.launcher.daemon.server.health.HintGCAfterBuild.execute(HintGCAfterBuild.java:41)
	at org.gradle.launcher.daemon.server.api.DaemonCommandExecution.proceed(DaemonCommandExecution.java:120)
	at org.gradle.launcher.daemon.server.exec.StartBuildOrRespondWithBusy$1.run(StartBuildOrRespondWithBusy.java:50)
	at org.gradle.launcher.daemon.server.DaemonStateCoordinator$1.run(DaemonStateCoordinator.java:246)
	at org.gradle.internal.concurrent.ExecutorPolicy$CatchAndRecordFailures.onExecute(ExecutorPolicy.java:54)
	at org.gradle.internal.concurrent.StoppableExecutorImpl$1.run(StoppableExecutorImpl.java:40)
Caused by: org.gradle.api.UncheckedIOException: Could not read entry '<https://builds.apache.org/job/kafka_0.9.0_jdk7/ws/checkstyle/checkstyle.xml'>
from cache fileHashes.bin (<https://builds.apache.org/job/kafka_0.9.0_jdk7/ws/.gradle/2.8/taskArtifacts/fileHashes.bin).>
	at org.gradle.cache.internal.btree.BTreePersistentIndexedCache.get(BTreePersistentIndexedCache.java:128)
	at org.gradle.cache.internal.DefaultMultiProcessSafePersistentIndexedCache$1.create(DefaultMultiProcessSafePersistentIndexedCache.java:37)
	at org.gradle.cache.internal.DefaultFileLockManager$DefaultFileLock.readFile(DefaultFileLockManager.java:153)
	at org.gradle.cache.internal.DefaultCacheAccess$UnitOfWorkFileAccess.readFile(DefaultCacheAccess.java:396)
	at org.gradle.cache.internal.DefaultMultiProcessSafePersistentIndexedCache.get(DefaultMultiProcessSafePersistentIndexedCache.java:35)
	at org.gradle.api.internal.changedetection.state.InMemoryTaskArtifactCache$1.get(InMemoryTaskArtifactCache.java:109)
	at org.gradle.api.internal.changedetection.state.CachingFileSnapshotter.snapshot(CachingFileSnapshotter.java:39)
	at org.gradle.api.internal.changedetection.state.CachingFileSnapshotter.snapshot(CachingFileSnapshotter.java:27)
	at org.gradle.api.internal.changedetection.state.DefaultFileCollectionSnapshotter$1.run(DefaultFileCollectionSnapshotter.java:56)
	at org.gradle.internal.Factories$1.create(Factories.java:22)
	at org.gradle.cache.internal.DefaultCacheAccess.useCache(DefaultCacheAccess.java:192)
	at org.gradle.cache.internal.DefaultCacheAccess.useCache(DefaultCacheAccess.java:175)
	at org.gradle.cache.internal.DefaultPersistentDirectoryStore.useCache(DefaultPersistentDirectoryStore.java:106)
	at org.gradle.cache.internal.DefaultCacheFactory$ReferenceTrackingCache.useCache(DefaultCacheFactory.java:187)
	at org.gradle.api.internal.changedetection.state.DefaultTaskArtifactStateCacheAccess.useCache(DefaultTaskArtifactStateCacheAccess.java:60)
	at org.gradle.api.internal.changedetection.state.DefaultFileCollectionSnapshotter.snapshot(DefaultFileCollectionSnapshotter.java:52)
	at org.gradle.api.internal.changedetection.rules.TaskUpToDateState.<init>(TaskUpToDateState.java:55)
	... 68 more
Caused by: org.gradle.api.UncheckedIOException: java.io.EOFException
	at org.gradle.cache.internal.btree.FileBackedBlockStore.read(FileBackedBlockStore.java:103)
	at org.gradle.cache.internal.btree.CachingBlockStore.read(CachingBlockStore.java:84)
	at org.gradle.cache.internal.btree.FreeListBlockStore.read(FreeListBlockStore.java:78)
	at org.gradle.cache.internal.btree.StateCheckBlockStore.read(StateCheckBlockStore.java:61)
	at org.gradle.cache.internal.btree.BTreePersistentIndexedCache$IndexBlock.get(BTreePersistentIndexedCache.java:448)
	at org.gradle.cache.internal.btree.BTreePersistentIndexedCache.get(BTreePersistentIndexedCache.java:118)
	... 84 more
Caused by: java.io.EOFException
	at org.gradle.cache.internal.btree.FileBackedBlockStore$BlockImpl.read(FileBackedBlockStore.java:221)
	at org.gradle.cache.internal.btree.FileBackedBlockStore.read(FileBackedBlockStore.java:98)
	... 89 more



BUILD FAILED

Total time: 53 mins 24.875 secs
Build step 'Execute shell' marked build as failure
Recording test results
Setting GRADLE_2_4_RC_2_HOME=/home/jenkins/jenkins-slave/tools/hudson.plugins.gradle.GradleInstallation/Gradle_2.4-rc-2
Setting JDK_1_7U51_HOME=/home/jenkins/jenkins-slave/tools/hudson.model.JDK/jdk-1.7u51
Setting GRADLE_2_4_RC_2_HOME=/home/jenkins/jenkins-slave/tools/hudson.plugins.gradle.GradleInstallation/Gradle_2.4-rc-2
Setting JDK_1_7U51_HOME=/home/jenkins/jenkins-slave/tools/hudson.model.JDK/jdk-1.7u51

Mime
View raw message