kafka-dev mailing list archives

Site index · List index
Message view « Date » · « Thread »
Top « Date » · « Thread »
From Apache Jenkins Server <jenk...@builds.apache.org>
Subject Build failed in Jenkins: kafka-trunk-jdk7 #933
Date Mon, 04 Jan 2016 22:13:41 GMT
See <https://builds.apache.org/job/kafka-trunk-jdk7/933/changes>

Changes:

[me] KAFKA-2422: Allow copycat connector plugins to be aliased to simpler

------------------------------------------
[...truncated 4753 lines...]
org.apache.kafka.connect.storage.KafkaConfigStorageTest > testRestore PASSED

org.apache.kafka.connect.storage.KafkaConfigStorageTest > testPutTaskConfigsDoesNotResolveAllInconsistencies
PASSED

org.apache.kafka.connect.util.KafkaBasedLogTest > testStartStop PASSED

org.apache.kafka.connect.util.KafkaBasedLogTest > testReloadOnStart PASSED

org.apache.kafka.connect.util.KafkaBasedLogTest > testSendAndReadToEnd PASSED

org.apache.kafka.connect.util.KafkaBasedLogTest > testConsumerError PASSED

org.apache.kafka.connect.util.KafkaBasedLogTest > testProducerError PASSED

org.apache.kafka.connect.util.ShutdownableThreadTest > testGracefulShutdown PASSED

org.apache.kafka.connect.util.ShutdownableThreadTest > testForcibleShutdown PASSED
:testAll

BUILD SUCCESSFUL

Total time: 1 hrs 33 mins 18.614 secs
+ ./gradlew --stacktrace docsJarAll
To honour the JVM settings for this build a new JVM will be forked. Please consider using
the daemon: https://docs.gradle.org/2.10/userguide/gradle_daemon.html.
Building project 'core' with Scala version 2.10.6
:docsJar_2_10
Building project 'core' with Scala version 2.10.6
:kafka-trunk-jdk7:clients:compileJava UP-TO-DATE
:kafka-trunk-jdk7:clients:processResources UP-TO-DATE
:kafka-trunk-jdk7:clients:classes UP-TO-DATE
:kafka-trunk-jdk7:clients:determineCommitId UP-TO-DATE
:kafka-trunk-jdk7:clients:createVersionFile
:kafka-trunk-jdk7:clients:jar UP-TO-DATE
:kafka-trunk-jdk7:clients:javadoc UP-TO-DATE
:kafka-trunk-jdk7:core:compileJava UP-TO-DATE
:kafka-trunk-jdk7:core:compileScala
<https://builds.apache.org/job/kafka-trunk-jdk7/ws/core/src/main/scala/kafka/api/OffsetCommitRequest.scala>:79:
value DEFAULT_TIMESTAMP in object OffsetCommitRequest is deprecated: see corresponding Javadoc
for more information.
            org.apache.kafka.common.requests.OffsetCommitRequest.DEFAULT_TIMESTAMP
                                                                 ^
<https://builds.apache.org/job/kafka-trunk-jdk7/ws/core/src/main/scala/kafka/common/OffsetMetadataAndError.scala>:36:
value DEFAULT_TIMESTAMP in object OffsetCommitRequest is deprecated: see corresponding Javadoc
for more information.
                             commitTimestamp: Long = org.apache.kafka.common.requests.OffsetCommitRequest.DEFAULT_TIMESTAMP,
                                                                                         
                ^
<https://builds.apache.org/job/kafka-trunk-jdk7/ws/core/src/main/scala/kafka/common/OffsetMetadataAndError.scala>:37:
value DEFAULT_TIMESTAMP in object OffsetCommitRequest is deprecated: see corresponding Javadoc
for more information.
                             expireTimestamp: Long = org.apache.kafka.common.requests.OffsetCommitRequest.DEFAULT_TIMESTAMP)
{
                                                                                         
                ^
<https://builds.apache.org/job/kafka-trunk-jdk7/ws/core/src/main/scala/kafka/coordinator/GroupMetadataManager.scala>:394:
value DEFAULT_TIMESTAMP in object OffsetCommitRequest is deprecated: see corresponding Javadoc
for more information.
                          if (value.expireTimestamp == org.apache.kafka.common.requests.OffsetCommitRequest.DEFAULT_TIMESTAMP)
                                                                                         
                  ^
<https://builds.apache.org/job/kafka-trunk-jdk7/ws/core/src/main/scala/kafka/server/KafkaApis.scala>:284:
value DEFAULT_TIMESTAMP in object OffsetCommitRequest is deprecated: see corresponding Javadoc
for more information.
            if (offsetAndMetadata.commitTimestamp == org.apache.kafka.common.requests.OffsetCommitRequest.DEFAULT_TIMESTAMP)
                                                                                         
                ^
<https://builds.apache.org/job/kafka-trunk-jdk7/ws/core/src/main/scala/kafka/server/KafkaServer.scala>:301:
a pure expression does nothing in statement position; you may be omitting necessary parentheses
    ControllerStats.uncleanLeaderElectionRate
                    ^
<https://builds.apache.org/job/kafka-trunk-jdk7/ws/core/src/main/scala/kafka/server/KafkaServer.scala>:302:
a pure expression does nothing in statement position; you may be omitting necessary parentheses
    ControllerStats.leaderElectionTimer
                    ^
<https://builds.apache.org/job/kafka-trunk-jdk7/ws/core/src/main/scala/kafka/tools/EndToEndLatency.scala>:74:
value BLOCK_ON_BUFFER_FULL_CONFIG in object ProducerConfig is deprecated: see corresponding
Javadoc for more information.
    producerProps.put(ProducerConfig.BLOCK_ON_BUFFER_FULL_CONFIG, "true")
                                     ^
<https://builds.apache.org/job/kafka-trunk-jdk7/ws/core/src/main/scala/kafka/tools/MirrorMaker.scala>:195:
value BLOCK_ON_BUFFER_FULL_CONFIG in object ProducerConfig is deprecated: see corresponding
Javadoc for more information.
      maybeSetDefaultProperty(producerProps, ProducerConfig.BLOCK_ON_BUFFER_FULL_CONFIG, "true")
                                                            ^
<https://builds.apache.org/job/kafka-trunk-jdk7/ws/core/src/main/scala/kafka/tools/ProducerPerformance.scala>:40:
@deprecated now takes two arguments; see the scaladoc.
@deprecated
 ^
<https://builds.apache.org/job/kafka-trunk-jdk7/ws/core/src/main/scala/kafka/controller/ControllerChannelManager.scala>:389:
class BrokerEndPoint in object UpdateMetadataRequest is deprecated: see corresponding Javadoc
for more information.
              new UpdateMetadataRequest.BrokerEndPoint(brokerEndPoint.id, brokerEndPoint.host,
brokerEndPoint.port)
                                        ^
<https://builds.apache.org/job/kafka-trunk-jdk7/ws/core/src/main/scala/kafka/controller/ControllerChannelManager.scala>:391:
constructor UpdateMetadataRequest in class UpdateMetadataRequest is deprecated: see corresponding
Javadoc for more information.
            new UpdateMetadataRequest(controllerId, controllerEpoch, liveBrokers.asJava, partitionStates.asJava)
            ^
<https://builds.apache.org/job/kafka-trunk-jdk7/ws/core/src/main/scala/kafka/network/BlockingChannel.scala>:129:
method readFromReadableChannel in class NetworkReceive is deprecated: see corresponding Javadoc
for more information.
      response.readFromReadableChannel(channel)
               ^
there were 15 feature warning(s); re-run with -feature for details
14 warnings found
:kafka-trunk-jdk7:core:processResources UP-TO-DATE
:kafka-trunk-jdk7:core:classes
:kafka-trunk-jdk7:core:javadoc
:docsJar_2_10 FAILED

FAILURE: Build failed with an exception.

* What went wrong:
Could not add entry '<https://builds.apache.org/job/kafka-trunk-jdk7/ws/core/build/docs/javadoc/kafka/javaapi/consumer/package-summary.html'>
to cache fileHashes.bin (<https://builds.apache.org/job/kafka-trunk-jdk7/ws/.gradle/2.10/taskArtifacts/fileHashes.bin).>
> Corrupted FreeListBlock 667654 found in cache '<https://builds.apache.org/job/kafka-trunk-jdk7/ws/.gradle/2.10/taskArtifacts/fileHashes.bin'.>

* Try:
Run with --info or --debug option to get more log output.

* Exception is:
org.gradle.api.UncheckedIOException: Could not add entry '<https://builds.apache.org/job/kafka-trunk-jdk7/ws/core/build/docs/javadoc/kafka/javaapi/consumer/package-summary.html'>
to cache fileHashes.bin (<https://builds.apache.org/job/kafka-trunk-jdk7/ws/.gradle/2.10/taskArtifacts/fileHashes.bin).>
	at org.gradle.cache.internal.btree.BTreePersistentIndexedCache.put(BTreePersistentIndexedCache.java:155)
	at org.gradle.cache.internal.DefaultMultiProcessSafePersistentIndexedCache$2.run(DefaultMultiProcessSafePersistentIndexedCache.java:51)
	at org.gradle.cache.internal.DefaultFileLockManager$DefaultFileLock.doWriteAction(DefaultFileLockManager.java:173)
	at org.gradle.cache.internal.DefaultFileLockManager$DefaultFileLock.writeFile(DefaultFileLockManager.java:163)
	at org.gradle.cache.internal.DefaultCacheAccess$UnitOfWorkFileAccess.writeFile(DefaultCacheAccess.java:404)
	at org.gradle.cache.internal.DefaultMultiProcessSafePersistentIndexedCache.put(DefaultMultiProcessSafePersistentIndexedCache.java:49)
	at org.gradle.api.internal.changedetection.state.InMemoryTaskArtifactCache$1.put(InMemoryTaskArtifactCache.java:98)
	at org.gradle.api.internal.changedetection.state.CachingFileSnapshotter.snapshot(CachingFileSnapshotter.java:59)
	at org.gradle.api.internal.changedetection.state.CachingFileSnapshotter.snapshot(CachingFileSnapshotter.java:46)
	at org.gradle.api.internal.changedetection.state.CachingFileSnapshotter.snapshot(CachingFileSnapshotter.java:29)
	at org.gradle.api.internal.changedetection.state.DefaultFileCollectionSnapshotter$1.run(DefaultFileCollectionSnapshotter.java:70)
	at org.gradle.internal.Factories$1.create(Factories.java:22)
	at org.gradle.cache.internal.DefaultCacheAccess.useCache(DefaultCacheAccess.java:192)
	at org.gradle.cache.internal.DefaultCacheAccess.useCache(DefaultCacheAccess.java:175)
	at org.gradle.cache.internal.DefaultPersistentDirectoryStore.useCache(DefaultPersistentDirectoryStore.java:106)
	at org.gradle.cache.internal.DefaultCacheFactory$ReferenceTrackingCache.useCache(DefaultCacheFactory.java:187)
	at org.gradle.api.internal.changedetection.state.DefaultTaskArtifactStateCacheAccess.useCache(DefaultTaskArtifactStateCacheAccess.java:60)
	at org.gradle.api.internal.changedetection.state.DefaultFileCollectionSnapshotter.snapshot(DefaultFileCollectionSnapshotter.java:62)
	at org.gradle.api.internal.changedetection.state.OutputFilesCollectionSnapshotter.snapshot(OutputFilesCollectionSnapshotter.java:93)
	at org.gradle.api.internal.changedetection.state.OutputFilesCollectionSnapshotter.snapshot(OutputFilesCollectionSnapshotter.java:44)
	at org.gradle.api.internal.changedetection.rules.OutputFilesStateChangeRule$1.snapshotAfterTask(OutputFilesStateChangeRule.java:79)
	at org.gradle.api.internal.changedetection.rules.CachingTaskStateChanges.snapshotAfterTask(CachingTaskStateChanges.java:84)
	at org.gradle.api.internal.changedetection.rules.SummaryTaskStateChanges.snapshotAfterTask(SummaryTaskStateChanges.java:73)
	at org.gradle.api.internal.changedetection.changes.DefaultTaskArtifactStateRepository$TaskArtifactStateImpl.afterTask(DefaultTaskArtifactStateRepository.java:123)
	at org.gradle.api.internal.tasks.execution.SkipUpToDateTaskExecuter.execute(SkipUpToDateTaskExecuter.java:66)
	at org.gradle.api.internal.tasks.execution.ValidatingTaskExecuter.execute(ValidatingTaskExecuter.java:58)
	at org.gradle.api.internal.tasks.execution.SkipEmptySourceFilesTaskExecuter.execute(SkipEmptySourceFilesTaskExecuter.java:52)
	at org.gradle.api.internal.tasks.execution.SkipTaskWithNoActionsExecuter.execute(SkipTaskWithNoActionsExecuter.java:52)
	at org.gradle.api.internal.tasks.execution.SkipOnlyIfTaskExecuter.execute(SkipOnlyIfTaskExecuter.java:53)
	at org.gradle.api.internal.tasks.execution.ExecuteAtMostOnceTaskExecuter.execute(ExecuteAtMostOnceTaskExecuter.java:43)
	at org.gradle.execution.taskgraph.DefaultTaskGraphExecuter$EventFiringTaskWorker.execute(DefaultTaskGraphExecuter.java:203)
	at org.gradle.execution.taskgraph.DefaultTaskGraphExecuter$EventFiringTaskWorker.execute(DefaultTaskGraphExecuter.java:185)
	at org.gradle.execution.taskgraph.AbstractTaskPlanExecutor$TaskExecutorWorker.processTask(AbstractTaskPlanExecutor.java:66)
	at org.gradle.execution.taskgraph.AbstractTaskPlanExecutor$TaskExecutorWorker.run(AbstractTaskPlanExecutor.java:50)
	at org.gradle.execution.taskgraph.DefaultTaskPlanExecutor.process(DefaultTaskPlanExecutor.java:25)
	at org.gradle.execution.taskgraph.DefaultTaskGraphExecuter.execute(DefaultTaskGraphExecuter.java:110)
	at org.gradle.execution.SelectedTaskExecutionAction.execute(SelectedTaskExecutionAction.java:37)
	at org.gradle.execution.DefaultBuildExecuter.execute(DefaultBuildExecuter.java:37)
	at org.gradle.execution.DefaultBuildExecuter.access$000(DefaultBuildExecuter.java:23)
	at org.gradle.execution.DefaultBuildExecuter$1.proceed(DefaultBuildExecuter.java:43)
	at org.gradle.execution.DryRunBuildExecutionAction.execute(DryRunBuildExecutionAction.java:32)
	at org.gradle.execution.DefaultBuildExecuter.execute(DefaultBuildExecuter.java:37)
	at org.gradle.execution.DefaultBuildExecuter.execute(DefaultBuildExecuter.java:30)
	at org.gradle.initialization.DefaultGradleLauncher$4.run(DefaultGradleLauncher.java:154)
	at org.gradle.internal.Factories$1.create(Factories.java:22)
	at org.gradle.internal.progress.DefaultBuildOperationExecutor.run(DefaultBuildOperationExecutor.java:90)
	at org.gradle.internal.progress.DefaultBuildOperationExecutor.run(DefaultBuildOperationExecutor.java:52)
	at org.gradle.initialization.DefaultGradleLauncher.doBuildStages(DefaultGradleLauncher.java:151)
	at org.gradle.initialization.DefaultGradleLauncher.access$200(DefaultGradleLauncher.java:32)
	at org.gradle.initialization.DefaultGradleLauncher$1.create(DefaultGradleLauncher.java:99)
	at org.gradle.initialization.DefaultGradleLauncher$1.create(DefaultGradleLauncher.java:93)
	at org.gradle.internal.progress.DefaultBuildOperationExecutor.run(DefaultBuildOperationExecutor.java:90)
	at org.gradle.internal.progress.DefaultBuildOperationExecutor.run(DefaultBuildOperationExecutor.java:62)
	at org.gradle.initialization.DefaultGradleLauncher.doBuild(DefaultGradleLauncher.java:93)
	at org.gradle.initialization.DefaultGradleLauncher.run(DefaultGradleLauncher.java:82)
	at org.gradle.api.tasks.GradleBuild.build(GradleBuild.java:117)
	at org.gradle.internal.reflect.JavaMethod.invoke(JavaMethod.java:75)
	at org.gradle.api.internal.project.taskfactory.AnnotationProcessingTaskFactory$StandardTaskAction.doExecute(AnnotationProcessingTaskFactory.java:227)
	at org.gradle.api.internal.project.taskfactory.AnnotationProcessingTaskFactory$StandardTaskAction.execute(AnnotationProcessingTaskFactory.java:220)
	at org.gradle.api.internal.project.taskfactory.AnnotationProcessingTaskFactory$StandardTaskAction.execute(AnnotationProcessingTaskFactory.java:209)
	at org.gradle.api.internal.AbstractTask$TaskActionWrapper.execute(AbstractTask.java:585)
	at org.gradle.api.internal.AbstractTask$TaskActionWrapper.execute(AbstractTask.java:568)
	at org.gradle.api.internal.tasks.execution.ExecuteActionsTaskExecuter.executeAction(ExecuteActionsTaskExecuter.java:80)
	at org.gradle.api.internal.tasks.execution.ExecuteActionsTaskExecuter.executeActions(ExecuteActionsTaskExecuter.java:61)
	at org.gradle.api.internal.tasks.execution.ExecuteActionsTaskExecuter.execute(ExecuteActionsTaskExecuter.java:46)
	at org.gradle.api.internal.tasks.execution.PostExecutionAnalysisTaskExecuter.execute(PostExecutionAnalysisTaskExecuter.java:35)
	at org.gradle.api.internal.tasks.execution.SkipUpToDateTaskExecuter.execute(SkipUpToDateTaskExecuter.java:64)
	at org.gradle.api.internal.tasks.execution.ValidatingTaskExecuter.execute(ValidatingTaskExecuter.java:58)
	at org.gradle.api.internal.tasks.execution.SkipEmptySourceFilesTaskExecuter.execute(SkipEmptySourceFilesTaskExecuter.java:52)
	at org.gradle.api.internal.tasks.execution.SkipTaskWithNoActionsExecuter.execute(SkipTaskWithNoActionsExecuter.java:52)
	at org.gradle.api.internal.tasks.execution.SkipOnlyIfTaskExecuter.execute(SkipOnlyIfTaskExecuter.java:53)
	at org.gradle.api.internal.tasks.execution.ExecuteAtMostOnceTaskExecuter.execute(ExecuteAtMostOnceTaskExecuter.java:43)
	at org.gradle.execution.taskgraph.DefaultTaskGraphExecuter$EventFiringTaskWorker.execute(DefaultTaskGraphExecuter.java:203)
	at org.gradle.execution.taskgraph.DefaultTaskGraphExecuter$EventFiringTaskWorker.execute(DefaultTaskGraphExecuter.java:185)
	at org.gradle.execution.taskgraph.AbstractTaskPlanExecutor$TaskExecutorWorker.processTask(AbstractTaskPlanExecutor.java:66)
	at org.gradle.execution.taskgraph.AbstractTaskPlanExecutor$TaskExecutorWorker.run(AbstractTaskPlanExecutor.java:50)
	at org.gradle.execution.taskgraph.DefaultTaskPlanExecutor.process(DefaultTaskPlanExecutor.java:25)
	at org.gradle.execution.taskgraph.DefaultTaskGraphExecuter.execute(DefaultTaskGraphExecuter.java:110)
	at org.gradle.execution.SelectedTaskExecutionAction.execute(SelectedTaskExecutionAction.java:37)
	at org.gradle.execution.DefaultBuildExecuter.execute(DefaultBuildExecuter.java:37)
	at org.gradle.execution.DefaultBuildExecuter.access$000(DefaultBuildExecuter.java:23)
	at org.gradle.execution.DefaultBuildExecuter$1.proceed(DefaultBuildExecuter.java:43)
	at org.gradle.execution.DryRunBuildExecutionAction.execute(DryRunBuildExecutionAction.java:32)
	at org.gradle.execution.DefaultBuildExecuter.execute(DefaultBuildExecuter.java:37)
	at org.gradle.execution.DefaultBuildExecuter.execute(DefaultBuildExecuter.java:30)
	at org.gradle.initialization.DefaultGradleLauncher$4.run(DefaultGradleLauncher.java:154)
	at org.gradle.internal.Factories$1.create(Factories.java:22)
	at org.gradle.internal.progress.DefaultBuildOperationExecutor.run(DefaultBuildOperationExecutor.java:90)
	at org.gradle.internal.progress.DefaultBuildOperationExecutor.run(DefaultBuildOperationExecutor.java:52)
	at org.gradle.initialization.DefaultGradleLauncher.doBuildStages(DefaultGradleLauncher.java:151)
	at org.gradle.initialization.DefaultGradleLauncher.access$200(DefaultGradleLauncher.java:32)
	at org.gradle.initialization.DefaultGradleLauncher$1.create(DefaultGradleLauncher.java:99)
	at org.gradle.initialization.DefaultGradleLauncher$1.create(DefaultGradleLauncher.java:93)
	at org.gradle.internal.progress.DefaultBuildOperationExecutor.run(DefaultBuildOperationExecutor.java:90)
	at org.gradle.internal.progress.DefaultBuildOperationExecutor.run(DefaultBuildOperationExecutor.java:62)
	at org.gradle.initialization.DefaultGradleLauncher.doBuild(DefaultGradleLauncher.java:93)
	at org.gradle.initialization.DefaultGradleLauncher.run(DefaultGradleLauncher.java:82)
	at org.gradle.launcher.exec.InProcessBuildActionExecuter$DefaultBuildController.run(InProcessBuildActionExecuter.java:94)
	at org.gradle.tooling.internal.provider.ExecuteBuildActionRunner.run(ExecuteBuildActionRunner.java:28)
	at org.gradle.launcher.exec.ChainingBuildActionRunner.run(ChainingBuildActionRunner.java:35)
	at org.gradle.launcher.exec.InProcessBuildActionExecuter.execute(InProcessBuildActionExecuter.java:43)
	at org.gradle.launcher.exec.InProcessBuildActionExecuter.execute(InProcessBuildActionExecuter.java:28)
	at org.gradle.launcher.exec.ContinuousBuildActionExecuter.execute(ContinuousBuildActionExecuter.java:78)
	at org.gradle.launcher.exec.ContinuousBuildActionExecuter.execute(ContinuousBuildActionExecuter.java:48)
	at org.gradle.launcher.daemon.server.exec.ExecuteBuild.doBuild(ExecuteBuild.java:52)
	at org.gradle.launcher.daemon.server.exec.BuildCommandOnly.execute(BuildCommandOnly.java:36)
	at org.gradle.launcher.daemon.server.api.DaemonCommandExecution.proceed(DaemonCommandExecution.java:120)
	at org.gradle.launcher.daemon.server.exec.WatchForDisconnection.execute(WatchForDisconnection.java:37)
	at org.gradle.launcher.daemon.server.api.DaemonCommandExecution.proceed(DaemonCommandExecution.java:120)
	at org.gradle.launcher.daemon.server.exec.ResetDeprecationLogger.execute(ResetDeprecationLogger.java:26)
	at org.gradle.launcher.daemon.server.api.DaemonCommandExecution.proceed(DaemonCommandExecution.java:120)
	at org.gradle.launcher.daemon.server.exec.RequestStopIfSingleUsedDaemon.execute(RequestStopIfSingleUsedDaemon.java:34)
	at org.gradle.launcher.daemon.server.api.DaemonCommandExecution.proceed(DaemonCommandExecution.java:120)
	at org.gradle.launcher.daemon.server.exec.ForwardClientInput$2.call(ForwardClientInput.java:74)
	at org.gradle.launcher.daemon.server.exec.ForwardClientInput$2.call(ForwardClientInput.java:72)
	at org.gradle.util.Swapper.swap(Swapper.java:38)
	at org.gradle.launcher.daemon.server.exec.ForwardClientInput.execute(ForwardClientInput.java:72)
	at org.gradle.launcher.daemon.server.api.DaemonCommandExecution.proceed(DaemonCommandExecution.java:120)
	at org.gradle.launcher.daemon.server.health.DaemonHealthTracker.execute(DaemonHealthTracker.java:40)
	at org.gradle.launcher.daemon.server.api.DaemonCommandExecution.proceed(DaemonCommandExecution.java:120)
	at org.gradle.launcher.daemon.server.exec.LogToClient.doBuild(LogToClient.java:66)
	at org.gradle.launcher.daemon.server.exec.BuildCommandOnly.execute(BuildCommandOnly.java:36)
	at org.gradle.launcher.daemon.server.api.DaemonCommandExecution.proceed(DaemonCommandExecution.java:120)
	at org.gradle.launcher.daemon.server.exec.EstablishBuildEnvironment.doBuild(EstablishBuildEnvironment.java:72)
	at org.gradle.launcher.daemon.server.exec.BuildCommandOnly.execute(BuildCommandOnly.java:36)
	at org.gradle.launcher.daemon.server.api.DaemonCommandExecution.proceed(DaemonCommandExecution.java:120)
	at org.gradle.launcher.daemon.server.health.HintGCAfterBuild.execute(HintGCAfterBuild.java:41)
	at org.gradle.launcher.daemon.server.api.DaemonCommandExecution.proceed(DaemonCommandExecution.java:120)
	at org.gradle.launcher.daemon.server.exec.StartBuildOrRespondWithBusy$1.run(StartBuildOrRespondWithBusy.java:50)
	at org.gradle.launcher.daemon.server.DaemonStateCoordinator$1.run(DaemonStateCoordinator.java:246)
	at org.gradle.internal.concurrent.ExecutorPolicy$CatchAndRecordFailures.onExecute(ExecutorPolicy.java:54)
	at org.gradle.internal.concurrent.StoppableExecutorImpl$1.run(StoppableExecutorImpl.java:40)
Caused by: org.gradle.cache.internal.btree.CorruptedCacheException: Corrupted FreeListBlock
667654 found in cache '<https://builds.apache.org/job/kafka-trunk-jdk7/ws/.gradle/2.10/taskArtifacts/fileHashes.bin'.>
	at org.gradle.cache.internal.btree.FileBackedBlockStore$BlockImpl.blockCorruptedException(FileBackedBlockStore.java:247)
	at org.gradle.cache.internal.btree.FileBackedBlockStore$BlockImpl.read(FileBackedBlockStore.java:210)
	at org.gradle.cache.internal.btree.FileBackedBlockStore.read(FileBackedBlockStore.java:98)
	at org.gradle.cache.internal.btree.CachingBlockStore.read(CachingBlockStore.java:84)
	at org.gradle.cache.internal.btree.FreeListBlockStore.read(FreeListBlockStore.java:78)
	at org.gradle.cache.internal.btree.FreeListBlockStore$FreeListBlock.getNextBlock(FreeListBlockStore.java:204)
	at org.gradle.cache.internal.btree.FreeListBlockStore$FreeListBlock.alloc(FreeListBlockStore.java:221)
	at org.gradle.cache.internal.btree.FreeListBlockStore.attach(FreeListBlockStore.java:88)
	at org.gradle.cache.internal.btree.FreeListBlockStore.write(FreeListBlockStore.java:82)
	at org.gradle.cache.internal.btree.StateCheckBlockStore.write(StateCheckBlockStore.java:66)
	at org.gradle.cache.internal.btree.BTreePersistentIndexedCache.put(BTreePersistentIndexedCache.java:150)
	... 131 more


BUILD FAILED

Total time: 1 mins 27.805 secs
Build step 'Execute shell' marked build as failure
Recording test results
Setting GRADLE_2_4_RC_2_HOME=/home/jenkins/jenkins-slave/tools/hudson.plugins.gradle.GradleInstallation/Gradle_2.4-rc-2
Setting JDK_1_7U51_HOME=/home/jenkins/jenkins-slave/tools/hudson.model.JDK/jdk-1.7u51
Setting GRADLE_2_4_RC_2_HOME=/home/jenkins/jenkins-slave/tools/hudson.plugins.gradle.GradleInstallation/Gradle_2.4-rc-2
Setting JDK_1_7U51_HOME=/home/jenkins/jenkins-slave/tools/hudson.model.JDK/jdk-1.7u51

Mime
View raw message