kafka-dev mailing list archives

Site index · List index
Message view « Date » · « Thread »
Top « Date » · « Thread »
From Apache Jenkins Server <jenk...@builds.apache.org>
Subject Build failed in Jenkins: Kafka-trunk #351
Date Sat, 06 Dec 2014 00:14:49 GMT
See <https://builds.apache.org/job/Kafka-trunk/351/changes>

Changes:

[guwang] KAFKA-1650; avoid data loss when mirror maker shutdown uncleanly; reviewed by Guozhang
Wang

------------------------------------------
[...truncated 477 lines...]
kafka.utils.SchedulerTest > testPeriodicTask PASSED

kafka.utils.JsonTest > testJsonEncoding PASSED

kafka.utils.ReplicationUtilsTest > testUpdateLeaderAndIsr PASSED

kafka.utils.UtilsTest > testSwallow PASSED

kafka.utils.UtilsTest > testCircularIterator PASSED

kafka.utils.UtilsTest > testReadBytes PASSED

kafka.utils.UtilsTest > testAbs PASSED

kafka.utils.UtilsTest > testReplaceSuffix PASSED

kafka.utils.UtilsTest > testReadInt PASSED

kafka.utils.UtilsTest > testCsvList PASSED

kafka.utils.UtilsTest > testInLock PASSED

kafka.utils.IteratorTemplateTest > testIterator PASSED

kafka.zk.ZKEphemeralTest > testEphemeralNodeCleanup PASSED

kafka.metrics.KafkaTimerTest > testKafkaTimer PASSED

kafka.log.LogTest > testTimeBasedLogRoll PASSED

kafka.log.LogTest > testTimeBasedLogRollJitter PASSED

kafka.log.LogTest > testSizeBasedLogRoll PASSED

kafka.log.LogTest > testLoadEmptyLog PASSED

kafka.log.LogTest > testAppendAndReadWithSequentialOffsets PASSED

kafka.log.LogTest > testAppendAndReadWithNonSequentialOffsets PASSED

kafka.log.LogTest > testReadAtLogGap PASSED

kafka.log.LogTest > testReadOutOfRange PASSED

kafka.log.LogTest > testLogRolls PASSED

kafka.log.LogTest > testCompressedMessages PASSED

kafka.log.LogTest > testThatGarbageCollectingSegmentsDoesntChangeOffset PASSED

kafka.log.LogTest > testMessageSetSizeCheck PASSED

kafka.log.LogTest > testMessageSizeCheck PASSED

kafka.log.LogTest > testLogRecoversToCorrectOffset PASSED

kafka.log.LogTest > testIndexRebuild PASSED

kafka.log.LogTest > testTruncateTo PASSED

kafka.log.LogTest > testIndexResizingAtTruncation PASSED

kafka.log.LogTest > testBogusIndexSegmentsAreRemoved PASSED

kafka.log.LogTest > testReopenThenTruncate PASSED

kafka.log.LogTest > testAsyncDelete PASSED

kafka.log.LogTest > testOpenDeletesObsoleteFiles PASSED

kafka.log.LogTest > testAppendMessageWithNullPayload PASSED

kafka.log.LogTest > testCorruptLog PASSED

kafka.log.LogTest > testCleanShutdownFile PASSED

kafka.log.LogSegmentTest > testReadOnEmptySegment PASSED

kafka.log.LogSegmentTest > testReadBeforeFirstOffset PASSED

kafka.log.LogSegmentTest > testMaxOffset PASSED

kafka.log.LogSegmentTest > testReadAfterLast PASSED

kafka.log.LogSegmentTest > testReadFromGap PASSED

kafka.log.LogSegmentTest > testTruncate PASSED

kafka.log.LogSegmentTest > testTruncateFull PASSED

kafka.log.LogSegmentTest > testNextOffsetCalculation PASSED

kafka.log.LogSegmentTest > testChangeFileSuffixes PASSED

kafka.log.LogSegmentTest > testRecoveryFixesCorruptIndex PASSED

kafka.log.LogSegmentTest > testRecoveryWithCorruptMessage PASSED

kafka.log.LogConfigTest > testFromPropsDefaults PASSED

kafka.log.LogConfigTest > testFromPropsEmpty PASSED

kafka.log.LogConfigTest > testFromPropsToProps PASSED

kafka.log.LogConfigTest > testFromPropsInvalid PASSED

kafka.log.CleanerTest > testCleanSegments PASSED

kafka.log.CleanerTest > testCleaningWithDeletes PASSED

kafka.log.CleanerTest > testCleanSegmentsWithAbort PASSED

kafka.log.CleanerTest > testSegmentGrouping PASSED

kafka.log.CleanerTest > testBuildOffsetMap PASSED

kafka.log.FileMessageSetTest > testWrittenEqualsRead PASSED

kafka.log.FileMessageSetTest > testIteratorIsConsistent PASSED

kafka.log.FileMessageSetTest > testSizeInBytes PASSED

kafka.log.FileMessageSetTest > testWriteTo PASSED

kafka.log.FileMessageSetTest > testTruncate PASSED

kafka.log.FileMessageSetTest > testFileSize PASSED

kafka.log.FileMessageSetTest > testIterationOverPartialAndTruncation PASSED

kafka.log.FileMessageSetTest > testIterationDoesntChangePosition PASSED

kafka.log.FileMessageSetTest > testRead PASSED

kafka.log.FileMessageSetTest > testSearch PASSED

kafka.log.FileMessageSetTest > testIteratorWithLimits PASSED

kafka.log.OffsetMapTest > testBasicValidation PASSED

kafka.log.OffsetMapTest > testClear PASSED

kafka.log.OffsetIndexTest > truncate PASSED

kafka.log.OffsetIndexTest > randomLookupTest PASSED

kafka.log.OffsetIndexTest > lookupExtremeCases PASSED

kafka.log.OffsetIndexTest > appendTooMany PASSED

kafka.log.OffsetIndexTest > appendOutOfOrder PASSED

kafka.log.OffsetIndexTest > testReopen PASSED

kafka.log.LogManagerTest > testCreateLog PASSED

kafka.log.LogManagerTest > testGetNonExistentLog PASSED

kafka.log.LogManagerTest > testCleanupExpiredSegments PASSED

kafka.log.LogManagerTest > testCleanupSegmentsToMaintainSize PASSED

kafka.log.LogManagerTest > testTimeBasedFlush PASSED

kafka.log.LogManagerTest > testLeastLoadedAssignment PASSED

kafka.log.LogManagerTest > testTwoLogManagersUsingSameDirFails PASSED

kafka.log.LogManagerTest > testCheckpointRecoveryPoints PASSED

kafka.log.LogManagerTest > testRecoveryDirectoryMappingWithTrailingSlash PASSED

kafka.log.LogManagerTest > testRecoveryDirectoryMappingWithRelativeDirectory PASSED

kafka.log.LogCleanerIntegrationTest > cleanerTest PASSED

kafka.log4j.KafkaLog4jAppenderTest > testKafkaLog4jConfigs PASSED

kafka.log4j.KafkaLog4jAppenderTest > testLog4jAppends PASSED

kafka.admin.AdminTest > testReplicaAssignment PASSED

kafka.admin.AdminTest > testManualReplicaAssignment PASSED

kafka.admin.AdminTest > testTopicCreationInZK PASSED

kafka.admin.AdminTest > testPartitionReassignmentWithLeaderInNewReplicas PASSED

kafka.admin.AdminTest > testPartitionReassignmentWithLeaderNotInNewReplicas PASSED

kafka.admin.AdminTest > testPartitionReassignmentNonOverlappingReplicas PASSED

kafka.admin.AdminTest > testReassigningNonExistingPartition PASSED

kafka.admin.AdminTest > testResumePartitionReassignmentThatWasCompleted PASSED

kafka.admin.AdminTest > testPreferredReplicaJsonData PASSED

kafka.admin.AdminTest > testBasicPreferredReplicaElection PASSED

kafka.admin.AdminTest > testShutdownBroker PASSED

kafka.admin.AdminTest > testTopicConfigChange PASSED

kafka.admin.TopicCommandTest > testConfigPreservationAcrossPartitionAlteration PASSED

kafka.admin.DeleteTopicTest > testDeleteTopicWithAllAliveReplicas PASSED

kafka.admin.DeleteTopicTest > testResumeDeleteTopicWithRecoveredFollower PASSED

kafka.admin.DeleteTopicTest > testResumeDeleteTopicOnControllerFailover PASSED

kafka.admin.DeleteTopicTest > testPartitionReassignmentDuringDeleteTopic PASSED

kafka.admin.DeleteTopicTest > testDeleteTopicDuringAddPartition PASSED

kafka.admin.DeleteTopicTest > testAddPartitionDuringDeleteTopic PASSED

kafka.admin.DeleteTopicTest > testRecreateTopicAfterDeletion PASSED

kafka.admin.DeleteTopicTest > testDeleteNonExistingTopic PASSED

kafka.admin.AddPartitionsTest > testTopicDoesNotExist PASSED

kafka.admin.AddPartitionsTest > testWrongReplicaCount PASSED

kafka.admin.AddPartitionsTest > testIncrementPartitions PASSED

kafka.admin.AddPartitionsTest > testManualAssignmentOfReplicas PASSED

kafka.admin.AddPartitionsTest > testReplicaPlacement PASSED

293 tests completed, 4 failed
:core:test FAILED

FAILURE: Build failed with an exception.

* What went wrong:
Execution failed for task ':core:test'.
> There were failing tests. See the report at: file://<https://builds.apache.org/job/Kafka-trunk/ws/core/build/reports/tests/index.html>

* Try:
Run with --stacktrace option to get the stack trace. Run with --info or --debug option to
get more log output.

BUILD FAILED

Total time: 6 mins 9.026 secs
Build step 'Execute shell' marked build as failure
Setting GRADLE_2_1_HOME=/home/jenkins/jenkins-slave/tools/hudson.plugins.gradle.GradleInstallation/Gradle_2.1

Mime
View raw message