kafka-dev mailing list archives

Site index · List index
Message view « Date » · « Thread »
Top « Date » · « Thread »
From Apache Jenkins Server <jenk...@builds.apache.org>
Subject Build failed in Jenkins: Kafka-trunk #356
Date Thu, 18 Dec 2014 01:14:59 GMT
See <https://builds.apache.org/job/Kafka-trunk/356/changes>

Changes:

[junrao] kafka-1797; add the serializer/deserializer api to the new java client; patched by
Jun Rao; reviewed by Neha Narkhede

------------------------------------------
[...truncated 979 lines...]

kafka.log.CleanerTest > testBuildOffsetMap PASSED

kafka.log.LogManagerTest > testCreateLog PASSED

kafka.log.LogManagerTest > testGetNonExistentLog PASSED

kafka.log.LogManagerTest > testCleanupExpiredSegments PASSED

kafka.log.LogManagerTest > testCleanupSegmentsToMaintainSize PASSED

kafka.log.LogManagerTest > testTimeBasedFlush PASSED

kafka.log.LogManagerTest > testLeastLoadedAssignment PASSED

kafka.log.LogManagerTest > testTwoLogManagersUsingSameDirFails PASSED

kafka.log.LogManagerTest > testCheckpointRecoveryPoints PASSED

kafka.log.LogManagerTest > testRecoveryDirectoryMappingWithTrailingSlash PASSED

kafka.log.LogManagerTest > testRecoveryDirectoryMappingWithRelativeDirectory PASSED

kafka.log.LogConfigTest > testFromPropsDefaults PASSED

kafka.log.LogConfigTest > testFromPropsEmpty PASSED

kafka.log.LogConfigTest > testFromPropsToProps PASSED

kafka.log.LogConfigTest > testFromPropsInvalid PASSED

kafka.log.OffsetIndexTest > truncate PASSED

kafka.log.OffsetIndexTest > randomLookupTest PASSED

kafka.log.OffsetIndexTest > lookupExtremeCases PASSED

kafka.log.OffsetIndexTest > appendTooMany PASSED

kafka.log.OffsetIndexTest > appendOutOfOrder PASSED

kafka.log.OffsetIndexTest > testReopen PASSED

kafka.log.FileMessageSetTest > testWrittenEqualsRead PASSED

kafka.log.FileMessageSetTest > testIteratorIsConsistent PASSED

kafka.log.FileMessageSetTest > testSizeInBytes PASSED

kafka.log.FileMessageSetTest > testWriteTo PASSED

kafka.log.FileMessageSetTest > testFileSize PASSED

kafka.log.FileMessageSetTest > testIterationOverPartialAndTruncation PASSED

kafka.log.FileMessageSetTest > testIterationDoesntChangePosition PASSED

kafka.log.FileMessageSetTest > testRead PASSED

kafka.log.FileMessageSetTest > testSearch PASSED

kafka.log.FileMessageSetTest > testIteratorWithLimits PASSED

kafka.log.FileMessageSetTest > testTruncate PASSED

kafka.log.LogCleanerIntegrationTest > cleanerTest PASSED

kafka.log.OffsetMapTest > testBasicValidation PASSED

kafka.log.OffsetMapTest > testClear PASSED

kafka.log.LogTest > testTimeBasedLogRoll PASSED

kafka.log.LogTest > testTimeBasedLogRollJitter PASSED

kafka.log.LogTest > testSizeBasedLogRoll PASSED

kafka.log.LogTest > testLoadEmptyLog PASSED

kafka.log.LogTest > testAppendAndReadWithSequentialOffsets PASSED

kafka.log.LogTest > testAppendAndReadWithNonSequentialOffsets PASSED

kafka.log.LogTest > testReadAtLogGap PASSED

kafka.log.LogTest > testReadOutOfRange PASSED

kafka.log.LogTest > testLogRolls PASSED

kafka.log.LogTest > testCompressedMessages PASSED

kafka.log.LogTest > testThatGarbageCollectingSegmentsDoesntChangeOffset PASSED

kafka.log.LogTest > testMessageSetSizeCheck PASSED

kafka.log.LogTest > testMessageSizeCheck PASSED

kafka.log.LogTest > testLogRecoversToCorrectOffset PASSED

kafka.log.LogTest > testIndexRebuild PASSED

kafka.log.LogTest > testTruncateTo PASSED

kafka.log.LogTest > testIndexResizingAtTruncation PASSED

kafka.log.LogTest > testBogusIndexSegmentsAreRemoved PASSED

kafka.log.LogTest > testReopenThenTruncate PASSED

kafka.log.LogTest > testAsyncDelete PASSED

kafka.log.LogTest > testOpenDeletesObsoleteFiles PASSED

kafka.log.LogTest > testAppendMessageWithNullPayload PASSED

kafka.log.LogTest > testCorruptLog PASSED

kafka.log.LogTest > testCleanShutdownFile PASSED

kafka.log.LogTest > testParseTopicPartitionName PASSED

kafka.log.LogTest > testParseTopicPartitionNameForEmptyName PASSED

kafka.log.LogTest > testParseTopicPartitionNameForNull PASSED

kafka.log.LogTest > testParseTopicPartitionNameForMissingSeparator PASSED

kafka.log.LogTest > testParseTopicPartitionNameForMissingTopic PASSED

kafka.log.LogTest > testParseTopicPartitionNameForMissingPartition PASSED

kafka.log.LogSegmentTest > testTruncate PASSED

kafka.log.LogSegmentTest > testReadOnEmptySegment PASSED

kafka.log.LogSegmentTest > testReadBeforeFirstOffset PASSED

kafka.log.LogSegmentTest > testMaxOffset PASSED

kafka.log.LogSegmentTest > testReadAfterLast PASSED

kafka.log.LogSegmentTest > testReadFromGap PASSED

kafka.log.LogSegmentTest > testTruncateFull PASSED

kafka.log.LogSegmentTest > testNextOffsetCalculation PASSED

kafka.log.LogSegmentTest > testChangeFileSuffixes PASSED

kafka.log.LogSegmentTest > testRecoveryFixesCorruptIndex PASSED

kafka.log.LogSegmentTest > testRecoveryWithCorruptMessage PASSED

kafka.api.ApiUtilsTest > testShortStringNonASCII PASSED

kafka.api.ApiUtilsTest > testShortStringASCII PASSED

kafka.api.RequestResponseSerializationTest > testSerializationAndDeserialization PASSED

kafka.api.test.ProducerSendTest > testAutoCreateTopic PASSED

kafka.api.test.ProducerSendTest > testSendOffset PASSED

kafka.api.test.ProducerSendTest > testClose PASSED

kafka.api.test.ProducerSendTest > testSendToPartition PASSED

kafka.api.test.ProducerFailureHandlingTest > testNotEnoughReplicas PASSED

kafka.api.test.ProducerFailureHandlingTest > testInvalidPartition PASSED

kafka.api.test.ProducerFailureHandlingTest > testTooLargeRecordWithAckZero PASSED

kafka.api.test.ProducerFailureHandlingTest > testTooLargeRecordWithAckOne PASSED

kafka.api.test.ProducerFailureHandlingTest > testNonExistentTopic PASSED

kafka.api.test.ProducerFailureHandlingTest > testWrongBrokerList PASSED

kafka.api.test.ProducerFailureHandlingTest > testNoResponse PASSED

kafka.api.test.ProducerFailureHandlingTest > testSendAfterClosed PASSED

kafka.api.test.ProducerFailureHandlingTest > testBrokerFailure PASSED

kafka.api.test.ProducerFailureHandlingTest > testCannotSendToInternalTopic PASSED

kafka.api.test.ProducerFailureHandlingTest > testNotEnoughReplicasAfterBrokerShutdown PASSED

kafka.api.test.ProducerCompressionTest > testCompression[0] PASSED

kafka.api.test.ProducerCompressionTest > testCompression[1] PASSED

kafka.api.test.ProducerCompressionTest > testCompression[2] PASSED

kafka.api.test.ProducerCompressionTest > testCompression[3] PASSED

unit.kafka.KafkaTest > testGetKafkaConfigFromArgs PASSED

unit.kafka.KafkaTest > testGetKafkaConfigFromArgsWrongSetValue PASSED

unit.kafka.KafkaTest > testGetKafkaConfigFromArgsNonArgsAtTheEnd PASSED

unit.kafka.KafkaTest > testGetKafkaConfigFromArgsNonArgsOnly PASSED

unit.kafka.KafkaTest > testGetKafkaConfigFromArgsNonArgsAtTheBegging PASSED

unit.kafka.utils.CommandLineUtilsTest > testParseEmptyArg PASSED

unit.kafka.utils.CommandLineUtilsTest > testParseSingleArg PASSED

unit.kafka.utils.CommandLineUtilsTest > testParseArgs PASSED

unit.kafka.utils.ByteBoundedBlockingQueueTest > testByteBoundedBlockingQueue PASSED

unit.kafka.common.TopicTest > testInvalidTopicNames PASSED

unit.kafka.common.ConfigTest > testInvalidClientIds PASSED

unit.kafka.common.ConfigTest > testInvalidGroupIds PASSED

unit.kafka.consumer.PartitionAssignorTest > testRoundRobinPartitionAssignor FAILED
    java.lang.UnsupportedOperationException: empty.max
        at scala.collection.TraversableOnce$class.max(TraversableOnce.scala:216)
        at scala.collection.AbstractIterator.max(Iterator.scala:1157)
        at unit.kafka.consumer.PartitionAssignorTest$.unit$kafka$consumer$PartitionAssignorTest$$assignAndVerify(PartitionAssignorTest.scala:190)
        at unit.kafka.consumer.PartitionAssignorTest$$anonfun$testRoundRobinPartitionAssignor$1.apply$mcVI$sp(PartitionAssignorTest.scala:54)
        at scala.collection.immutable.Range.foreach$mVc$sp(Range.scala:141)
        at unit.kafka.consumer.PartitionAssignorTest.testRoundRobinPartitionAssignor(PartitionAssignorTest.scala:39)

unit.kafka.consumer.PartitionAssignorTest > testRangePartitionAssignor PASSED

300 tests completed, 1 failed
:core:test FAILED

FAILURE: Build failed with an exception.

* What went wrong:
Execution failed for task ':core:test'.
> There were failing tests. See the report at: file://<https://builds.apache.org/job/Kafka-trunk/ws/core/build/reports/tests/index.html>

* Try:
Run with --stacktrace option to get the stack trace. Run with --info or --debug option to
get more log output.

BUILD FAILED

Total time: 6 mins 36.711 secs
Build step 'Execute shell' marked build as failure
Setting GRADLE_2_1_HOME=/home/jenkins/jenkins-slave/tools/hudson.plugins.gradle.GradleInstallation/Gradle_2.1

Mime
View raw message