kafka-dev mailing list archives

Site index · List index
Message view « Date » · « Thread »
Top « Date » · « Thread »
From Apache Jenkins Server <jenk...@builds.apache.org>
Subject Build failed in Jenkins: Kafka-trunk #352
Date Fri, 12 Dec 2014 00:13:24 GMT
See <https://builds.apache.org/job/Kafka-trunk/352/>

------------------------------------------
[...truncated 970 lines...]
kafka.admin.TopicCommandTest > testConfigPreservationAcrossPartitionAlteration PASSED

kafka.admin.AdminTest > testReplicaAssignment PASSED

kafka.admin.AdminTest > testManualReplicaAssignment PASSED

kafka.admin.AdminTest > testTopicCreationInZK PASSED

kafka.admin.AdminTest > testPartitionReassignmentWithLeaderInNewReplicas PASSED

kafka.admin.AdminTest > testPartitionReassignmentWithLeaderNotInNewReplicas PASSED

kafka.admin.AdminTest > testPartitionReassignmentNonOverlappingReplicas PASSED

kafka.admin.AdminTest > testReassigningNonExistingPartition PASSED

kafka.admin.AdminTest > testResumePartitionReassignmentThatWasCompleted PASSED

kafka.admin.AdminTest > testPreferredReplicaJsonData PASSED

kafka.admin.AdminTest > testBasicPreferredReplicaElection PASSED

kafka.admin.AdminTest > testShutdownBroker PASSED

kafka.admin.AdminTest > testTopicConfigChange PASSED

kafka.admin.AddPartitionsTest > testTopicDoesNotExist PASSED

kafka.admin.AddPartitionsTest > testWrongReplicaCount PASSED

kafka.admin.AddPartitionsTest > testIncrementPartitions PASSED

kafka.admin.AddPartitionsTest > testManualAssignmentOfReplicas PASSED

kafka.admin.AddPartitionsTest > testReplicaPlacement PASSED

kafka.admin.DeleteTopicTest > testDeleteTopicWithAllAliveReplicas PASSED

kafka.admin.DeleteTopicTest > testResumeDeleteTopicWithRecoveredFollower PASSED

kafka.admin.DeleteTopicTest > testResumeDeleteTopicOnControllerFailover PASSED

kafka.admin.DeleteTopicTest > testPartitionReassignmentDuringDeleteTopic PASSED

kafka.admin.DeleteTopicTest > testDeleteTopicDuringAddPartition PASSED

kafka.admin.DeleteTopicTest > testAddPartitionDuringDeleteTopic PASSED

kafka.admin.DeleteTopicTest > testRecreateTopicAfterDeletion PASSED

kafka.admin.DeleteTopicTest > testDeleteNonExistingTopic PASSED

kafka.api.RequestResponseSerializationTest > testSerializationAndDeserialization PASSED

kafka.api.ApiUtilsTest > testShortStringNonASCII PASSED

kafka.api.ApiUtilsTest > testShortStringASCII PASSED

kafka.api.test.ProducerSendTest > testSendOffset PASSED

kafka.api.test.ProducerSendTest > testClose PASSED

kafka.api.test.ProducerSendTest > testSendToPartition PASSED

kafka.api.test.ProducerSendTest > testAutoCreateTopic PASSED

kafka.api.test.ProducerFailureHandlingTest > testNotEnoughReplicas PASSED

kafka.api.test.ProducerFailureHandlingTest > testInvalidPartition PASSED

kafka.api.test.ProducerFailureHandlingTest > testTooLargeRecordWithAckZero PASSED

kafka.api.test.ProducerFailureHandlingTest > testTooLargeRecordWithAckOne PASSED

kafka.api.test.ProducerFailureHandlingTest > testNonExistentTopic PASSED

kafka.api.test.ProducerFailureHandlingTest > testWrongBrokerList PASSED

kafka.api.test.ProducerFailureHandlingTest > testNoResponse PASSED

kafka.api.test.ProducerFailureHandlingTest > testSendAfterClosed PASSED

kafka.api.test.ProducerFailureHandlingTest > testBrokerFailure PASSED

kafka.api.test.ProducerFailureHandlingTest > testCannotSendToInternalTopic PASSED

kafka.api.test.ProducerFailureHandlingTest > testNotEnoughReplicasAfterBrokerShutdown PASSED

kafka.api.test.ProducerCompressionTest > testCompression[0] PASSED

kafka.api.test.ProducerCompressionTest > testCompression[1] PASSED

kafka.api.test.ProducerCompressionTest > testCompression[2] PASSED

kafka.api.test.ProducerCompressionTest > testCompression[3] PASSED

kafka.javaapi.consumer.ZookeeperConsumerConnectorTest > testBasic PASSED

kafka.javaapi.message.ByteBufferMessageSetTest > testWrittenEqualsRead PASSED

kafka.javaapi.message.ByteBufferMessageSetTest > testIteratorIsConsistent PASSED

kafka.javaapi.message.ByteBufferMessageSetTest > testSizeInBytes PASSED

kafka.javaapi.message.ByteBufferMessageSetTest > testIteratorIsConsistentWithCompression
PASSED

kafka.javaapi.message.ByteBufferMessageSetTest > testSizeInBytesWithCompression PASSED

kafka.javaapi.message.ByteBufferMessageSetTest > testEquals PASSED

kafka.javaapi.message.ByteBufferMessageSetTest > testEqualsWithCompression PASSED

kafka.integration.UncleanLeaderElectionTest > testUncleanLeaderElectionEnabled PASSED

kafka.integration.UncleanLeaderElectionTest > testUncleanLeaderElectionDisabled PASSED

kafka.integration.UncleanLeaderElectionTest > testUncleanLeaderElectionEnabledByTopicOverride
PASSED

kafka.integration.UncleanLeaderElectionTest > testCleanLeaderElectionDisabledByTopicOverride
PASSED

kafka.integration.UncleanLeaderElectionTest > testUncleanLeaderElectionInvalidTopicOverride
PASSED

kafka.integration.FetcherTest > testFetcher PASSED

kafka.integration.RollingBounceTest > testRollingBounce PASSED

kafka.integration.PrimitiveApiTest > testFetchRequestCanProperlySerialize PASSED

kafka.integration.PrimitiveApiTest > testEmptyFetchRequest PASSED

kafka.integration.PrimitiveApiTest > testDefaultEncoderProducerAndFetch PASSED

kafka.integration.PrimitiveApiTest > testDefaultEncoderProducerAndFetchWithCompression
PASSED

kafka.integration.PrimitiveApiTest > testProduceAndMultiFetch PASSED

kafka.integration.PrimitiveApiTest > testMultiProduce PASSED

kafka.integration.PrimitiveApiTest > testConsumerEmptyTopic PASSED

kafka.integration.PrimitiveApiTest > testPipelinedProduceRequests PASSED

kafka.integration.AutoOffsetResetTest > testResetToEarliestWhenOffsetTooHigh PASSED

kafka.integration.AutoOffsetResetTest > testResetToEarliestWhenOffsetTooLow PASSED

kafka.integration.AutoOffsetResetTest > testResetToLatestWhenOffsetTooHigh PASSED

kafka.integration.AutoOffsetResetTest > testResetToLatestWhenOffsetTooLow PASSED

kafka.integration.TopicMetadataTest > testAutoCreateTopic PASSED

kafka.integration.TopicMetadataTest > testTopicMetadataRequest PASSED

kafka.integration.TopicMetadataTest > testBasicTopicMetadata PASSED

kafka.integration.TopicMetadataTest > testGetAllTopicMetadata PASSED

kafka.metrics.KafkaTimerTest > testKafkaTimer PASSED

kafka.utils.UtilsTest > testSwallow PASSED

kafka.utils.UtilsTest > testCircularIterator PASSED

kafka.utils.UtilsTest > testReadBytes PASSED

kafka.utils.UtilsTest > testAbs PASSED

kafka.utils.UtilsTest > testReplaceSuffix PASSED

kafka.utils.UtilsTest > testReadInt PASSED

kafka.utils.UtilsTest > testCsvList PASSED

kafka.utils.UtilsTest > testInLock PASSED

kafka.utils.SchedulerTest > testMockSchedulerNonPeriodicTask PASSED

kafka.utils.SchedulerTest > testMockSchedulerPeriodicTask PASSED

kafka.utils.SchedulerTest > testReentrantTaskInMockScheduler PASSED

kafka.utils.SchedulerTest > testNonPeriodicTask PASSED

kafka.utils.SchedulerTest > testPeriodicTask PASSED

kafka.utils.IteratorTemplateTest > testIterator PASSED

kafka.utils.ReplicationUtilsTest > testUpdateLeaderAndIsr PASSED

kafka.utils.JsonTest > testJsonEncoding PASSED

kafka.message.MessageCompressionTest > testSimpleCompressDecompress PASSED

kafka.message.MessageTest > testFieldValues PASSED

kafka.message.MessageTest > testChecksum PASSED

kafka.message.MessageTest > testEquality PASSED

kafka.message.MessageTest > testIsHashable PASSED

kafka.message.ByteBufferMessageSetTest > testWrittenEqualsRead PASSED

kafka.message.ByteBufferMessageSetTest > testIteratorIsConsistent PASSED

kafka.message.ByteBufferMessageSetTest > testSizeInBytes PASSED

kafka.message.ByteBufferMessageSetTest > testWriteTo PASSED

kafka.message.ByteBufferMessageSetTest > testEquals PASSED

kafka.message.ByteBufferMessageSetTest > testIterator PASSED

kafka.message.ByteBufferMessageSetTest > testValidBytes PASSED

kafka.message.ByteBufferMessageSetTest > testValidBytesWithCompression PASSED

kafka.message.ByteBufferMessageSetTest > testOffsetAssignment PASSED

kafka.network.SocketServerTest > simpleRequest PASSED

kafka.network.SocketServerTest > tooBigRequestIsRejected PASSED

kafka.network.SocketServerTest > testNullResponse PASSED

kafka.network.SocketServerTest > testSocketsCloseOnShutdown PASSED

kafka.network.SocketServerTest > testMaxConnectionsPerIp PASSED

kafka.zk.ZKEphemeralTest > testEphemeralNodeCleanup PASSED

293 tests completed, 2 failed
:core:test FAILED

FAILURE: Build failed with an exception.

* What went wrong:
Execution failed for task ':core:test'.
> There were failing tests. See the report at: file:///x1/jenkins/jenkins-slave/workspace/Kafka-trunk/core/build/reports/tests/index.html

* Try:
Run with --stacktrace option to get the stack trace. Run with --info or --debug option to
get more log output.

BUILD FAILED

Total time: 7 mins 41.125 secs
Build step 'Execute shell' marked build as failure
Setting GRADLE_2_1_HOME=/home/jenkins/jenkins-slave/tools/hudson.plugins.gradle.GradleInstallation/Gradle_2.1

Mime
View raw message