kafka-dev mailing list archives

Site index · List index
Message view « Date » · « Thread »
Top « Date » · « Thread »
From "Joe Stein (JIRA)" <j...@apache.org>
Subject [jira] [Updated] (KAFKA-1662) gradle release issue permgen space
Date Wed, 01 Oct 2014 16:20:34 GMT

     [ https://issues.apache.org/jira/browse/KAFKA-1662?page=com.atlassian.jira.plugin.system.issuetabpanels:all-tabpanel
]

Joe Stein updated KAFKA-1662:
-----------------------------
    Description: 
Finding issues doing the kafka release with permgen space

./gradlew releaseTarGzAll

ant:scaladoc] java.lang.OutOfMemoryError: PermGen space
:kafka-0.8.2-ALPHA1-src:core:scaladoc FAILED
:releaseTarGz_2_10_1 FAILED

FAILURE: Build failed with an exception.

* What went wrong:
Execution failed for task ':core:scaladoc'.
> PermGen space

* Try:
Run with --stacktrace option to get the stack trace. Run with --info or --debug option to
get more log output.

BUILD FAILED

Total time: 5 mins 55.53 secs

FAILURE: Build failed with an exception.

* What went wrong:
PermGen space



  was:
Finding issues doing the kafka release with permgen space

ant:scaladoc] java.lang.OutOfMemoryError: PermGen space
:kafka-0.8.2-ALPHA1-src:core:scaladoc FAILED
:releaseTarGz_2_10_1 FAILED

FAILURE: Build failed with an exception.

* What went wrong:
Execution failed for task ':core:scaladoc'.
> PermGen space

* Try:
Run with --stacktrace option to get the stack trace. Run with --info or --debug option to
get more log output.

BUILD FAILED

Total time: 5 mins 55.53 secs

FAILURE: Build failed with an exception.

* What went wrong:
PermGen space




> gradle release issue permgen space
> ----------------------------------
>
>                 Key: KAFKA-1662
>                 URL: https://issues.apache.org/jira/browse/KAFKA-1662
>             Project: Kafka
>          Issue Type: Bug
>            Reporter: Joe Stein
>            Priority: Blocker
>              Labels: newbie
>             Fix For: 0.8.2
>
>
> Finding issues doing the kafka release with permgen space
> ./gradlew releaseTarGzAll
> ant:scaladoc] java.lang.OutOfMemoryError: PermGen space
> :kafka-0.8.2-ALPHA1-src:core:scaladoc FAILED
> :releaseTarGz_2_10_1 FAILED
> FAILURE: Build failed with an exception.
> * What went wrong:
> Execution failed for task ':core:scaladoc'.
> > PermGen space
> * Try:
> Run with --stacktrace option to get the stack trace. Run with --info or --debug option
to get more log output.
> BUILD FAILED
> Total time: 5 mins 55.53 secs
> FAILURE: Build failed with an exception.
> * What went wrong:
> PermGen space



--
This message was sent by Atlassian JIRA
(v6.3.4#6332)

Mime
View raw message