jmeter-dev mailing list archives

Site index · List index
Message view « Date » · « Thread »
Top « Date » · « Thread »
From Apache Jenkins Server <jenk...@builds.apache.org>
Subject Build failed in Jenkins: JMeter Ubuntu #1048
Date Sun, 09 Aug 2020 11:14:43 GMT
See <https://builds.apache.org/job/JMeter%20Ubuntu/1048/display/redirect?page=changes>

Changes:

[felix.schumacher] Use format message placeholder instead of string concatenation, to make


------------------------------------------
[...truncated 182.04 KB...]
    user.country=US
    user.variant=
    Locale=en_US
    java.class.version=52.0
    java.awt.headless=true
    os.name=Linux
    os.version=4.15.0-58-generic
    os.arch=amd64
          0.5sec,   57 completed,   0 failed,   0 skipped, org.apache.jmeter.curl.BasicCurlParserTest
          0.4sec,    1 completed,   0 failed,   0 skipped, org.apache.jmeter.resources.ResourceKeyUsageTestHttp
          0.0sec,    5 completed,   0 failed,   0 skipped, org.apache.jmeter.protocol.http.util.TestHTTPFileArgs
          0.0sec,    6 completed,   0 failed,   0 skipped, org.apache.jmeter.protocol.http.util.accesslog.TestLogFilter
          0.1sec,    3 completed,   0 failed,   0 skipped, org.apache.jmeter.protocol.http.util.accesslog.TestSessionFilter
          0.0sec,    4 completed,   0 failed,   0 skipped, org.apache.jmeter.protocol.http.util.accesslog.TestTCLogParser
          0.0sec,    3 completed,   0 failed,   0 skipped, org.apache.jmeter.protocol.http.util.TestHTTPFileArg
          0.0sec,    3 completed,   0 failed,   0 skipped, org.apache.jmeter.protocol.http.util.TestHTTPArgument
FAILURE   1.2sec, org.apache.jmeter.protocol.http.control.TestCacheManagerUrlConnection
> testCacheHttpClientBug51932()
    org.opentest4j.AssertionFailedError: Should not find valid entry ==> expected: <false>
but was: <true>
        at org.junit.jupiter.api.AssertionUtils.fail(AssertionUtils.java:55)
        at org.junit.jupiter.api.AssertFalse.assertFalse(AssertFalse.java:40)
        at org.junit.jupiter.api.Assertions.assertFalse(Assertions.java:218)
        at org.apache.jmeter.protocol.http.control.TestCacheManagerBase.testCacheHttpClientBug51932(TestCacheManagerBase.java:365)
        at org.junit.platform.commons.util.ReflectionUtils.invokeMethod(ReflectionUtils.java:686)
        at org.junit.jupiter.engine.execution.MethodInvocation.proceed(MethodInvocation.java:60)
        at org.junit.jupiter.engine.execution.InvocationInterceptorChain$ValidatingInvocation.proceed(InvocationInterceptorChain.java:131)
        at org.junit.jupiter.engine.extension.TimeoutInvocation.proceed(TimeoutInvocation.java:46)
        at org.junit.jupiter.engine.extension.TimeoutExtension.intercept(TimeoutExtension.java:149)
        at org.junit.jupiter.engine.extension.TimeoutExtension.interceptTestableMethod(TimeoutExtension.java:140)
        at org.junit.jupiter.engine.extension.TimeoutExtension.interceptTestMethod(TimeoutExtension.java:84)
        at org.junit.jupiter.engine.execution.ExecutableInvoker$ReflectiveInterceptorCall.lambda$ofVoidMethod$0(ExecutableInvoker.java:115)
        at org.junit.jupiter.engine.execution.ExecutableInvoker.lambda$invoke$0(ExecutableInvoker.java:105)
        at org.junit.jupiter.engine.execution.InvocationInterceptorChain$InterceptedInvocation.proceed(InvocationInterceptorChain.java:106)
        at org.junit.jupiter.engine.execution.InvocationInterceptorChain.proceed(InvocationInterceptorChain.java:64)
        at org.junit.jupiter.engine.execution.InvocationInterceptorChain.chainAndInvoke(InvocationInterceptorChain.java:45)
        at org.junit.jupiter.engine.execution.InvocationInterceptorChain.invoke(InvocationInterceptorChain.java:37)
        at org.junit.jupiter.engine.execution.ExecutableInvoker.invoke(ExecutableInvoker.java:104)
        at org.junit.jupiter.engine.execution.ExecutableInvoker.invoke(ExecutableInvoker.java:98)
        at org.junit.jupiter.engine.descriptor.TestMethodTestDescriptor.lambda$invokeTestMethod$6(TestMethodTestDescriptor.java:205)
        at org.junit.platform.engine.support.hierarchical.ThrowableCollector.execute(ThrowableCollector.java:73)
        at org.junit.jupiter.engine.descriptor.TestMethodTestDescriptor.invokeTestMethod(TestMethodTestDescriptor.java:201)
        at org.junit.jupiter.engine.descriptor.TestMethodTestDescriptor.execute(TestMethodTestDescriptor.java:137)
        at org.junit.jupiter.engine.descriptor.TestMethodTestDescriptor.execute(TestMethodTestDescriptor.java:71)
        at org.junit.platform.engine.support.hierarchical.NodeTestTask.lambda$executeRecursively$5(NodeTestTask.java:135)
        at org.junit.platform.engine.support.hierarchical.ThrowableCollector.execute(ThrowableCollector.java:73)
        at org.junit.platform.engine.support.hierarchical.NodeTestTask.lambda$executeRecursively$7(NodeTestTask.java:125)
        at org.junit.platform.engine.support.hierarchical.Node.around(Node.java:135)
        at org.junit.platform.engine.support.hierarchical.NodeTestTask.lambda$executeRecursively$8(NodeTestTask.java:123)
        at org.junit.platform.engine.support.hierarchical.ThrowableCollector.execute(ThrowableCollector.java:73)
        at org.junit.platform.engine.support.hierarchical.NodeTestTask.executeRecursively(NodeTestTask.java:122)
        at org.junit.platform.engine.support.hierarchical.NodeTestTask.execute(NodeTestTask.java:80)

          0.3sec,    7 completed,   0 failed,   0 skipped, org.apache.jmeter.protocol.http.proxy.TestProxyControl
          0.0sec,    2 completed,   0 failed,   0 skipped, org.apache.jmeter.protocol.http.parser.TestBaseParser
          4.4sec,    2 completed,   0 failed,   0 skipped, org.apache.jmeter.protocol.http.sampler.TestHTTPHC4Impl
          0.1sec,    6 completed,   0 failed,   0 skipped, org.apache.jmeter.protocol.http.parser.TestHtmlParsingUtils
          4.6sec,   10 completed,   0 failed,   0 skipped, org.apache.jmeter.protocol.http.proxy.TestHttpRequestHdr

> Task :src:dist-check:batchBug56243
Creating summariser <summary>
Created the tree successfully using <https://builds.apache.org/job/JMeter%20Ubuntu/ws/bin/testfiles/Bug56243.jmx>
Starting standalone test @ Sun Aug 09 11:14:23 UTC 2020 (1596971663475)
Waiting for possible Shutdown/StopTestNow/HeapDump/ThreadDump message on port 4445
summary =      9 in 00:00:00 =   38.0/s Avg:     1 Min:     0 Max:     9 Err:     0 (0.00%)
Tidying up ...    @ Sun Aug 09 11:14:24 UTC 2020 (1596971664430)
... end of run
No errors present in the logfile <https://builds.apache.org/job/JMeter%20Ubuntu/ws/bin/Bug56243.log>
(the file is empty)

> Task :src:functions:test
    JMeterVersion=5.3.1-SNAPSHOT af3958b
    java.version=1.8.0_252
    java.vm.name=OpenJDK 64-Bit Server VM
    java.vendor=Oracle Corporation
    java.home=/usr/local/asfpackages/java/openjdk-8u252-b09/jre
    file.encoding=ISO-8859-1
    default encoding=ISO-8859-1
    user.home=/home/jenkins
    user.dir=<https://builds.apache.org/job/JMeter%20Ubuntu/ws/src/functions>
    user.language=en
    user.region=null
    user.country=US
    user.variant=
    Locale=en_US
    java.class.version=52.0
    java.awt.headless=true
    os.name=Linux
    os.version=4.15.0-58-generic
    os.arch=amd64
          0.2sec,    1 completed,   0 failed,   0 skipped, org.apache.jmeter.resources.ResourceKeyUsageTestFunctions
          0.5sec,    5 completed,   0 failed,   0 skipped, org.apache.jmeter.functions.TestMachineIPName
          0.3sec,   12 completed,   0 failed,   0 skipped, org.apache.jmeter.functions.TestTimeShiftFunction
          0.5sec,    5 completed,   0 failed,   0 skipped, org.apache.jmeter.functions.TestJavascriptFunction
          0.1sec,    5 completed,   0 failed,   0 skipped, org.apache.jmeter.functions.StringFromFileFunctionTest
          0.0sec,   15 completed,   0 failed,   0 skipped, org.apache.jmeter.functions.TestTimeFunction
          0.4sec,    5 completed,   0 failed,   0 skipped, org.apache.jmeter.functions.TestJavascriptFunctionWithRhino
          0.2sec,    6 completed,   0 failed,   0 skipped, org.apache.jmeter.functions.TestJexl3Function
          0.0sec,    8 completed,   0 failed,   0 skipped, org.apache.jmeter.functions.TestDateTimeConvertFunction
          0.0sec,    2 completed,   0 failed,   0 skipped, org.apache.jmeter.functions.RandomFunctionTest
          0.1sec,   15 completed,   0 failed,   0 skipped, org.apache.jmeter.functions.TestStringtoFile
          0.0sec,    7 completed,   0 failed,   0 skipped, org.apache.jmeter.functions.TestFileRowColContainer
          0.0sec,    3 completed,   0 failed,   0 skipped, org.apache.jmeter.functions.TestUrlEncodeDecode
          0.0sec,    2 completed,   0 failed,   0 skipped, org.apache.jmeter.functions.EvalFunctionTest
          0.0sec,   22 completed,   0 failed,   0 skipped, org.apache.jmeter.functions.TestRegexFunction
          0.0sec,    1 completed,   0 failed,   0 skipped, org.apache.jmeter.functions.VariableTest
          0.0sec,    2 completed,   0 failed,   0 skipped, org.apache.jmeter.functions.TestSamplerNameFunction
          0.0sec,    1 completed,   0 failed,   0 skipped, org.apache.jmeter.functions.SplitFunctionTest
          0.0sec,    9 completed,   0 failed,   0 skipped, org.apache.jmeter.functions.TestDigestFunction
          0.0sec,    4 completed,   0 failed,   0 skipped, org.apache.jmeter.functions.TestRandomFromMultipleVars
          0.0sec,    6 completed,   0 failed,   0 skipped, org.apache.jmeter.functions.TestEscapeOroRegexpChars
          1.3sec,    7 completed,   0 failed,   0 skipped, org.apache.jmeter.functions.TestGroovyFunction
          0.0sec,    5 completed,   0 failed,   0 skipped, org.apache.jmeter.functions.TestFileToString
          0.0sec,    6 completed,   0 failed,   0 skipped, org.apache.jmeter.functions.CSVReadFunctionTest
          0.1sec,    6 completed,   0 failed,   0 skipped, org.apache.jmeter.functions.TestJexl2Function
          0.0sec,    6 completed,   0 failed,   0 skipped, org.apache.jmeter.functions.TestIsVarDefined
          0.0sec,   18 completed,   0 failed,   0 skipped, org.apache.jmeter.functions.TestSimpleFunctions
          0.0sec,    8 completed,   0 failed,   0 skipped, org.apache.jmeter.functions.TestChangeCase
          0.0sec,    5 completed,   0 failed,   0 skipped, org.apache.jmeter.functions.TestIsPropDefined
          0.0sec,    1 completed,   0 failed,   0 skipped, org.apache.jmeter.functions.SumFunctionTest
          0.0sec,   14 completed,   0 failed,   0 skipped, org.apache.jmeter.functions.TestTimeRandomDateFunction
          0.0sec,    3 completed,   0 failed,   0 skipped, org.apache.jmeter.functions.TestSetProperty
WARNING   0.5sec,    6 completed,   0 failed,   5 skipped, org.apache.jmeter.functions.XPathConcurrencyTest
          0.2sec,   10 completed,   0 failed,   0 skipped, org.apache.jmeter.functions.PackageTest
          0.1sec,   22 completed,   0 failed,   0 skipped, org.apache.jmeter.functions.ChangeCaseSpec
WARNING   0.0sec,    0 completed,   0 failed,   0 skipped, org.apache.jmeter.functions.gui.FunctionHelperSpec
          0.2sec,    2 completed,   0 failed,   0 skipped, org.apache.jmeter.functions.IterationCounterSpec
WARNING   8.3sec,  255 completed,   0 failed,   5 skipped, Gradle
Test Run :src:functions:test

> Task :src:functions:check

> Task :src:protocol:http:test
          0.3sec,    4 completed,   0 failed,   0 skipped, org.apache.jmeter.protocol.http.parser.TestCssParser
          0.4sec,   18 completed,   0 failed,   0 skipped, org.apache.jmeter.protocol.http.modifier.TestAnchorModifier
          0.0sec,   17 completed,   0 failed,   0 skipped, org.apache.jmeter.protocol.http.modifier.TestURLRewritingModifier
          0.0sec,    7 completed,   0 failed,   0 skipped, org.apache.jmeter.protocol.http.visualizers.RequestViewHTTPTest
          2.2sec, org.apache.jmeter.protocol.http.control.TestCacheManagerHC4
> testExpires()
          2.1sec, org.apache.jmeter.protocol.http.control.TestCacheManagerHC4
> testExpiresBug59962()
          2.1sec, org.apache.jmeter.protocol.http.control.TestCacheManagerHC4
> testPrivateCacheExpireNoMaxAge()
          2.1sec, org.apache.jmeter.protocol.http.control.TestCacheManagerUrlConnection
> testExpiresBug59962()
          2.3sec, org.apache.jmeter.protocol.http.control.TestCacheManagerUrlConnection
> testExpires()
          0.7sec,    1 completed,   0 failed,   0 skipped, org.apache.jmeter.protocol.http.sampler.TestSerializedHTTPSampler
          0.0sec,    8 completed,   0 failed,   0 skipped, org.apache.jmeter.protocol.http.sampler.PostWriterTest
          0.0sec,   18 completed,   0 failed,   0 skipped, org.apache.jmeter.protocol.http.sampler.TestHTTPSamplers
          3.1sec, org.apache.jmeter.protocol.http.control.TestCacheManagerHC4
> testNoCacheControlNoMaxAgeNoExpire()
          2.1sec, org.apache.jmeter.protocol.http.control.TestCacheManagerUrlConnection
> testPrivateCacheExpireNoMaxAge()
          3.0sec, org.apache.jmeter.protocol.http.control.TestCacheManagerHC4
> testPrivateCacheNoMaxAgeNoExpire()
          4.2sec,   25 completed,   0 failed,   0 skipped, org.apache.jmeter.protocol.http.control.TestCacheManagerHC4
          3.2sec, org.apache.jmeter.protocol.http.control.TestCacheManagerUrlConnection
> testPrivateCacheNoMaxAgeNoExpire()
          3.3sec, org.apache.jmeter.protocol.http.control.TestCacheManagerUrlConnection
> testNoCacheControlNoMaxAgeNoExpire()
FAILURE   4.5sec,   24 completed,   1 failed,   0 skipped, org.apache.jmeter.protocol.http.control.TestCacheManagerUrlConnection

> Task :src:dist-check:batchBug56811
Creating summariser <summary>
Created the tree successfully using <https://builds.apache.org/job/JMeter%20Ubuntu/ws/bin/testfiles/Bug56811.jmx>
Starting standalone test @ Sun Aug 09 11:14:26 UTC 2020 (1596971666623)
Waiting for possible Shutdown/StopTestNow/HeapDump/ThreadDump message on port 4445
summary =      9 in 00:00:00 =   20.5/s Avg:     4 Min:     0 Max:     7 Err:     3 (33.33%)
Tidying up ...    @ Sun Aug 09 11:14:27 UTC 2020 (1596971667642)
... end of run
No errors present in the logfile <https://builds.apache.org/job/JMeter%20Ubuntu/ws/bin/Bug56811.log>
(the file is empty)

> Task :src:protocol:http:test
          2.0sec,   16 completed,   0 failed,   0 skipped, org.apache.jmeter.protocol.http.sampler.ParallelResourcesAndIpSource
          0.0sec,    2 completed,   0 failed,   0 skipped, org.apache.jmeter.protocol.http.sampler.PutWriterTest
          0.1sec,    1 completed,   0 failed,   0 skipped, org.apache.jmeter.protocol.http.sampler.PackageTest
          0.0sec,    2 completed,   0 failed,   0 skipped, org.apache.jmeter.protocol.http.sampler.TestHttpWebdav
          0.2sec,    8 completed,   0 failed,   0 skipped, org.apache.jmeter.protocol.http.sampler.TestDecompression
          0.0sec,    3 completed,   0 failed,   0 skipped, org.apache.jmeter.protocol.http.config.MultipartUrlConfigTest
          0.0sec,    2 completed,   0 failed,   0 skipped, org.apache.jmeter.protocol.http.config.UrlConfigTest
          0.0sec,    1 completed,   0 failed,   0 skipped, org.apache.jmeter.protocol.http.control.TestAuthorization
          0.1sec,    4 completed,   0 failed,   0 skipped, org.apache.jmeter.protocol.http.control.TestCookieManagerThreadIteration

> Task :src:dist-check:batchBug62239
Creating summariser <summary>
Created the tree successfully using <https://builds.apache.org/job/JMeter%20Ubuntu/ws/bin/testfiles/Bug62239.jmx>
Starting standalone test @ Sun Aug 09 11:14:29 UTC 2020 (1596971669948)
Waiting for possible Shutdown/StopTestNow/HeapDump/ThreadDump message on port 4445
summary +      1 in 00:00:00 =    6.2/s Avg:     1 Min:     1 Max:     1 Err:     0 (0.00%)
Active: 1 Started: 1 Finished: 0
summary +    107 in 00:00:00 =  488.6/s Avg:     0 Min:     0 Max:     1 Err:     0 (0.00%)
Active: 0 Started: 6 Finished: 6
summary =    108 in 00:00:00 =  283.5/s Avg:     0 Min:     0 Max:     1 Err:     0 (0.00%)
Tidying up ...    @ Sun Aug 09 11:14:30 UTC 2020 (1596971670504)
... end of run
No errors present in the logfile <https://builds.apache.org/job/JMeter%20Ubuntu/ws/bin/Bug62239.log>
(the file is empty)

> Task :src:dist-check:batchFTP_TESTS
Creating summariser <summary>
Created the tree successfully using <https://builds.apache.org/job/JMeter%20Ubuntu/ws/bin/testfiles/FTP_TESTS.jmx>
Starting standalone test @ Sun Aug 09 11:14:32 UTC 2020 (1596971672523)
Waiting for possible Shutdown/StopTestNow/HeapDump/ThreadDump message on port 4445
summary +      1 in 00:00:02 =    0.7/s Avg:  1509 Min:  1509 Max:  1509 Err:     0 (0.00%)
Active: 1 Started: 1 Finished: 0
summary +      5 in 00:00:01 =    3.5/s Avg:    44 Min:    10 Max:    72 Err:     0 (0.00%)
Active: 0 Started: 1 Finished: 1
summary =      6 in 00:00:03 =    2.0/s Avg:   288 Min:    10 Max:  1509 Err:     0 (0.00%)
Tidying up ...    @ Sun Aug 09 11:14:36 UTC 2020 (1596971676290)
... end of run
No errors present in the logfile <https://builds.apache.org/job/JMeter%20Ubuntu/ws/bin/FTP_TESTS.log>
(the file is empty)

> Task :src:protocol:http:test
          6.1sec, org.apache.jmeter.protocol.http.control.DnsManagerTest
> badDnsInCustomResolverShouldFailHttpSampler(String, WireMockServer)[1], [1]
HttpClient4
WARNING   6.1sec,    2 completed,   0 failed,   1 skipped, org.apache.jmeter.protocol.http.control.DnsManagerTest
          0.1sec,   33 completed,   0 failed,   0 skipped, org.apache.jmeter.protocol.http.control.TestHC4CookieManager
          0.0sec,    2 completed,   0 failed,   0 skipped, org.apache.jmeter.protocol.http.control.TestAuthManagerThreadIteration
          0.1sec,    5 completed,   0 failed,   0 skipped, org.apache.jmeter.protocol.http.control.TestCacheManagerThreadIteration
          0.0sec,    1 completed,   0 failed,   0 skipped, org.apache.jmeter.protocol.http.control.gui.TestHttpTestSampleGui
          0.0sec,    6 completed,   0 failed,   0 skipped, org.apache.jmeter.protocol.http.control.TestAuthManager
          0.1sec,   21 completed,   0 failed,   0 skipped, org.apache.jmeter.gui.action.ParseCurlCommandActionTest
          0.0sec,    2 completed,   0 failed,   0 skipped, org.apache.jmeter.testelement.TestHeaderManager
          0.4sec,  103 completed,   0 failed,   0 skipped, org.apache.jmeter.protocol.http.parser.TestHTMLParser
          0.0sec,   46 completed,   0 failed,   0 skipped, org.apache.jmeter.protocol.http.parser.TestBug60842HtmlParser
          0.0sec,    7 completed,   0 failed,   0 skipped, org.apache.jmeter.protocol.http.visualizers.RequestViewHTTPTest
          0.3sec,   53 completed,   0 failed,   0 skipped, org.apache.jmeter.protocol.http.sampler.TestHTTPSamplersAgainstHttpMirrorServer
WARNING   0.0sec,    2 completed,   0 failed,   2 skipped, org.apache.jmeter.protocol.http.sampler.SamplingNamingTest
          0.9sec,    9 completed,   0 failed,   0 skipped, org.apache.jmeter.protocol.http.control.TestHTTPMirrorThread
          0.3sec,   58 completed,   0 failed,   0 skipped, org.apache.jmeter.protocol.http.util.HTTPUtilsSpec
FAILURE  18.0sec,  620 completed,   1 failed,   3 skipped,
Gradle Test Run :src:protocol:http:test

620 tests completed, 1 failed, 3 skipped

> Task :src:protocol:http:test FAILED

> Task :src:dist-check:batchHTMLParserTestFile_2
Creating summariser <summary>
Created the tree successfully using <https://builds.apache.org/job/JMeter%20Ubuntu/ws/bin/testfiles/HTMLParserTestFile_2.jmx>
Starting standalone test @ Sun Aug 09 11:14:38 UTC 2020 (1596971678138)
Waiting for possible Shutdown/StopTestNow/HeapDump/ThreadDump message on port 4445
summary =      1 in 00:00:00 =    4.1/s Avg:   142 Min:   142 Max:   142 Err:     0 (0.00%)
Tidying up ...    @ Sun Aug 09 11:14:38 UTC 2020 (1596971678922)
... end of run
No errors present in the logfile <https://builds.apache.org/job/JMeter%20Ubuntu/ws/bin/HTMLParserTestFile_2.log>
(the file is empty)
checksum-dependency elapsed time: 10161ms, configurations processed: 270 (add -PchecksumTimingsPrint
to print detailed timings)

FAILURE: Build failed with an exception.

* What went wrong:
Execution failed for task ':src:protocol:http:test'.
> There were failing tests. See the report at: file:///home/jenkins/jenkins-slave/workspace/JMeter%20Ubuntu/src/protocol/http/build/reports/tests/test/index.html

* Try:
Run with --stacktrace option to get the stack trace. Run with --info or --debug option to
get more log output. Run with --scan to get full insights.

* Get more help at https://help.gradle.org

Deprecated Gradle features were used in this build, making it incompatible with Gradle 7.0.
Use '--warning-mode all' to show the individual deprecation warnings.
See https://docs.gradle.org/6.3/userguide/command_line_interface.html#sec:command_line_warnings

BUILD FAILED in 1m 17s
244 actionable tasks: 141 executed, 103 up-to-date
Build step 'Invoke Gradle script' changed build result to FAILURE
Build step 'Invoke Gradle script' marked build as failure
[locks-and-latches] Releasing all the locks
[locks-and-latches] All the locks released

Mime
View raw message