jmeter-dev mailing list archives

Site index · List index
Message view « Date » · « Thread »
Top « Date » · « Thread »
From Apache Jenkins Server <jenk...@builds.apache.org>
Subject Build failed in Jenkins: JMeter » JMeter analysis #1
Date Sun, 09 Aug 2020 11:15:00 GMT
See <https://ci-builds.apache.org/job/JMeter/job/JMeter%20analysis/1/display/redirect>

Changes:


------------------------------------------
[...truncated 177.36 KB...]
    sun.awt.AWTAutoShutdown#run at line:310
    java.lang.Thread#run at line:834

          0.9sec,   11 completed,   0 failed,   0 skipped, org.apache.jmeter.util.XPathUtilTest

JSR223TestElementTest > testGetScriptEngineJS() STANDARD_ERROR
    Warning: Nashorn engine is planned to be removed from a future JDK release
          0.3sec,    2 completed,   0 failed,   0 skipped, org.apache.jmeter.util.JSR223TestElementTest
          0.0sec,    7 completed,   0 failed,   0 skipped, org.apache.jmeter.samplers.TestSampleSaveConfiguration

> Task :src:jorphan:test
          4.6sec, org.apache.jorphan.exec.TestKeyToolUtils > testIPBasedCert()
         21.8sec,    3 completed,   0 failed,   0 skipped, org.apache.jorphan.exec.TestKeyToolUtils
          0.0sec,    4 completed,   0 failed,   0 skipped, org.apache.jorphan.reflect.TestClassTools
          0.1sec,   50 completed,   0 failed,   0 skipped, org.apache.jorphan.util.TestJorphanUtils
          0.0sec,    8 completed,   0 failed,   0 skipped, org.apache.jorphan.util.TestConverter
          0.0sec,    5 completed,   0 failed,   0 skipped, org.apache.jorphan.collections.PackageTest
          0.0sec,   37 completed,   0 failed,   0 skipped, org.apache.commons.cli.avalon.ClutilTestCase
          0.4sec,    5 completed,   0 failed,   0 skipped, org.apache.jorphan.gui.MinMaxLongRendererTest
          0.7sec,   58 completed,   0 failed,   0 skipped, org.apache.jorphan.util.ConverterSpec
          0.1sec,   16 completed,   0 failed,   0 skipped, org.apache.jorphan.io.TextFileSpec
WARNING  26.2sec,  228 completed,   0 failed,   2 skipped, Gradle
Test Run :src:jorphan:test

> Task :src:jorphan:check
> Task :src:jorphan:assemble

> Task :src:components:test

Gradle Test Executor 17 STANDARD_OUT
    Setting JMeterHome: <https://ci-builds.apache.org/job/JMeter/job/JMeter%20analysis/ws/src/components/../../.>
    Initializing Properties: ../.././bin/jmeter.properties
    JMeterVersion=5.3.1-SNAPSHOT af3958b
    java.version=11.0.6
    java.vm.name=Java HotSpot(TM) 64-Bit Server VM
    java.vendor=Oracle Corporation
    java.home=/usr/local/asfpackages/java/jdk-11.0.6
    file.encoding=ISO-8859-1
    default encoding=ISO-8859-1
    user.home=/home/jenkins
    user.dir=<https://ci-builds.apache.org/job/JMeter/job/JMeter%20analysis/ws/src/components>
    user.language=en
    user.region=null
    user.country=US
    user.variant=
    Locale=en_US
    java.class.version=55.0
    java.awt.headless=null
    os.name=Linux
    os.version=4.15.0-76-generic
    os.arch=amd64
          0.1sec,    3 completed,   0 failed,   0 skipped, org.apache.jmeter.visualizers.backend.SamplerMetricFixedModeTest
          1.8sec,    4 completed,   0 failed,   0 skipped, org.apache.jmeter.visualizers.backend.influxdb.HttpMetricsSenderTest
          0.0sec,    2 completed,   0 failed,   0 skipped, org.apache.jmeter.visualizers.backend.SamplerMetricTimedModeTest
          0.0sec,    2 completed,   0 failed,   0 skipped, org.apache.jmeter.visualizers.TestSamplingStatCalculator
          0.1sec,    8 completed,   0 failed,   0 skipped, org.apache.jmeter.visualizers.TestRenderAsJson
          0.6sec,    7 completed,   0 failed,   0 skipped, org.apache.jmeter.gui.action.template.TestTemplateManager
          0.0sec,    1 completed,   0 failed,   0 skipped, org.apache.jmeter.gui.action.TestSave
          0.2sec,    1 completed,   0 failed,   0 skipped, org.apache.jmeter.resources.ResourceKeyUsageTestComponents
          0.9sec,    7 completed,   0 failed,   0 skipped, org.apache.jmeter.assertions.gui.TestJSONPathAssertionGui
          0.0sec,    4 completed,   0 failed,   0 skipped, org.apache.jmeter.assertions.DurationAssertionTest
          0.0sec,    6 completed,   0 failed,   0 skipped, org.apache.jmeter.assertions.SizeAssertionTest
          0.1sec,   25 completed,   0 failed,   0 skipped, org.apache.jmeter.assertions.TestJSONPathAssertion
          0.6sec,   14 completed,   0 failed,   0 skipped, org.apache.jmeter.assertions.XPath2AssertionTest
          0.1sec,   10 completed,   0 failed,   0 skipped, org.apache.jmeter.assertions.ResponseAssertionTest
          0.2sec,    9 completed,   0 failed,   0 skipped, org.apache.jmeter.assertions.XMLSchemaAssertionTest
          0.2sec,   29 completed,   0 failed,   0 skipped, org.apache.jmeter.assertions.XPathAssertionTest
          0.0sec,    4 completed,   0 failed,   0 skipped, org.apache.jmeter.assertions.XmlAssertionTest
          0.1sec,    7 completed,   0 failed,   0 skipped, org.apache.jmeter.assertions.jmespath.gui.JMESPathAssertionGuiTest
          0.6sec,    6 completed,   0 failed,   0 skipped, org.apache.jmeter.assertions.SMIMEAssertionTest
          0.0sec,    5 completed,   0 failed,   0 skipped, org.apache.jmeter.reporters.TestResultSaver
          0.0sec,    9 completed,   0 failed,   0 skipped, org.apache.jmeter.extractor.TestJSONPostProcessor
          0.0sec,   25 completed,   0 failed,   0 skipped, org.apache.jmeter.extractor.TestRegexExtractor
          0.1sec,   14 completed,   0 failed,   0 skipped, org.apache.jmeter.extractor.TestHtmlExtractorJSoup
          0.1sec,    6 completed,   0 failed,   0 skipped, org.apache.jmeter.extractor.TestXPathExtractor
          0.1sec,    7 completed,   0 failed,   0 skipped, org.apache.jmeter.extractor.TestXPath2Extractor
          0.0sec,    4 completed,   0 failed,   0 skipped, org.apache.jmeter.extractor.TestBoundaryExtractor
          0.1sec,   14 completed,   0 failed,   0 skipped, org.apache.jmeter.extractor.TestHtmlExtractorJodd
          0.0sec,   12 completed,   0 failed,   0 skipped, org.apache.jmeter.control.TestWhileController
          0.0sec,    4 completed,   0 failed,   0 skipped, org.apache.jmeter.control.TestLoopController
          0.0sec,    1 completed,   0 failed,   0 skipped, org.apache.jmeter.control.TestGenericController
          0.0sec,    1 completed,   0 failed,   0 skipped, org.apache.jmeter.control.TestTransactionController

TestIfController > shouldIgnoreEmptyLastLine() STANDARD_ERROR
    Warning: Nashorn engine is planned to be removed from a future JDK release

TestIfController > testProcessingTrue() STANDARD_ERROR
    Warning: Nashorn engine is planned to be removed from a future JDK release
WARNING   0.6sec,    8 completed,   0 failed,   1 skipped, org.apache.jmeter.control.TestIfController
          0.0sec,    6 completed,   0 failed,   0 skipped, org.apache.jmeter.control.TestInterleaveControl
          0.0sec,    4 completed,   0 failed,   0 skipped, org.apache.jmeter.control.TestOnceOnlyController
          0.0sec,    3 completed,   0 failed,   0 skipped, org.apache.jmeter.control.TestRandomController
          0.0sec,    1 completed,   0 failed,   0 skipped, org.apache.jmeter.config.gui.TestArgumentsPanel
          0.0sec,    3 completed,   0 failed,   0 skipped, org.apache.jmeter.config.TestRandomVariableConfig
          0.0sec,    6 completed,   0 failed,   0 skipped, org.apache.jmeter.config.TestCVSDataSet
          0.0sec,    4 completed,   0 failed,   0 skipped, org.apache.jmeter.timers.TimerServiceTest

> Task :src:core:test
          3.9sec,   18 completed,   0 failed,   0 skipped, org.apache.jmeter.samplers.TestSampleResult
          0.1sec,    6 completed,   0 failed,   0 skipped, org.apache.jmeter.report.processor.graph.impl.CustomGraphConsumerTest
          0.0sec,    2 completed,   0 failed,   0 skipped, org.apache.jmeter.report.processor.ErrorsSummaryConsumerTest
          0.0sec,    7 completed,   0 failed,   0 skipped, org.apache.jmeter.report.dashboard.ApdexPerTransactionTest
          0.0sec,    6 completed,   0 failed,   0 skipped, org.apache.jmeter.report.core.CsvSampleReaderTest
          0.0sec,    5 completed,   0 failed,   0 skipped, org.apache.jmeter.report.core.TestCsvSampleWriter
          0.0sec,    1 completed,   0 failed,   0 skipped, org.apache.jmeter.report.core.SampleMetadataTest
          0.0sec,    5 completed,   0 failed,   0 skipped, org.apache.jmeter.listeners.TestResultAction
          0.0sec,    4 completed,   0 failed,   0 skipped, org.apache.jorphan.TestXMLBuffer
          0.0sec,    6 completed,   0 failed,   0 skipped, org.apache.jorphan.reflect.TestFunctor

PackageTest > checkI18n fr: messages STANDARD_OUT
    Ignoring missing junit_success_default_code=1000 in org/apache/jmeter/resources/messages_fr.properties
    Ignoring missing junit_failure_default_code=0001 in org/apache/jmeter/resources/messages_fr.properties
    Ignoring missing aggregate_report_90=90% in org/apache/jmeter/resources/messages_fr.properties
    Ignoring missing junit_error_default_code=9999 in org/apache/jmeter/resources/messages_fr.properties
          0.1sec,   12 completed,   0 failed,   0 skipped, org.apache.jmeter.resources.PackageTest
          0.0sec,    4 completed,   0 failed,   0 skipped, org.apache.jmeter.samplers.TestDataStrippingSampleSender
          0.8sec,    1 completed,   0 failed,   0 skipped, org.apache.jmeter.gui.HtmlReportGUISpec
          0.1sec,    4 completed,   0 failed,   0 skipped, org.apache.jmeter.engine.util.FunctionParserSpec
          0.0sec,    3 completed,   0 failed,   0 skipped, org.apache.jmeter.util.keystore.JmeterKeyStoreSpec
          0.1sec,   23 completed,   0 failed,   0 skipped, org.apache.jmeter.services.FileServerSpec
          0.2sec,    4 completed,   0 failed,   0 skipped, org.apache.jmeter.report.processor.Top5ErrorsBySamplerConsumerSpec
          0.0sec,    5 completed,   0 failed,   0 skipped, org.apache.jmeter.report.processor.Top5ErrorsSummaryDataSpec
          0.0sec,    4 completed,   0 failed,   0 skipped, org.apache.jmeter.report.processor.ListResultDataSpec
          0.0sec,    1 completed,   0 failed,   0 skipped, org.apache.jmeter.report.processor.ApdexSummaryConsumerSpec
          0.1sec,    2 completed,   0 failed,   0 skipped, org.apache.jmeter.report.processor.graph.impl.ResponseTimePercentilesOverTimeGraphConsumerSpec
          0.0sec,    3 completed,   0 failed,   0 skipped, org.apache.jmeter.report.processor.FieldSampleComparatorSpec
          0.0sec,    6 completed,   0 failed,   0 skipped, org.apache.jmeter.report.core.SampleMetadataParserSpec
          0.0sec,   14 completed,   0 failed,   0 skipped, org.apache.jmeter.report.core.ConvertersSpec
         12.9sec,  264 completed,   0 failed,   0 skipped, Gradle Test Run :src:core:test

> Task :src:core:check
> Task :src:core:assemble

> Task :src:components:test
          1.2sec,    9 completed,   0 failed,   0 skipped, org.apache.jmeter.timers.ConstantThroughputTimerTest
          0.3sec,    6 completed,   0 failed,   0 skipped, org.apache.jmeter.timers.poissonarrivals.PreciseThroughputTimerTest
          0.6sec,    4 completed,   0 failed,   0 skipped, org.apache.jmeter.timers.SyncTimerTest
          0.0sec,    9 completed,   0 failed,   0 skipped, org.apache.jmeter.visualizers.TestSampleCompareTo
          0.2sec,   27 completed,   0 failed,   0 skipped, org.apache.jmeter.assertions.jmespath.TestJMESPathAssertion$TestAssertion
          0.2sec,   27 completed,   0 failed,   0 skipped, org.apache.jmeter.assertions.jmespath.TestJMESPathAssertion
          0.0sec,   10 completed,   0 failed,   0 skipped, org.apache.jmeter.extractor.json.jmespath.TestJMESPathExtractor$SourceVarOrResponse
          0.0sec,   10 completed,   0 failed,   0 skipped, org.apache.jmeter.extractor.json.jmespath.TestJMESPathExtractor$MatchNumberMoreThanZeroOn1ExtractedValue
          0.0sec,    6 completed,   0 failed,   0 skipped, org.apache.jmeter.extractor.json.jmespath.TestJMESPathExtractor$MultipleMatchesOnAllExtractedValues
          0.0sec,    6 completed,   0 failed,   0 skipped, org.apache.jmeter.extractor.json.jmespath.TestJMESPathExtractor$OneMatchOnAllExtractedValues
          0.0sec,   32 completed,   0 failed,   0 skipped, org.apache.jmeter.extractor.json.jmespath.TestJMESPathExtractor
WARNING: An illegal reflective access operation has occurred
WARNING: Illegal reflective access by net.sf.cglib.core.ReflectUtils$1 (file:/home/jenkins/.gradle/caches/modules-2/files-2.1/cglib/cglib-nodep/3.2.12/1139632dd55792b8ae5505b93191281c9e1d3f43/cglib-nodep-3.2.12.jar)
to method java.lang.ClassLoader.defineClass(java.lang.String,byte[],int,int,java.security.ProtectionDomain)
WARNING: Please consider reporting this to the maintainers of net.sf.cglib.core.ReflectUtils$1
WARNING: Use --illegal-access=warn to enable warnings of further illegal reflective access
operations
WARNING: All illegal access operations will be denied in a future release
          0.3sec,    7 completed,   0 failed,   0 skipped, org.apache.jmeter.visualizers.backend.graphite.PickleGraphiteMetricsSenderSpec
          0.0sec,    5 completed,   0 failed,   0 skipped, org.apache.jmeter.visualizers.backend.graphite.TextGraphiteMetricsSenderSpec
          0.1sec,    3 completed,   0 failed,   0 skipped, org.apache.jmeter.visualizers.backend.influxdb.InfluxdbBackendListenerClientSpec
          0.2sec,    5 completed,   0 failed,   0 skipped, org.apache.jmeter.assertions.gui.AssertionGuiSpec
          0.0sec,    7 completed,   0 failed,   0 skipped, org.apache.jmeter.assertions.MD5HexAssertionSpec
          0.1sec,    7 completed,   0 failed,   0 skipped, org.apache.jmeter.assertions.CompareAssertionSpec
          0.0sec,    4 completed,   0 failed,   0 skipped, org.apache.jmeter.extractor.JoddExtractorSpec
          0.1sec,   43 completed,   0 failed,   0 skipped, org.apache.jmeter.extractor.BoundaryExtractorSpec
          0.2sec,   11 completed,   0 failed,   0 skipped, org.apache.jmeter.extractor.json.render.RenderAsJsonRendererSpec
          0.1sec,   11 completed,   0 failed,   0 skipped, org.apache.jmeter.extractor.json.render.RenderAsJmesPathRendererSpec
WARNING   0.0sec,    5 completed,   0 failed,   1 skipped, org.apache.jmeter.control.RunTimeSpec
          0.0sec,    8 completed,   0 failed,   0 skipped, org.apache.jmeter.control.ThroughputControllerSpec
          0.0sec,    4 completed,   0 failed,   0 skipped, org.apache.jmeter.control.RandomOrderControllerSpec
          0.0sec,    6 completed,   0 failed,   0 skipped, org.apache.jmeter.timers.UniformRandomTimerSpec
WARNING  14.4sec,  499 completed,   0 failed,   2 skipped, Gradle
Test Run :src:components:test

> Task :src:components:check
> Task :src:components:jar
> Task :src:examples:spotbugsMain SKIPPED
> Task :src:generator:spotbugsMain SKIPPED
> Task :src:generator:spotbugsTest SKIPPED
> Task :src:examples:spotbugsTest SKIPPED
> Task :src:generator:test NO-SOURCE
> Task :src:generator:check
> Task :src:examples:test NO-SOURCE
> Task :src:examples:check
> Task :src:components:testJar
> Task :src:components:assemble

> Task :src:functions:compileJava
Note: <https://ci-builds.apache.org/job/JMeter/job/JMeter%20analysis/ws/src/functions/src/main/java/org/apache/jmeter/functions/StringFromFile.java>
uses or overrides a deprecated API.
Note: Recompile with -Xlint:deprecation for details.

> Task :src:functions:compileGroovy NO-SOURCE
> Task :src:functions:classes
> Task :src:functions:jar
> Task :src:functions:compileTestJava

> Task :src:protocol:http:compileJava
Note: Some input files use or override a deprecated API.
Note: Recompile with -Xlint:deprecation for details.
Note: <https://ci-builds.apache.org/job/JMeter/job/JMeter%20analysis/ws/src/protocol/http/src/main/java/org/apache/jmeter/protocol/http/sampler/HTTPHC4Impl.java>
uses unchecked or unsafe operations.
Note: Recompile with -Xlint:unchecked for details.

> Task :src:protocol:http:compileGroovy NO-SOURCE
> Task :src:protocol:http:classes
> Task :src:dist:compileJava NO-SOURCE
> Task :src:dist:classes UP-TO-DATE
> Task :src:dist:checkstyleMain NO-SOURCE
> Task :src:dist:jar
> Task :src:protocol:http:jar
> Task :src:dist-check:compileJava NO-SOURCE
> Task :src:dist-check:compileGroovy NO-SOURCE
> Task :src:dist-check:classes UP-TO-DATE
> Task :src:dist-check:checkstyleMain NO-SOURCE
> Task :src:dist-check:spotbugsMain SKIPPED
> Task :src:dist-check:jar
> Task :src:dist-check:assemble
> Task :src:functions:compileTestGroovy
> Task :src:functions:testClasses
> Task :src:functions:testJar

> Task :src:dist:javadocAggregate FAILED
javadoc: error - cannot read Input length = 1

> Task :src:functions:checkstyleMain

> Task :src:licenses:gatherBinaryLicenses
License overrides were declared but unused for the following dependencies: [com.thoughtworks.xstream:xstream:1.4.11,
net.sf.saxon:Saxon-HE:9.9.1-5, org.exparity:hamcrest-date:2.0.4]

> Task :src:protocol:http:compileTestJava
Note: Some input files use or override a deprecated API.
Note: Recompile with -Xlint:deprecation for details.
checksum-dependency elapsed time: 29917ms, configurations processed: 256
    SHA-512 computation time: 52ms (goes in parallel, it might exceed wall-clock time), files
processed: 19, processed: 5MiB, skipped: 2857MiB
    PGP signature resolution time: 282ms (wall-clock), resolution requests: 152, signatures
resolved: 249
    PGP key resolution time: 28160ms (wall-clock), resolution requests: 152, download time:
51162ms (goes in parallel, it might exceed wall-clock time), keys downloaded: 98
        PGP signature verification time: 12469ms (goes in parallel, it might exceed wall-clock
time), files processed: 569, processed: 578MiB, skipped: 2261MiB

FAILURE: Build failed with an exception.

* What went wrong:
Execution failed for task ':src:dist:javadocAggregate'.
> Javadoc generation failed. Generated Javadoc options file (useful for troubleshooting):
'<https://ci-builds.apache.org/job/JMeter/job/JMeter%20analysis/ws/src/dist/build/tmp/javadocAggregate/javadoc.options'>

* Try:
Run with --stacktrace option to get the stack trace. Run with --info or --debug option to
get more log output. Run with --scan to get full insights.

* Get more help at https://help.gradle.org

Deprecated Gradle features were used in this build, making it incompatible with Gradle 7.0.
Use '--warning-mode all' to show the individual deprecation warnings.
See https://docs.gradle.org/6.3/userguide/command_line_interface.html#sec:command_line_warnings

BUILD FAILED in 1m 35s
269 actionable tasks: 239 executed, 30 up-to-date
Build step 'Invoke Gradle script' changed build result to FAILURE
Build step 'Invoke Gradle script' marked build as failure
Xvfb stopping
Recording test results

Mime
View raw message