htrace-dev mailing list archives

Site index · List index
Message view « Date » · « Thread »
Top « Date » · « Thread »
From Apache Jenkins Server <jenk...@builds.apache.org>
Subject Build failed in Jenkins: HTrace-Master #281
Date Wed, 11 Apr 2018 20:35:01 GMT
See <https://builds.apache.org/job/HTrace-Master/281/display/redirect?page=changes>

Changes:

[nisala12] initial span receiver for kudu poc commit

[nisala12] refactored and added unit test cases

[nisala12] removing hardcoded file system location

[nisala12] adding colin review changes to span receiver

[nisala12] removing commented code

[nisala12] adding review changes according to Colin

[nisala12] adding rest endpoints for span viewer web app

[nisala12] adding colin review fixes on storing all parents

------------------------------------------
[...truncated 55.35 KB...]
--2018-04-11 20:33:20--  http://download.oracle.com/otn-pub/java/jdk/8u161-b12/2f38c3b165be4555a1fa6e98c45e0808/jdk-8u161-linux-x64.tar.gz
Resolving download.oracle.com (download.oracle.com)... 23.49.12.77
Connecting to download.oracle.com (download.oracle.com)|23.49.12.77|:80... connected.
HTTP request sent, awaiting response... 302 Moved Temporarily
Location: https://edelivery.oracle.com/otn-pub/java/jdk/8u161-b12/2f38c3b165be4555a1fa6e98c45e0808/jdk-8u161-linux-x64.tar.gz
[following]
--2018-04-11 20:33:20--  https://edelivery.oracle.com/otn-pub/java/jdk/8u161-b12/2f38c3b165be4555a1fa6e98c45e0808/jdk-8u161-linux-x64.tar.gz
Resolving edelivery.oracle.com (edelivery.oracle.com)... 23.39.16.136, 2600:1409:12:383::2d3e,
2600:1409:12:3a1::2d3e
Connecting to edelivery.oracle.com (edelivery.oracle.com)|23.39.16.136|:443... connected.
HTTP request sent, awaiting response... 302 Moved Temporarily
Location: http://download.oracle.com/otn-pub/java/jdk/8u161-b12/2f38c3b165be4555a1fa6e98c45e0808/jdk-8u161-linux-x64.tar.gz?AuthParam=1523478920_7e5870d99e56b337dcf9f53e230b7b89
[following]
--2018-04-11 20:33:20--  http://download.oracle.com/otn-pub/java/jdk/8u161-b12/2f38c3b165be4555a1fa6e98c45e0808/jdk-8u161-linux-x64.tar.gz?AuthParam=1523478920_7e5870d99e56b337dcf9f53e230b7b89
Connecting to download.oracle.com (download.oracle.com)|23.49.12.77|:80... connected.
HTTP request sent, awaiting response... 200 OK
Length: 189756259 (181M) [application/x-gzip]
Saving to: 'jdk-8u161-linux-x64.tar.gz'

     0K ........ ........
........ ........
........ ........
 1% 21.2M 8s
  3072K ........ ........
........ ........
........ ........
 3% 62.0M 6s
  6144K ........ ........
........ ........
........ ........
 4% 20.6M 6s
  9216K ........ ........
........ ........
........ ........
 6% 63.6M 5s
 12288K ........ ........
........ ........
........ ........
 8%  111M 5s
 15360K ........ ........
........ ........
........ ........
 9% 72.6M 4s
 18432K ........ ........
........ ........
........ ........
11% 23.5M 4s
 21504K ........ ........
........ ........
........ ........
13% 23.7M 5s
 24576K ........ ........
........ ........ ........
........ 14% 23.0M 5s
 27648K ........ ........
........ ........
........ ........
16%  110M 4s
 30720K ........ ........
........ ........
........ ........
18%  103M 4s
 33792K ........ ........
........ ........
........ ........
19% 25.0M 4s
 36864K ........ ........
........ ........
........ ........
21%  111M 4s
 39936K ........ ........
........ ........
........ ........
23% 25.1M 4s
 43008K ........ ........
........ ........
........ ........
24% 13.5M 4s
 46080K ........ ........
........ ........
........ ........
26%  106M 4s
 49152K ........ ........
........ ........
........ ........
28% 82.0M 4s
 52224K ........ ........
........ ........
........ ........
29% 65.9M 4s
 55296K ........ ........
........ ........
........ ........
31%  111M 3s
 58368K ........ ........
........ ........
........ ........
33% 22.9M 3s
 61440K ........ ........
........ ........
........ ........
34% 96.6M 3s
 64512K ........ ........
........ ........
........ ........
36% 97.9M 3s
 67584K ........ ........
........ ........
........ ........
38% 12.5M 3s
 70656K ........ ........
........ ........
........ ........
39% 24.4M 3s
 73728K ........ ........
........ ........
........ ........
41% 21.3M 3s
 76800K ........ ........
........ ........
........ ........
43% 65.3M 3s
 79872K ........ ........
........ ........
........ ........
44% 82.0M 3s
 82944K ........ ........
........ ........
........ ........
46% 23.2M 3s
 86016K ........ ........
........ ........
........ ........
48% 13.9M 3s
 89088K ........ ........
........ ........
........ ........
49% 24.2M 3s
 92160K ........ ........
........ ........
........ ........
51% 20.9M 3s
 95232K ........ ........
........ ........
........ ........
53% 54.8M 3s
 98304K ........ ........
........ ........
........ ........
54% 84.5M 2s
101376K ........ ........
........ ........
........ ........
56% 69.3M 2s
104448K ........ ........
........ ........
........ ........
58% 89.2M 2s
107520K ........ ........
........ ........
........ ........
59%  100M 2s
110592K ........ ........
........ ........
........ ........
61%  108M 2s
113664K ........ ........
........ ........
........ ........
62%  112M 2s
116736K ........ ........
........ ........
........ ........
64% 91.0M 2s
119808K ........ ........
........ ........
........ ........
66% 62.4M 2s
122880K ........ ........
........ ........
........ ........
67%  108M 2s
125952K ........ ........
........ ........
........ ........
69% 59.1M 1s
129024K ........ ........
........ ........
........ ........
71% 22.9M 1s
132096K ........ ........
........ ........
........ ........
72%  104M 1s
135168K ........ ........
........ ........
........ ........
74% 73.3M 1s
138240K ........ ........
........ ........
........ ........
76%  111M 1s
141312K ........ ........
........ ........
........ ........
77% 24.2M 1s
144384K ........ ........
........ ........
........ ........
79%  111M 1s
147456K ........ ........
........ ........
........ ........
81%  111M 1s
150528K ........ ........
........ ........
........ ........
82%  111M 1s
153600K ........ ........
........ ........
........ ........
84%  111M 1s
156672K ........ ........
........ ........
........ ........
86%  112M 1s
159744K ........ ........
........ ........
........ ........
87%  100M 1s
162816K ........ ........
........ ........
........ ........
89%  111M 0s
165888K ........ ........
........ ........
........ ........
91%  104M 0s
168960K ........ ........
........ ........
........ ........
92%  111M 0s
172032K ........ ........
........ ........
........ ........
94%  109M 0s
175104K ........ ........
........ ........
........ ........
96%  106M 0s
178176K ........ ........
........ ........
........ ........
97%  105M 0s
181248K ........ ........
........ ........
........ ........
99%  111M 0s
184320K ........ .......
                                    100%  111M=4.0s

2018-04-11 20:33:25 (44.8 MB/s) - 'jdk-8u161-linux-x64.tar.gz' saved [189756259/189756259]

Download done.
Removing outdated cached downloads...
update-alternatives: error: no alternatives for java
update-alternatives: using /usr/lib/jvm/java-8-oracle/jre/bin/ControlPanel to provide
/usr/bin/ControlPanel (ControlPanel) in auto mode
update-alternatives: using /usr/lib/jvm/java-8-oracle/jre/bin/java to provide /usr/bin/java
(java) in auto mode
update-alternatives: using /usr/lib/jvm/java-8-oracle/jre/bin/javaws to provide /usr/bin/javaws
(javaws) in auto mode
update-alternatives: using /usr/lib/jvm/java-8-oracle/jre/bin/jcontrol to provide
/usr/bin/jcontrol (jcontrol) in auto mode
update-alternatives: using /usr/lib/jvm/java-8-oracle/jre/bin/jjs to provide /usr/bin/jjs
(jjs) in auto mode
update-alternatives: using /usr/lib/jvm/java-8-oracle/jre/bin/keytool to provide
/usr/bin/keytool (keytool) in auto mode
update-alternatives: using /usr/lib/jvm/java-8-oracle/jre/bin/orbd to provide /usr/bin/orbd
(orbd) in auto mode
update-alternatives: using /usr/lib/jvm/java-8-oracle/jre/bin/pack200 to provide
/usr/bin/pack200 (pack200) in auto mode
update-alternatives: using /usr/lib/jvm/java-8-oracle/jre/bin/policytool to provide
/usr/bin/policytool (policytool) in auto mode
update-alternatives: using /usr/lib/jvm/java-8-oracle/jre/bin/rmid to provide /usr/bin/rmid
(rmid) in auto mode
update-alternatives: using /usr/lib/jvm/java-8-oracle/jre/bin/rmiregistry to provide
/usr/bin/rmiregistry (rmiregistry) in auto mode
update-alternatives: using /usr/lib/jvm/java-8-oracle/jre/bin/servertool to provide
/usr/bin/servertool (servertool) in auto mode
update-alternatives: using /usr/lib/jvm/java-8-oracle/jre/bin/tnameserv to provide
/usr/bin/tnameserv (tnameserv) in auto mode
update-alternatives: using /usr/lib/jvm/java-8-oracle/jre/bin/unpack200 to provide
/usr/bin/unpack200 (unpack200) in auto mode
update-alternatives: using /usr/lib/jvm/java-8-oracle/jre/lib/jexec to provide /usr/bin/jexec
(jexec) in auto mode
update-alternatives: using /usr/lib/jvm/java-8-oracle/bin/appletviewer to provide
/usr/bin/appletviewer (appletviewer) in auto mode
update-alternatives: using /usr/lib/jvm/java-8-oracle/bin/extcheck to provide /usr/bin/extcheck
(extcheck) in auto mode
update-alternatives: using /usr/lib/jvm/java-8-oracle/bin/idlj to provide /usr/bin/idlj
(idlj) in auto mode
update-alternatives: using /usr/lib/jvm/java-8-oracle/bin/jar to provide /usr/bin/jar
(jar) in auto mode
update-alternatives: using /usr/lib/jvm/java-8-oracle/bin/jarsigner to provide /usr/bin/jarsigner
(jarsigner) in auto mode
update-alternatives: using /usr/lib/jvm/java-8-oracle/bin/javac to provide /usr/bin/javac
(javac) in auto mode
update-alternatives: using /usr/lib/jvm/java-8-oracle/bin/javadoc to provide /usr/bin/javadoc
(javadoc) in auto mode
update-alternatives: using /usr/lib/jvm/java-8-oracle/bin/javafxpackager to provide
/usr/bin/javafxpackager (javafxpackager) in auto mode
update-alternatives: using /usr/lib/jvm/java-8-oracle/bin/javah to provide /usr/bin/javah
(javah) in auto mode
update-alternatives: using /usr/lib/jvm/java-8-oracle/bin/javap to provide /usr/bin/javap
(javap) in auto mode
update-alternatives: using /usr/lib/jvm/java-8-oracle/bin/javapackager to provide
/usr/bin/javapackager (javapackager) in auto mode
update-alternatives: using /usr/lib/jvm/java-8-oracle/bin/jcmd to provide /usr/bin/jcmd
(jcmd) in auto mode
update-alternatives: using /usr/lib/jvm/java-8-oracle/bin/jconsole to provide /usr/bin/jconsole
(jconsole) in auto mode
update-alternatives: using /usr/lib/jvm/java-8-oracle/bin/jdb to provide /usr/bin/jdb
(jdb) in auto mode
update-alternatives: using /usr/lib/jvm/java-8-oracle/bin/jdeps to provide /usr/bin/jdeps
(jdeps) in auto mode
update-alternatives: using /usr/lib/jvm/java-8-oracle/bin/jhat to provide /usr/bin/jhat
(jhat) in auto mode
update-alternatives: using /usr/lib/jvm/java-8-oracle/bin/jinfo to provide /usr/bin/jinfo
(jinfo) in auto mode
update-alternatives: using /usr/lib/jvm/java-8-oracle/bin/jmap to provide /usr/bin/jmap
(jmap) in auto mode
update-alternatives: using /usr/lib/jvm/java-8-oracle/bin/jmc to provide /usr/bin/jmc
(jmc) in auto mode
update-alternatives: using /usr/lib/jvm/java-8-oracle/bin/jps to provide /usr/bin/jps
(jps) in auto mode
update-alternatives: using /usr/lib/jvm/java-8-oracle/bin/jrunscript to provide /usr/bin/jrunscript
(jrunscript) in auto mode
update-alternatives: using /usr/lib/jvm/java-8-oracle/bin/jsadebugd to provide /usr/bin/jsadebugd
(jsadebugd) in auto mode
update-alternatives: using /usr/lib/jvm/java-8-oracle/bin/jstack to provide /usr/bin/jstack
(jstack) in auto mode
update-alternatives: using /usr/lib/jvm/java-8-oracle/bin/jstat to provide /usr/bin/jstat
(jstat) in auto mode
update-alternatives: using /usr/lib/jvm/java-8-oracle/bin/jstatd to provide /usr/bin/jstatd
(jstatd) in auto mode
update-alternatives: using /usr/lib/jvm/java-8-oracle/bin/jvisualvm to provide /usr/bin/jvisualvm
(jvisualvm) in auto mode
update-alternatives: using /usr/lib/jvm/java-8-oracle/bin/native2ascii to provide
/usr/bin/native2ascii (native2ascii) in auto mode
update-alternatives: using /usr/lib/jvm/java-8-oracle/bin/rmic to provide /usr/bin/rmic
(rmic) in auto mode
update-alternatives: using /usr/lib/jvm/java-8-oracle/bin/schemagen to provide /usr/bin/schemagen
(schemagen) in auto mode
update-alternatives: using /usr/lib/jvm/java-8-oracle/bin/serialver to provide /usr/bin/serialver
(serialver) in auto mode
update-alternatives: using /usr/lib/jvm/java-8-oracle/bin/wsgen to provide /usr/bin/wsgen
(wsgen) in auto mode
update-alternatives: using /usr/lib/jvm/java-8-oracle/bin/wsimport to provide /usr/bin/wsimport
(wsimport) in auto mode
update-alternatives: using /usr/lib/jvm/java-8-oracle/bin/xjc to provide /usr/bin/xjc
(xjc) in auto mode
update-alternatives: using /usr/lib/jvm/java-8-oracle/jre/lib/amd64/libnpjp2.so to
provide /usr/lib/mozilla/plugins/libjavaplugin.so (mozilla-javaplugin.so) in auto mode
Oracle JDK 8 installed

#####Important########
To set Oracle JDK8 as default, install the "oracle-java8-set-default" package.
E.g.: sudo apt install oracle-java8-set-default
On Ubuntu systems, oracle-java8-set-default is most probably installed
automatically with this package.
######################

Selecting previously unselected package oracle-java8-set-default.
(Reading database ... 19358 files and directories currently installed.)
Preparing to unpack .../oracle-java8-set-default_8u161-1~webupd8~0_all.deb ...
Unpacking oracle-java8-set-default (8u161-1~webupd8~0) ...
Selecting previously unselected package gsfonts.
Preparing to unpack .../gsfonts_1%3a8.11+urwcyr1.0.7~pre44-4.2ubuntu1_all.deb ...
Unpacking gsfonts (1:8.11+urwcyr1.0.7~pre44-4.2ubuntu1) ...
Selecting previously unselected package x11-common.
Preparing to unpack .../x11-common_1%3a7.7+1ubuntu8.1_all.deb ...
Unpacking x11-common (1:7.7+1ubuntu8.1) ...
Selecting previously unselected package xfonts-encodings.
Preparing to unpack .../xfonts-encodings_1%3a1.0.4-1ubuntu1_all.deb ...
Unpacking xfonts-encodings (1:1.0.4-1ubuntu1) ...
Selecting previously unselected package xfonts-utils.
Preparing to unpack .../xfonts-utils_1%3a7.7+1_amd64.deb ...
Unpacking xfonts-utils (1:7.7+1) ...
Selecting previously unselected package gsfonts-x11.
Preparing to unpack .../gsfonts-x11_0.22_all.deb ...
Unpacking gsfonts-x11 (0.22) ...
Processing triggers for ureadahead (0.100.0-16) ...
Setting up libfontenc1:amd64 (1:1.1.2-1) ...
Setting up libfreetype6:amd64 (2.5.2-1ubuntu2.8) ...
Setting up libxfont1:amd64 (1:1.4.7-1ubuntu0.4) ...
Setting up oracle-java8-set-default (8u161-1~webupd8~0) ...
Setting up gsfonts (1:8.11+urwcyr1.0.7~pre44-4.2ubuntu1) ...
Setting up x11-common (1:7.7+1ubuntu8.1) ...
invoke-rc.d: policy-rc.d denied execution of start.
Processing triggers for ureadahead (0.100.0-16) ...
Setting up xfonts-encodings (1:1.0.4-1ubuntu1) ...
Setting up xfonts-utils (1:7.7+1) ...
Setting up gsfonts-x11 (0.22) ...
Processing triggers for libc-bin (2.19-0ubuntu6.14) ...
 ---> 1b52fd7ce3fa
Removing intermediate container f61c2cfb9480
Step 9/19 : RUN curl -sSL http://archive.apache.org/dist/maven/maven-3/3.0.4/binaries/apache-maven-3.0.4-bin.tar.gz
| tar -C /usr/share -xz &&     mv /usr/share/apache-maven-3.0.4 /usr/share/maven &&
    ln -s /usr/share/maven/bin/mvn /usr/bin/mvn
 ---> Running in 6cb47bb275dc
 ---> 484bcfb07194
Removing intermediate container 6cb47bb275dc
Step 10/19 : RUN curl -sSL http://archive.apache.org/dist/ant/binaries/apache-ant-1.9.6-bin.tar.gz
| tar -C /usr/share -xz &&     mv /usr/share/apache-ant-1.9.6 /usr/share/ant &&
    ln -s /usr/share/ant/bin/ant /usr/bin/ant
 ---> Running in 20a7a48f7e38
 ---> c67df5f57595
Removing intermediate container 20a7a48f7e38
Step 11/19 : ENV JAVA_HOME /usr/lib/jvm/java-8-oracle
 ---> Running in 6d830edcc056
 ---> 4c6a8901e317
Removing intermediate container 6d830edcc056
Step 12/19 : ENV MAVEN_HOME /usr/share/maven
 ---> Running in 4cbe737dc7f5
 ---> 6fb84726d560
Removing intermediate container 4cbe737dc7f5
Step 13/19 : ENV ANT_HOME /ust/share/ant
 ---> Running in 0d39f5ce90d0
 ---> 1c2bde08d345
Removing intermediate container 0d39f5ce90d0
Step 14/19 : RUN curl -sSL https://storage.googleapis.com/golang/go1.5.1.linux-amd64.tar.gz
| tar -C /usr/lib/ -xz &&     mkdir -p /usr/share/go
 ---> Running in 5c24a70a7840
 ---> b3463caacbd2
Removing intermediate container 5c24a70a7840
Step 15/19 : ENV GOROOT /usr/lib/go
 ---> Running in 522b9bd9b3f8
 ---> 8461fd8cad3d
Removing intermediate container 522b9bd9b3f8
Step 16/19 : ENV GOPATH /usr/share/go
 ---> Running in 20bab20c9627
 ---> 763655a3060f
Removing intermediate container 20bab20c9627
Step 17/19 : ENV PATH ${GOROOT}/bin:${GOPATH}/bin:$PATH
 ---> Running in 1dd44533568b
 ---> d4559af2d468
Removing intermediate container 1dd44533568b
Step 18/19 : RUN apt-get clean &&     rm -rf /var/cache/apt/* &&     rm -rf
/var/lib/apt/lists/* &&     rm -rf /tmp/* &&     rm -rf /var/tmp/*
 ---> Running in e8a51eb5ff3b
 ---> 83b4b1cbd197
Removing intermediate container e8a51eb5ff3b
Step 19/19 : WORKDIR $HOME
 ---> c26f77245e79
Removing intermediate container 8a421070c612
Successfully built c26f77245e79
Successfully tagged htrace:latest
++ pwd
+ docker run -v <https://builds.apache.org/job/HTrace-Master/ws/>:/htrace --entrypoint
/bin/bash htrace -c 'cd /htrace && mvn clean && mvn install site'
[INFO] Scanning for projects...
Downloading: http://repo.maven.apache.org/maven2/org/apache/apache/17/apache-17.pom
4/16 KB   8/16 KB   12/16 KB   16/16 KB   16/16 KB              Downloaded: http://repo.maven.apache.org/maven2/org/apache/apache/17/apache-17.pom
(16 KB at 99.2 KB/sec)
[ERROR] The build could not read 1 project -> [Help 1]
[ERROR]   
[ERROR]   The project org.apache.htrace:htrace-kudu:4.2.0-incubating-SNAPSHOT (/htrace/htrace-kudu/pom.xml)
has 1 error
[ERROR]     Non-resolvable parent POM: Could not find artifact org.apache.htrace:htrace:pom:4.2.0-incubating-SNAPSHOT
and 'parent.relativePath' points at wrong local POM @ line 18, column 11 -> [Help 2]
[ERROR] 
[ERROR] To see the full stack trace of the errors, re-run Maven with the -e switch.
[ERROR] Re-run Maven using the -X switch to enable full debug logging.
[ERROR] 
[ERROR] For more information about the errors and possible solutions, please read the following
articles:
[ERROR] [Help 1] http://cwiki.apache.org/confluence/display/MAVEN/ProjectBuildingException
[ERROR] [Help 2] http://cwiki.apache.org/confluence/display/MAVEN/UnresolvableModelException
Build step 'Execute shell' marked build as failure
[FINDBUGS] Skipping publisher since build result is FAILURE
Performing Post build task...
Match found for :.* : True
Logical operation result is TRUE
Running script  : 
[HTrace-Master] $ /bin/bash -xe /tmp/jenkins8929173713476125403.sh
POST BUILD TASK : SUCCESS
END OF POST BUILD TASK : 0
Archiving artifacts
Recording test results
ERROR: Step ?Publish JUnit test result report? failed: No test report files were found. Configuration
error?
Not sending mail to unregistered user nisala12@gmail.com

Mime
View raw message