htrace-dev mailing list archives

Site index · List index
Message view « Date » · « Thread »
Top « Date » · « Thread »
From Apache Jenkins Server <jenk...@builds.apache.org>
Subject Build failed in Jenkins: HTrace-Master #283
Date Wed, 11 Apr 2018 20:53:04 GMT
See <https://builds.apache.org/job/HTrace-Master/283/display/redirect?page=changes>

Changes:

[lewis.mcgibbney] Fix broken kudu module

------------------------------------------
[...truncated 1.84 MB...]
     [exec] 2018-04-11T20:45:59Z D: Closing iterator for shard /tmp/TestHrpcAdmissionsControl1861785890/db.
     [exec] 2018-04-11T20:45:59Z D: After reaping 0 span(s), no more found in shard /tmp/TestHrpcAdmissionsControl1861785890/db
to reap.
     [exec] 2018-04-11T20:45:59Z T: Shard processor for /tmp/TestHrpcAdmissionsControl2930167321/db
handling heartbeat.
     [exec] 2018-04-11T20:45:59Z D: Closing iterator for shard /tmp/TestHrpcAdmissionsControl2930167321/db.
     [exec] 2018-04-11T20:45:59Z D: After reaping 0 span(s), no more found in shard /tmp/TestHrpcAdmissionsControl2930167321/db
to reap.
     [exec] 2018-04-11T20:46:44Z T: Shard processor for /tmp/TestHrpcAdmissionsControl1861785890/db
handling heartbeat.
     [exec] 2018-04-11T20:46:44Z D: Closing iterator for shard /tmp/TestHrpcAdmissionsControl1861785890/db.
     [exec] 2018-04-11T20:46:44Z T: Shard processor for /tmp/TestHrpcAdmissionsControl2930167321/db
handling heartbeat.
     [exec] 2018-04-11T20:46:44Z D: After reaping 0 span(s), no more found in shard /tmp/TestHrpcAdmissionsControl1861785890/db
to reap.
     [exec] 2018-04-11T20:46:44Z D: Closing iterator for shard /tmp/TestHrpcAdmissionsControl2930167321/db.
     [exec] 2018-04-11T20:46:44Z D: After reaping 0 span(s), no more found in shard /tmp/TestHrpcAdmissionsControl2930167321/db
to reap.
     [exec] 2018-04-11T20:47:29Z D: Not updating previous reaperDate of 1970-01-01T00:00:00Z.
     [exec] 2018-04-11T20:47:29Z T: Shard processor for /tmp/TestHrpcAdmissionsControl2930167321/db
handling heartbeat.
     [exec] 2018-04-11T20:47:29Z D: Closing iterator for shard /tmp/TestHrpcAdmissionsControl2930167321/db.
     [exec] 2018-04-11T20:47:29Z D: After reaping 0 span(s), no more found in shard /tmp/TestHrpcAdmissionsControl2930167321/db
to reap.
     [exec] 2018-04-11T20:47:29Z T: Shard processor for /tmp/TestHrpcAdmissionsControl1861785890/db
handling heartbeat.
     [exec] 2018-04-11T20:47:29Z D: Closing iterator for shard /tmp/TestHrpcAdmissionsControl1861785890/db.
     [exec] 2018-04-11T20:47:29Z D: After reaping 0 span(s), no more found in shard /tmp/TestHrpcAdmissionsControl1861785890/db
to reap.
     [exec] 2018-04-11T20:48:14Z T: Shard processor for /tmp/TestHrpcAdmissionsControl2930167321/db
handling heartbeat.
     [exec] 2018-04-11T20:48:14Z T: Shard processor for /tmp/TestHrpcAdmissionsControl1861785890/db
handling heartbeat.
     [exec] 2018-04-11T20:48:14Z D: Closing iterator for shard /tmp/TestHrpcAdmissionsControl1861785890/db.
     [exec] 2018-04-11T20:48:14Z D: After reaping 0 span(s), no more found in shard /tmp/TestHrpcAdmissionsControl1861785890/db
to reap.
     [exec] 2018-04-11T20:48:14Z D: Closing iterator for shard /tmp/TestHrpcAdmissionsControl2930167321/db.
     [exec] 2018-04-11T20:48:14Z D: After reaping 0 span(s), no more found in shard /tmp/TestHrpcAdmissionsControl2930167321/db
to reap.
     [exec] 2018-04-11T20:48:59Z D: Not updating previous reaperDate of 1970-01-01T00:00:00Z.
     [exec] 2018-04-11T20:48:59Z T: Shard processor for /tmp/TestHrpcAdmissionsControl2930167321/db
handling heartbeat.
     [exec] 2018-04-11T20:48:59Z T: Shard processor for /tmp/TestHrpcAdmissionsControl1861785890/db
handling heartbeat.
     [exec] 2018-04-11T20:48:59Z D: Closing iterator for shard /tmp/TestHrpcAdmissionsControl2930167321/db.
     [exec] 2018-04-11T20:48:59Z D: After reaping 0 span(s), no more found in shard /tmp/TestHrpcAdmissionsControl2930167321/db
to reap.
     [exec] 2018-04-11T20:48:59Z D: Closing iterator for shard /tmp/TestHrpcAdmissionsControl1861785890/db.
     [exec] 2018-04-11T20:48:59Z D: After reaping 0 span(s), no more found in shard /tmp/TestHrpcAdmissionsControl1861785890/db
to reap.
     [exec] 2018-04-11T20:49:44Z T: Shard processor for /tmp/TestHrpcAdmissionsControl2930167321/db
handling heartbeat.
     [exec] 2018-04-11T20:49:44Z T: Shard processor for /tmp/TestHrpcAdmissionsControl1861785890/db
handling heartbeat.
     [exec] 2018-04-11T20:49:44Z D: Closing iterator for shard /tmp/TestHrpcAdmissionsControl2930167321/db.
     [exec] 2018-04-11T20:49:44Z D: After reaping 0 span(s), no more found in shard /tmp/TestHrpcAdmissionsControl2930167321/db
to reap.
     [exec] 2018-04-11T20:49:44Z D: Closing iterator for shard /tmp/TestHrpcAdmissionsControl1861785890/db.
     [exec] 2018-04-11T20:49:44Z D: After reaping 0 span(s), no more found in shard /tmp/TestHrpcAdmissionsControl1861785890/db
to reap.
     [exec] 2018-04-11T20:50:29Z D: Not updating previous reaperDate of 1970-01-01T00:00:00Z.
     [exec] 2018-04-11T20:50:29Z T: Shard processor for /tmp/TestHrpcAdmissionsControl2930167321/db
handling heartbeat.
     [exec] 2018-04-11T20:50:29Z T: Shard processor for /tmp/TestHrpcAdmissionsControl1861785890/db
handling heartbeat.
     [exec] 2018-04-11T20:50:29Z D: Closing iterator for shard /tmp/TestHrpcAdmissionsControl1861785890/db.
     [exec] 2018-04-11T20:50:29Z D: After reaping 0 span(s), no more found in shard /tmp/TestHrpcAdmissionsControl1861785890/db
to reap.
     [exec] 2018-04-11T20:50:29Z D: Closing iterator for shard /tmp/TestHrpcAdmissionsControl2930167321/db.
     [exec] 2018-04-11T20:50:29Z D: After reaping 0 span(s), no more found in shard /tmp/TestHrpcAdmissionsControl2930167321/db
to reap.
     [exec] 2018-04-11T20:51:14Z T: Shard processor for /tmp/TestHrpcAdmissionsControl1861785890/db
handling heartbeat.
     [exec] 2018-04-11T20:51:14Z T: Shard processor for /tmp/TestHrpcAdmissionsControl2930167321/db
handling heartbeat.
     [exec] 2018-04-11T20:51:14Z D: Closing iterator for shard /tmp/TestHrpcAdmissionsControl1861785890/db.
     [exec] 2018-04-11T20:51:14Z D: After reaping 0 span(s), no more found in shard /tmp/TestHrpcAdmissionsControl1861785890/db
to reap.
     [exec] 2018-04-11T20:51:14Z D: Closing iterator for shard /tmp/TestHrpcAdmissionsControl2930167321/db.
     [exec] 2018-04-11T20:51:14Z D: After reaping 0 span(s), no more found in shard /tmp/TestHrpcAdmissionsControl2930167321/db
to reap.
     [exec] 2018-04-11T20:51:59Z D: Not updating previous reaperDate of 1970-01-01T00:00:00Z.
     [exec] 2018-04-11T20:51:59Z T: Shard processor for /tmp/TestHrpcAdmissionsControl2930167321/db
handling heartbeat.
     [exec] 2018-04-11T20:51:59Z D: Closing iterator for shard /tmp/TestHrpcAdmissionsControl2930167321/db.
     [exec] 2018-04-11T20:51:59Z D: After reaping 0 span(s), no more found in shard /tmp/TestHrpcAdmissionsControl2930167321/db
to reap.
     [exec] 2018-04-11T20:51:59Z T: Shard processor for /tmp/TestHrpcAdmissionsControl1861785890/db
handling heartbeat.
     [exec] 2018-04-11T20:51:59Z D: Closing iterator for shard /tmp/TestHrpcAdmissionsControl1861785890/db.
     [exec] 2018-04-11T20:51:59Z D: After reaping 0 span(s), no more found in shard /tmp/TestHrpcAdmissionsControl1861785890/db
to reap.
     [exec] 2018-04-11T20:52:44Z T: Shard processor for /tmp/TestHrpcAdmissionsControl2930167321/db
handling heartbeat.
     [exec] 2018-04-11T20:52:44Z D: Closing iterator for shard /tmp/TestHrpcAdmissionsControl2930167321/db.
     [exec] 2018-04-11T20:52:44Z D: After reaping 0 span(s), no more found in shard /tmp/TestHrpcAdmissionsControl2930167321/db
to reap.
     [exec] 2018-04-11T20:52:44Z T: Shard processor for /tmp/TestHrpcAdmissionsControl1861785890/db
handling heartbeat.
     [exec] 2018-04-11T20:52:44Z D: Closing iterator for shard /tmp/TestHrpcAdmissionsControl1861785890/db.
     [exec] 2018-04-11T20:52:44Z D: After reaping 0 span(s), no more found in shard /tmp/TestHrpcAdmissionsControl1861785890/db
to reap.
     [exec] SIGQUIT: quit
     [exec] PC=0x463931 m=0
     [exec] 
     [exec] goroutine 0 [idle]:
     [exec] runtime.futex(0x103dbb0, 0x0, 0x0, 0x0, 0x0, 0x103cfa0, 0x0, 0x0, 0x411904, 0x103dbb0,
...)
     [exec] 	/usr/local/go/src/runtime/sys_linux_amd64.s:288 +0x21
     [exec] runtime.futexsleep(0x103dbb0, 0x0, 0xffffffffffffffff)
     [exec] 	/usr/local/go/src/runtime/os1_linux.go:39 +0x53
     [exec] runtime.notesleep(0x103dbb0)
     [exec] 	/usr/local/go/src/runtime/lock_futex.go:142 +0xa4
     [exec] runtime.stopm()
     [exec] 	/usr/local/go/src/runtime/proc1.go:1128 +0x112
     [exec] runtime.findrunnable(0xc82001f500, 0x0)
     [exec] 	/usr/local/go/src/runtime/proc1.go:1530 +0x69e
     [exec] runtime.schedule()
     [exec] 	/usr/local/go/src/runtime/proc1.go:1639 +0x267
     [exec] runtime.park_m(0xc820175080)
     [exec] 	/usr/local/go/src/runtime/proc1.go:1698 +0x18b
     [exec] runtime.mcall(0x7fff03b21d50)
     [exec] 	/usr/local/go/src/runtime/asm_amd64.s:204 +0x5b
     [exec] 
     [exec] goroutine 1 [chan receive]:
     [exec] testing.RunTests(0xc43890, 0x1022080, 0x19, 0x19, 0x92f100)
     [exec] 	/usr/local/go/src/testing/testing.go:562 +0x8ad
     [exec] testing.(*M).Run(0xc820119ee8, 0x92f100)
     [exec] 	/usr/local/go/src/testing/testing.go:494 +0x70
     [exec] main.main()
     [exec] 	htrace/htraced/_test/_testmain.go:106 +0x116
     [exec] 
     [exec] goroutine 17 [syscall, locked to thread]:
     [exec] runtime.goexit()
     [exec] 	/usr/local/go/src/runtime/asm_amd64.s:1696 +0x1
     [exec] 
     [exec] goroutine 6 [syscall]:
     [exec] os/signal.loop()
     [exec] 	/usr/local/go/src/os/signal/signal_unix.go:22 +0x18
     [exec] created by os/signal.init.1
     [exec] 	/usr/local/go/src/os/signal/signal_unix.go:28 +0x37
     [exec] 
     [exec] goroutine 59 [semacquire]:
     [exec] sync.runtime_Semacquire(0xc820293d7c)
     [exec] 	/usr/local/go/src/runtime/sema.go:43 +0x26
     [exec] sync.(*WaitGroup).Wait(0xc820293d70)
     [exec] 	/usr/local/go/src/sync/waitgroup.go:126 +0xb4
     [exec] htrace/htraced.TestHrpcAdmissionsControl(0xc8201ebcb0)
     [exec] 	/htrace/htrace-htraced/go/src/htrace/htraced/client_test.go:330 +0xb1c
     [exec] testing.tRunner(0xc8201ebcb0, 0x10220f8)
     [exec] 	/usr/local/go/src/testing/testing.go:456 +0x98
     [exec] created by testing.RunTests
     [exec] 	/usr/local/go/src/testing/testing.go:561 +0x86d
     [exec] 
     [exec] goroutine 62 [chan receive]:
     [exec] htrace/htraced.(*Reaper).run(0xc8202ae230)
     [exec] 	/htrace/htrace-htraced/go/src/htrace/htraced/datastore.go:378 +0x72
     [exec] created by htrace/htraced.NewReaper
     [exec] 	/htrace/htrace-htraced/go/src/htrace/htraced/datastore.go:356 +0x1f6
     [exec] 
     [exec] goroutine 63 [select]:
     [exec] htrace/htraced.(*shard).processIncoming(0xc820297180)
     [exec] 	/htrace/htrace-htraced/go/src/htrace/htraced/datastore.go:120 +0x9fc
     [exec] created by htrace/htraced.CreateDataStore
     [exec] 	/htrace/htrace-htraced/go/src/htrace/htraced/datastore.go:488 +0x7d1
     [exec] 
     [exec] goroutine 60 [select]:
     [exec] htrace/htraced.(*Heartbeater).run(0xc8202ae1e0)
     [exec] 	/htrace/htrace-htraced/go/src/htrace/htraced/heartbeater.go:103 +0x9fb
     [exec] created by htrace/htraced.NewHeartbeater
     [exec] 	/htrace/htrace-htraced/go/src/htrace/htraced/heartbeater.go:69 +0x175
     [exec] 
     [exec] goroutine 61 [select]:
     [exec] htrace/htraced.(*Heartbeater).run(0xc8202ae280)
     [exec] 	/htrace/htrace-htraced/go/src/htrace/htraced/heartbeater.go:103 +0x9fb
     [exec] created by htrace/htraced.NewHeartbeater
     [exec] 	/htrace/htrace-htraced/go/src/htrace/htraced/heartbeater.go:69 +0x175
     [exec] 
     [exec] goroutine 64 [select]:
     [exec] htrace/htraced.(*shard).processIncoming(0xc820297200)
     [exec] 	/htrace/htrace-htraced/go/src/htrace/htraced/datastore.go:120 +0x9fc
     [exec] created by htrace/htraced.CreateDataStore
     [exec] 	/htrace/htrace-htraced/go/src/htrace/htraced/datastore.go:488 +0x7d1
     [exec] 
     [exec] goroutine 65 [IO wait]:
     [exec] net.runtime_pollWait(0x7f0f3575f010, 0x72, 0xc82000a120)
     [exec] 	/usr/local/go/src/runtime/netpoll.go:157 +0x60
     [exec] net.(*pollDesc).Wait(0xc8202a0a70, 0x72, 0x0, 0x0)
     [exec] 	/usr/local/go/src/net/fd_poll_runtime.go:73 +0x3a
     [exec] net.(*pollDesc).WaitRead(0xc8202a0a70, 0x0, 0x0)
     [exec] 	/usr/local/go/src/net/fd_poll_runtime.go:78 +0x36
     [exec] net.(*netFD).accept(0xc8202a0a10, 0x0, 0x7f0f3575f410, 0xc820185b80)
     [exec] 	/usr/local/go/src/net/fd_unix.go:408 +0x27c
     [exec] net.(*TCPListener).AcceptTCP(0xc8201ec4a8, 0x455bc0, 0x0, 0x0)
     [exec] 	/usr/local/go/src/net/tcpsock_posix.go:254 +0x4d
     [exec] net.(*TCPListener).Accept(0xc8201ec4a8, 0x0, 0x0, 0x0, 0x0)
     [exec] 	/usr/local/go/src/net/tcpsock_posix.go:264 +0x3d
     [exec] net/http.(*Server).Serve(0xc820273c00, 0x7f0f3575e090, 0xc8201ec4a8, 0x0, 0x0)
     [exec] 	/usr/local/go/src/net/http/server.go:1887 +0xb3
     [exec] created by htrace/htraced.CreateRestServer
     [exec] 	/htrace/htrace-htraced/go/src/htrace/htraced/rest.go:365 +0x1627
     [exec] 
     [exec] goroutine 66 [IO wait]:
     [exec] net.runtime_pollWait(0x7f0f3575ef50, 0x72, 0xc82000a120)
     [exec] 	/usr/local/go/src/runtime/netpoll.go:157 +0x60
     [exec] net.(*pollDesc).Wait(0xc8202c5aa0, 0x72, 0x0, 0x0)
     [exec] 	/usr/local/go/src/net/fd_poll_runtime.go:73 +0x3a
     [exec] net.(*pollDesc).WaitRead(0xc8202c5aa0, 0x0, 0x0)
     [exec] 	/usr/local/go/src/net/fd_poll_runtime.go:78 +0x36
     [exec] net.(*netFD).accept(0xc8202c5a40, 0x0, 0x7f0f3575f410, 0xc820185ba0)
     [exec] 	/usr/local/go/src/net/fd_unix.go:408 +0x27c
     [exec] net.(*TCPListener).AcceptTCP(0xc8201ec560, 0x2, 0x0, 0x0)
     [exec] 	/usr/local/go/src/net/tcpsock_posix.go:254 +0x4d
     [exec] net.(*TCPListener).Accept(0xc8201ec560, 0x0, 0x0, 0x0, 0x0)
     [exec] 	/usr/local/go/src/net/tcpsock_posix.go:264 +0x3d
     [exec] htrace/htraced.(*HrpcServer).run(0xc8202c87e0)
     [exec] 	/htrace/htrace-htraced/go/src/htrace/htraced/hrpc.go:353 +0x1d8
     [exec] created by htrace/htraced.CreateHrpcServer
     [exec] 	/htrace/htrace-htraced/go/src/htrace/htraced/hrpc.go:336 +0x945
     [exec] 
     [exec] rax    0xca
     [exec] rbx    0x0
     [exec] rcx    0x463933
     [exec] rdx    0x0
     [exec] rdi    0x103dbb0
     [exec] rsi    0x0
     [exec] rbp    0x1
     [exec] rsp    0x7fff03b21ba8
     [exec] r8     0x0
     [exec] r9     0x0
     [exec] r10    0x0
     [exec] r11    0x286
     [exec] r12    0x14
     [exec] r13    0x4
     [exec] r14    0xb
     [exec] r15    0x7e2
     [exec] rip    0x463931
     [exec] rflags 0x286
     [exec] cs     0x33
     [exec] fs     0x0
     [exec] gs     0x0
     [exec] *** Test killed with quit: ran too long (10m0s).
     [exec] FAIL	htrace/htraced	600.007s
     [exec] ok  	htrace/htracedTool	0.010s
     [exec] ?   	htrace/test	[no test files]
[INFO] ------------------------------------------------------------------------
[INFO] Reactor Summary:
[INFO] 
[INFO] Apache HTrace ..................................... SUCCESS [28.375s]
[INFO] htrace-c .......................................... SUCCESS [1.608s]
[INFO] htrace-core4 ...................................... SUCCESS [20.890s]
[INFO] htrace-webapp ..................................... SUCCESS [3.171s]
[INFO] htrace-zipkin ..................................... SUCCESS [30.035s]
[INFO] htrace-hbase ...................................... SUCCESS [57.862s]
[INFO] htrace-flume ...................................... SUCCESS [23.525s]
[INFO] htrace-htraced .................................... FAILURE [12:05.126s]
[INFO] htrace-kudu ....................................... SKIPPED
[INFO] ------------------------------------------------------------------------
[INFO] BUILD FAILURE
[INFO] ------------------------------------------------------------------------
[INFO] Total time: 14:50.859s
[INFO] Finished at: Wed Apr 11 20:52:57 UTC 2018
[INFO] Final Memory: 162M/4559M
[INFO] ------------------------------------------------------------------------
[ERROR] Failed to execute goal org.apache.maven.plugins:maven-antrun-plugin:1.7:run (go_test)
on project htrace-htraced: An Ant BuildException has occured: exec returned: 1
[ERROR] around Ant part ...<exec failonerror="true" dir="/htrace/htrace-htraced/go" executable="bash">...
@ 4:78 in /htrace/htrace-htraced/target/antrun/build-main.xml
[ERROR] -> [Help 1]
[ERROR] 
[ERROR] To see the full stack trace of the errors, re-run Maven with the -e switch.
[ERROR] Re-run Maven using the -X switch to enable full debug logging.
[ERROR] 
[ERROR] For more information about the errors and possible solutions, please read the following
articles:
[ERROR] [Help 1] http://cwiki.apache.org/confluence/display/MAVEN/MojoExecutionException
[ERROR] 
[ERROR] After correcting the problems, you can resume the build with the command
[ERROR]   mvn <goals> -rf :htrace-htraced
Build step 'Execute shell' marked build as failure
[FINDBUGS] Skipping publisher since build result is FAILURE
Performing Post build task...
Match found for :.* : True
Logical operation result is TRUE
Running script  : 
[HTrace-Master] $ /bin/bash -xe /tmp/jenkins4482332298043258982.sh
POST BUILD TASK : SUCCESS
END OF POST BUILD TASK : 0
Archiving artifacts
Recording test results
Not sending mail to unregistered user lewis.mcgibbney@gmail.com
Not sending mail to unregistered user nisala12@gmail.com

Mime
View raw message