db-torque-dev mailing list archives

Site index · List index
Message view « Date » · « Thread »
Top « Date » · « Thread »
From Apache Jenkins Server <jenk...@builds.apache.org>
Subject Build failed in Jenkins: torque4-test-project-derby » Torque Test Project #465
Date Thu, 05 Dec 2019 17:04:51 GMT
See <https://builds.apache.org/job/torque4-test-project-derby/org.apache.torque$torque-test/465/display/redirect?page=changes>

Changes:

[gk] - ignore generated default conf file

[gk] poms
- fix rats check excludes
- fix forkCount warning, copy env files to classpath
Torque-Test
- fix AvalonMapBuildersTest
- fix cache.ccf packages
- use JUnit 5 assertions in DataTest and AvalonMapBuildersTest
- support (basic) testing in IDE without maven: allow test extension to read adapterProfileFallback
without having environment settings
- update and format JUnit 5 extensions


------------------------------------------
[...truncated 18.36 KB...]
    at sun.reflect.DelegatingMethodAccessorImpl.invoke (DelegatingMethodAccessorImpl.java:43)
    at java.lang.reflect.Method.invoke (Method.java:498)
    at org.apache.tools.ant.dispatch.DispatchUtils.execute (DispatchUtils.java:106)
    at org.apache.tools.ant.Task.perform (Task.java:348)
    at org.apache.tools.ant.Target.execute (Target.java:435)
    at org.apache.tools.ant.Target.performTasks (Target.java:456)
    at org.apache.tools.ant.Project.executeSortedTargets (Project.java:1393)
    at org.apache.tools.ant.Project.executeTarget (Project.java:1364)
    at org.apache.maven.plugin.antrun.AntRunMojo.execute (AntRunMojo.java:313)
    at org.apache.maven.plugin.DefaultBuildPluginManager.executeMojo (DefaultBuildPluginManager.java:137)
    at org.apache.maven.lifecycle.internal.MojoExecutor.execute (MojoExecutor.java:210)
    at org.apache.maven.lifecycle.internal.MojoExecutor.execute (MojoExecutor.java:156)
    at org.apache.maven.lifecycle.internal.MojoExecutor.execute (MojoExecutor.java:148)
    at org.apache.maven.lifecycle.internal.LifecycleModuleBuilder.buildProject (LifecycleModuleBuilder.java:117)
    at org.apache.maven.lifecycle.internal.LifecycleModuleBuilder.buildProject (LifecycleModuleBuilder.java:81)
    at org.apache.maven.lifecycle.internal.builder.singlethreaded.SingleThreadedBuilder.build
(SingleThreadedBuilder.java:56)
    at org.apache.maven.lifecycle.internal.LifecycleStarter.execute (LifecycleStarter.java:128)
    at org.apache.maven.DefaultMaven.doExecute (DefaultMaven.java:305)
    at org.apache.maven.DefaultMaven.doExecute (DefaultMaven.java:192)
    at org.apache.maven.DefaultMaven.execute (DefaultMaven.java:105)
    at org.jvnet.hudson.maven3.launcher.Maven35Launcher.main (Maven35Launcher.java:130)
    at sun.reflect.NativeMethodAccessorImpl.invoke0 (Native Method)
    at sun.reflect.NativeMethodAccessorImpl.invoke (NativeMethodAccessorImpl.java:62)
    at sun.reflect.DelegatingMethodAccessorImpl.invoke (DelegatingMethodAccessorImpl.java:43)
    at java.lang.reflect.Method.invoke (Method.java:498)
    at org.codehaus.plexus.classworlds.launcher.Launcher.launchEnhanced (Launcher.java:282)
    at org.codehaus.plexus.classworlds.launcher.Launcher.launch (Launcher.java:225)
    at jenkins.maven3.agent.Maven35Main.launch (Maven35Main.java:178)
    at sun.reflect.NativeMethodAccessorImpl.invoke0 (Native Method)
    at sun.reflect.NativeMethodAccessorImpl.invoke (NativeMethodAccessorImpl.java:62)
    at sun.reflect.DelegatingMethodAccessorImpl.invoke (DelegatingMethodAccessorImpl.java:43)
    at java.lang.reflect.Method.invoke (Method.java:498)
    at hudson.maven.Maven3Builder.call (Maven3Builder.java:139)
    at hudson.maven.Maven3Builder.call (Maven3Builder.java:70)
    at hudson.remoting.UserRequest.perform (UserRequest.java:212)
    at hudson.remoting.UserRequest.perform (UserRequest.java:54)
    at hudson.remoting.Request$2.run (Request.java:369)
    at hudson.remoting.InterceptingExecutorService$1.call (InterceptingExecutorService.java:72)
    at java.util.concurrent.FutureTask.run (FutureTask.java:266)
    at java.util.concurrent.ThreadPoolExecutor.runWorker (ThreadPoolExecutor.java:1149)
    at java.util.concurrent.ThreadPoolExecutor$Worker.run (ThreadPoolExecutor.java:624)
    at java.lang.Thread.run (Thread.java:748)
Caused by: java.sql.SQLNonTransientConnectionException: Database 'torque-test/target/bookstore'
shutdown.
    at org.apache.derby.impl.jdbc.SQLExceptionFactory.getSQLException (Unknown Source)
    at org.apache.derby.impl.jdbc.Util.generateCsSQLException (Unknown Source)
    at org.apache.derby.impl.jdbc.TransactionResourceImpl.wrapInSQLException (Unknown Source)
    at org.apache.derby.impl.jdbc.TransactionResourceImpl.handleException (Unknown Source)
    at org.apache.derby.impl.jdbc.EmbedConnection.handleException (Unknown Source)
    at org.apache.derby.impl.jdbc.EmbedConnection.<init> (Unknown Source)
    at org.apache.derby.jdbc.InternalDriver$1.run (Unknown Source)
    at org.apache.derby.jdbc.InternalDriver$1.run (Unknown Source)
    at java.security.AccessController.doPrivileged (Native Method)
    at org.apache.derby.jdbc.InternalDriver.getNewEmbedConnection (Unknown Source)
    at org.apache.derby.jdbc.InternalDriver.connect (Unknown Source)
    at org.apache.derby.jdbc.InternalDriver.connect (Unknown Source)
    at org.apache.derby.jdbc.EmbeddedDriver.connect (Unknown Source)
    at org.apache.tools.ant.taskdefs.JDBCTask.getConnection (JDBCTask.java:366)
    at org.apache.tools.ant.taskdefs.SQLExec.getConnection (SQLExec.java:961)
    at org.apache.tools.ant.taskdefs.SQLExec.execute (SQLExec.java:628)
    at org.apache.tools.ant.UnknownElement.execute (UnknownElement.java:292)
    at sun.reflect.NativeMethodAccessorImpl.invoke0 (Native Method)
    at sun.reflect.NativeMethodAccessorImpl.invoke (NativeMethodAccessorImpl.java:62)
    at sun.reflect.DelegatingMethodAccessorImpl.invoke (DelegatingMethodAccessorImpl.java:43)
    at java.lang.reflect.Method.invoke (Method.java:498)
    at org.apache.tools.ant.dispatch.DispatchUtils.execute (DispatchUtils.java:106)
    at org.apache.tools.ant.Task.perform (Task.java:348)
    at org.apache.tools.ant.Target.execute (Target.java:435)
    at org.apache.tools.ant.Target.performTasks (Target.java:456)
    at org.apache.tools.ant.Project.executeSortedTargets (Project.java:1393)
    at org.apache.tools.ant.Project.executeTarget (Project.java:1364)
    at org.apache.maven.plugin.antrun.AntRunMojo.execute (AntRunMojo.java:313)
    at org.apache.maven.plugin.DefaultBuildPluginManager.executeMojo (DefaultBuildPluginManager.java:137)
    at org.apache.maven.lifecycle.internal.MojoExecutor.execute (MojoExecutor.java:210)
    at org.apache.maven.lifecycle.internal.MojoExecutor.execute (MojoExecutor.java:156)
    at org.apache.maven.lifecycle.internal.MojoExecutor.execute (MojoExecutor.java:148)
    at org.apache.maven.lifecycle.internal.LifecycleModuleBuilder.buildProject (LifecycleModuleBuilder.java:117)
    at org.apache.maven.lifecycle.internal.LifecycleModuleBuilder.buildProject (LifecycleModuleBuilder.java:81)
    at org.apache.maven.lifecycle.internal.builder.singlethreaded.SingleThreadedBuilder.build
(SingleThreadedBuilder.java:56)
    at org.apache.maven.lifecycle.internal.LifecycleStarter.execute (LifecycleStarter.java:128)
    at org.apache.maven.DefaultMaven.doExecute (DefaultMaven.java:305)
    at org.apache.maven.DefaultMaven.doExecute (DefaultMaven.java:192)
    at org.apache.maven.DefaultMaven.execute (DefaultMaven.java:105)
    at org.jvnet.hudson.maven3.launcher.Maven35Launcher.main (Maven35Launcher.java:130)
    at sun.reflect.NativeMethodAccessorImpl.invoke0 (Native Method)
    at sun.reflect.NativeMethodAccessorImpl.invoke (NativeMethodAccessorImpl.java:62)
    at sun.reflect.DelegatingMethodAccessorImpl.invoke (DelegatingMethodAccessorImpl.java:43)
    at java.lang.reflect.Method.invoke (Method.java:498)
    at org.codehaus.plexus.classworlds.launcher.Launcher.launchEnhanced (Launcher.java:282)
    at org.codehaus.plexus.classworlds.launcher.Launcher.launch (Launcher.java:225)
    at jenkins.maven3.agent.Maven35Main.launch (Maven35Main.java:178)
    at sun.reflect.NativeMethodAccessorImpl.invoke0 (Native Method)
    at sun.reflect.NativeMethodAccessorImpl.invoke (NativeMethodAccessorImpl.java:62)
    at sun.reflect.DelegatingMethodAccessorImpl.invoke (DelegatingMethodAccessorImpl.java:43)
    at java.lang.reflect.Method.invoke (Method.java:498)
    at hudson.maven.Maven3Builder.call (Maven3Builder.java:139)
    at hudson.maven.Maven3Builder.call (Maven3Builder.java:70)
    at hudson.remoting.UserRequest.perform (UserRequest.java:212)
    at hudson.remoting.UserRequest.perform (UserRequest.java:54)
    at hudson.remoting.Request$2.run (Request.java:369)
    at hudson.remoting.InterceptingExecutorService$1.call (InterceptingExecutorService.java:72)
    at java.util.concurrent.FutureTask.run (FutureTask.java:266)
    at java.util.concurrent.ThreadPoolExecutor.runWorker (ThreadPoolExecutor.java:1149)
    at java.util.concurrent.ThreadPoolExecutor$Worker.run (ThreadPoolExecutor.java:624)
    at java.lang.Thread.run (Thread.java:748)
Caused by: org.apache.derby.iapi.error.StandardException: Database 'torque-test/target/bookstore'
shutdown.
    at org.apache.derby.iapi.error.StandardException.newException (Unknown Source)
    at org.apache.derby.iapi.error.StandardException.newException (Unknown Source)
    at org.apache.derby.impl.jdbc.TransactionResourceImpl.shutdownDatabaseException (Unknown
Source)
    at org.apache.derby.impl.jdbc.EmbedConnection.<init> (Unknown Source)
    at org.apache.derby.jdbc.InternalDriver$1.run (Unknown Source)
    at org.apache.derby.jdbc.InternalDriver$1.run (Unknown Source)
    at java.security.AccessController.doPrivileged (Native Method)
    at org.apache.derby.jdbc.InternalDriver.getNewEmbedConnection (Unknown Source)
    at org.apache.derby.jdbc.InternalDriver.connect (Unknown Source)
    at org.apache.derby.jdbc.InternalDriver.connect (Unknown Source)
    at org.apache.derby.jdbc.EmbeddedDriver.connect (Unknown Source)
    at org.apache.tools.ant.taskdefs.JDBCTask.getConnection (JDBCTask.java:366)
    at org.apache.tools.ant.taskdefs.SQLExec.getConnection (SQLExec.java:961)
    at org.apache.tools.ant.taskdefs.SQLExec.execute (SQLExec.java:628)
    at org.apache.tools.ant.UnknownElement.execute (UnknownElement.java:292)
    at sun.reflect.NativeMethodAccessorImpl.invoke0 (Native Method)
    at sun.reflect.NativeMethodAccessorImpl.invoke (NativeMethodAccessorImpl.java:62)
    at sun.reflect.DelegatingMethodAccessorImpl.invoke (DelegatingMethodAccessorImpl.java:43)
    at java.lang.reflect.Method.invoke (Method.java:498)
    at org.apache.tools.ant.dispatch.DispatchUtils.execute (DispatchUtils.java:106)
    at org.apache.tools.ant.Task.perform (Task.java:348)
    at org.apache.tools.ant.Target.execute (Target.java:435)
    at org.apache.tools.ant.Target.performTasks (Target.java:456)
    at org.apache.tools.ant.Project.executeSortedTargets (Project.java:1393)
    at org.apache.tools.ant.Project.executeTarget (Project.java:1364)
    at org.apache.maven.plugin.antrun.AntRunMojo.execute (AntRunMojo.java:313)
    at org.apache.maven.plugin.DefaultBuildPluginManager.executeMojo (DefaultBuildPluginManager.java:137)
    at org.apache.maven.lifecycle.internal.MojoExecutor.execute (MojoExecutor.java:210)
    at org.apache.maven.lifecycle.internal.MojoExecutor.execute (MojoExecutor.java:156)
    at org.apache.maven.lifecycle.internal.MojoExecutor.execute (MojoExecutor.java:148)
    at org.apache.maven.lifecycle.internal.LifecycleModuleBuilder.buildProject (LifecycleModuleBuilder.java:117)
    at org.apache.maven.lifecycle.internal.LifecycleModuleBuilder.buildProject (LifecycleModuleBuilder.java:81)
    at org.apache.maven.lifecycle.internal.builder.singlethreaded.SingleThreadedBuilder.build
(SingleThreadedBuilder.java:56)
    at org.apache.maven.lifecycle.internal.LifecycleStarter.execute (LifecycleStarter.java:128)
    at org.apache.maven.DefaultMaven.doExecute (DefaultMaven.java:305)
    at org.apache.maven.DefaultMaven.doExecute (DefaultMaven.java:192)
    at org.apache.maven.DefaultMaven.execute (DefaultMaven.java:105)
    at org.jvnet.hudson.maven3.launcher.Maven35Launcher.main (Maven35Launcher.java:130)
    at sun.reflect.NativeMethodAccessorImpl.invoke0 (Native Method)
    at sun.reflect.NativeMethodAccessorImpl.invoke (NativeMethodAccessorImpl.java:62)
    at sun.reflect.DelegatingMethodAccessorImpl.invoke (DelegatingMethodAccessorImpl.java:43)
    at java.lang.reflect.Method.invoke (Method.java:498)
    at org.codehaus.plexus.classworlds.launcher.Launcher.launchEnhanced (Launcher.java:282)
    at org.codehaus.plexus.classworlds.launcher.Launcher.launch (Launcher.java:225)
    at jenkins.maven3.agent.Maven35Main.launch (Maven35Main.java:178)
    at sun.reflect.NativeMethodAccessorImpl.invoke0 (Native Method)
    at sun.reflect.NativeMethodAccessorImpl.invoke (NativeMethodAccessorImpl.java:62)
    at sun.reflect.DelegatingMethodAccessorImpl.invoke (DelegatingMethodAccessorImpl.java:43)
    at java.lang.reflect.Method.invoke (Method.java:498)
    at hudson.maven.Maven3Builder.call (Maven3Builder.java:139)
    at hudson.maven.Maven3Builder.call (Maven3Builder.java:70)
    at hudson.remoting.UserRequest.perform (UserRequest.java:212)
    at hudson.remoting.UserRequest.perform (UserRequest.java:54)
    at hudson.remoting.Request$2.run (Request.java:369)
    at hudson.remoting.InterceptingExecutorService$1.call (InterceptingExecutorService.java:72)
    at java.util.concurrent.FutureTask.run (FutureTask.java:266)
    at java.util.concurrent.ThreadPoolExecutor.runWorker (ThreadPoolExecutor.java:1149)
    at java.util.concurrent.ThreadPoolExecutor$Worker.run (ThreadPoolExecutor.java:624)
    at java.lang.Thread.run (Thread.java:748)
[INFO] 
[INFO] --- torque-maven-plugin:4.1-SNAPSHOT:generate (generate-sources) @ torque-test ---
ERROR StatusLogger No Log4j 2 configuration file found. Using default configuration (logging
only errors to the console), or user programmatically provided configurations. Set system
property 'log4j2.debug' to show Log4j 2 internal initialization logging. See https://logging.apache.org/log4j/2.x/manual/configuration.html
for instructions on how to configure Log4j 2
[INFO] Generation successful
[INFO] 
[INFO] --- torque-maven-plugin:4.1-SNAPSHOT:generate (generate-sql) @ torque-test ---
[INFO] Generation successful
[INFO] 
[INFO] --- torque-maven-plugin:4.1-SNAPSHOT:generate (generate-createdb-sql) @ torque-test
---
[INFO] Generation successful
[INFO] 
[INFO] --- torque-maven-plugin:4.1-SNAPSHOT:generate (generate-idtable-sql) @ torque-test
---
[INFO] Generation successful
[INFO] 
[INFO] --- torque-maven-plugin:4.1-SNAPSHOT:generate (generate-html-doc) @ torque-test ---
[INFO] Generation successful
[INFO] 
[INFO] --- maven-remote-resources-plugin:1.5:process (process-resource-bundles) @ torque-test
---
[INFO] 
[INFO] --- maven-resources-plugin:3.1.0:resources (default-resources) @ torque-test ---
[INFO] Using 'ISO-8859-1' encoding to copy filtered resources.
[INFO] skip non existing resourceDirectory <https://builds.apache.org/job/torque4-test-project-derby/org.apache.torque$torque-test/ws/src/main/resources>
[INFO] Copying 3 resources
[INFO] 
[INFO] --- maven-compiler-plugin:3.7.0:compile (default-compile) @ torque-test ---
[INFO] Changes detected - recompiling the module!
[INFO] Compiling 684 source files to <https://builds.apache.org/job/torque4-test-project-derby/org.apache.torque$torque-test/ws/target/classes>
[INFO] <https://builds.apache.org/job/torque4-test-project-derby/org.apache.torque$torque-test/ws/target/generated-sources/org/apache/torque/test/dbobject/base/BaseTimestampPk.java>:
Some input files use or override a deprecated API.
[INFO] <https://builds.apache.org/job/torque4-test-project-derby/org.apache.torque$torque-test/ws/target/generated-sources/org/apache/torque/test/dbobject/base/BaseTimestampPk.java>:
Recompile with -Xlint:deprecation for details.
[INFO] 
[INFO] --- sql-maven-plugin:1.4:execute (execute-ext-ddl) @ torque-test ---
[INFO] Executing file: <https://builds.apache.org/job/torque4-test-project-derby/org.apache.torque$torque-test/ws/target/generated-sql/extext-schema.sql>
0 rows affected
[INFO] Executing file: <https://builds.apache.org/job/torque4-test-project-derby/org.apache.torque$torque-test/ws/target/generated-sql/ext-schema.sql>
0 rows affected
[INFO] 2 of 2 SQL statements executed successfully
[INFO] 
[INFO] --- sql-maven-plugin:1.4:execute (execute-ddl) @ torque-test ---
[INFO] Executing file: <https://builds.apache.org/job/torque4-test-project-derby/org.apache.torque$torque-test/ws/target/generated-sql/bookstore-schema.sql>
[INFO] Executing file: <https://builds.apache.org/job/torque4-test-project-derby/org.apache.torque$torque-test/ws/target/generated-sql/databaseMapInit-schema.sql>
[INFO] Executing file: <https://builds.apache.org/job/torque4-test-project-derby/org.apache.torque$torque-test/ws/target/generated-sql/default-value-schema.sql>
[INFO] Executing file: <https://builds.apache.org/job/torque4-test-project-derby/org.apache.torque$torque-test/ws/target/generated-sql/foreign-key-schema.sql>
[INFO] Executing file: <https://builds.apache.org/job/torque4-test-project-derby/org.apache.torque$torque-test/ws/target/generated-sql/id-table-schema.sql>
[INFO] Executing file: <https://builds.apache.org/job/torque4-test-project-derby/org.apache.torque$torque-test/ws/target/generated-sql/index.sql>
[INFO] Executing file: <https://builds.apache.org/job/torque4-test-project-derby/org.apache.torque$torque-test/ws/target/generated-sql/pk-schema.sql>
[INFO] Executing file: <https://builds.apache.org/job/torque4-test-project-derby/org.apache.torque$torque-test/ws/target/generated-sql/qualified-table-name-schema.sql>
[INFO] Executing file: <https://builds.apache.org/job/torque4-test-project-derby/org.apache.torque$torque-test/ws/target/generated-sql/save-method-in-peer-schema.sql>
[INFO] Executing file: <https://builds.apache.org/job/torque4-test-project-derby/org.apache.torque$torque-test/ws/target/generated-sql/test-schema.sql>
[INFO] Executing file: <https://builds.apache.org/job/torque4-test-project-derby/org.apache.torque$torque-test/ws/target/generated-sql/types-schema.sql>
[INFO] 122 of 122 SQL statements executed successfully
[INFO] 
[INFO] --- sql-maven-plugin:1.4:execute (execute-idtable-sql) @ torque-test ---
[INFO] Executing file: <https://builds.apache.org/job/torque4-test-project-derby/org.apache.torque$torque-test/ws/target/generated-sql-init/bookstore-schema-idtable-init.sql>
[INFO] Executing file: <https://builds.apache.org/job/torque4-test-project-derby/org.apache.torque$torque-test/ws/target/generated-sql-init/databaseMapInit-schema-idtable-init.sql>
[INFO] Executing file: <https://builds.apache.org/job/torque4-test-project-derby/org.apache.torque$torque-test/ws/target/generated-sql-init/default-value-schema-idtable-init.sql>
[INFO] Executing file: <https://builds.apache.org/job/torque4-test-project-derby/org.apache.torque$torque-test/ws/target/generated-sql-init/ext-schema-idtable-init.sql>
[INFO] Executing file: <https://builds.apache.org/job/torque4-test-project-derby/org.apache.torque$torque-test/ws/target/generated-sql-init/extext-schema-idtable-init.sql>
[INFO] Executing file: <https://builds.apache.org/job/torque4-test-project-derby/org.apache.torque$torque-test/ws/target/generated-sql-init/foreign-key-schema-idtable-init.sql>
[INFO] Executing file: <https://builds.apache.org/job/torque4-test-project-derby/org.apache.torque$torque-test/ws/target/generated-sql-init/pk-schema-idtable-init.sql>
[INFO] Executing file: <https://builds.apache.org/job/torque4-test-project-derby/org.apache.torque$torque-test/ws/target/generated-sql-init/qualified-table-name-schema-idtable-init.sql>
[INFO] Executing file: <https://builds.apache.org/job/torque4-test-project-derby/org.apache.torque$torque-test/ws/target/generated-sql-init/save-method-in-peer-schema-idtable-init.sql>
[INFO] Executing file: <https://builds.apache.org/job/torque4-test-project-derby/org.apache.torque$torque-test/ws/target/generated-sql-init/test-schema-idtable-init.sql>
[INFO] Executing file: <https://builds.apache.org/job/torque4-test-project-derby/org.apache.torque$torque-test/ws/target/generated-sql-init/types-schema-idtable-init.sql>
[INFO] 76 of 76 SQL statements executed successfully
[INFO] 
[INFO] --- sql-maven-plugin:1.4:execute (shutdown-db-after-ddl) @ torque-test ---
[INFO] 
[INFO] --- maven-resources-plugin:3.1.0:testResources (default-testResources) @ torque-test
---
[INFO] Using 'ISO-8859-1' encoding to copy filtered resources.
[INFO] Copying 5 resources
[INFO] Copying 3 resources
[INFO] 
[INFO] --- maven-compiler-plugin:3.7.0:testCompile (default-testCompile) @ torque-test ---
[INFO] Changes detected - recompiling the module!
[INFO] Compiling 63 source files to <https://builds.apache.org/job/torque4-test-project-derby/org.apache.torque$torque-test/ws/target/test-classes>
[INFO] -------------------------------------------------------------
[ERROR] COMPILATION ERROR : 
[INFO] -------------------------------------------------------------
[ERROR] <https://builds.apache.org/job/torque4-test-project-derby/org.apache.torque$torque-test/ws/src/test/java/org/apache/torque/BeanTestConditional.java>:[29,35]
package org.apache.torque.test.bean does not exist
[ERROR] <https://builds.apache.org/job/torque4-test-project-derby/org.apache.torque$torque-test/ws/src/test/java/org/apache/torque/BeanTestConditional.java>:[30,35]
package org.apache.torque.test.bean does not exist
[ERROR] <https://builds.apache.org/job/torque4-test-project-derby/org.apache.torque$torque-test/ws/src/test/java/org/apache/torque/ManagerTestConditional.java>:[31,38]
package org.apache.torque.test.manager does not exist
[ERROR] <https://builds.apache.org/job/torque4-test-project-derby/org.apache.torque$torque-test/ws/src/test/java/org/apache/torque/ManagerTestConditional.java>:[32,38]
package org.apache.torque.test.manager does not exist
[ERROR] <https://builds.apache.org/job/torque4-test-project-derby/org.apache.torque$torque-test/ws/src/test/java/org/apache/torque/ManagerTestConditional.java>:[33,38]
package org.apache.torque.test.manager does not exist
[INFO] 5 errors 
[INFO] -------------------------------------------------------------

---------------------------------------------------------------------
To unsubscribe, e-mail: torque-dev-unsubscribe@db.apache.org
For additional commands, e-mail: torque-dev-help@db.apache.org


Mime
View raw message