clerezza-commits mailing list archives

Site index · List index
Message view « Date » · « Thread »
Top « Date » · « Thread »
From Apache Jenkins Server <jenk...@builds.apache.org>
Subject Build failed in Jenkins: clerezza-site #463
Date Sat, 08 Feb 2014 20:09:43 GMT
See <https://builds.apache.org/job/clerezza-site/463/>

------------------------------------------
Started by an SCM change
Building remotely on ubuntu6 in workspace <https://builds.apache.org/job/clerezza-site/ws/>
Cloning the remote Git repository
Cloning repository https://git-wip-us.apache.org/repos/asf/clerezza.git
Fetching upstream changes from https://git-wip-us.apache.org/repos/asf/clerezza.git
Checking out Revision 83c1997c24fb31fb66b9b0c234bb67898f25fa1d (origin/master)
First time build. Skipping changelog.
[locks-and-latches] Checking to see if we really have the locks
[locks-and-latches] Have all the locks, build can start
Parsing POMs
Discovered a new module org.apache.clerezza:reactor Clerezza - Reactor build (root)
Modules changed, recalculating dependency graph
maven3-agent.jar already up to date
maven3-interceptor.jar already up to date
maven3-interceptor-commons.jar already up to date
[clerezza-site] $ /home/hudson/tools/java/latest1.6/bin/java -XX:MaxPermSize=256m -cp /home/jenkins/jenkins-slave/maven3-agent.jar:/home/jenkins/jenkins-slave/tools/hudson.tasks.Maven_MavenInstallation/Maven_3.0.5/boot/plexus-classworlds-2.4.jar
org.jvnet.hudson.maven3.agent.Maven3Main /home/jenkins/jenkins-slave/tools/hudson.tasks.Maven_MavenInstallation/Maven_3.0.5
/home/jenkins/jenkins-slave/slave.jar /home/jenkins/jenkins-slave/maven3-interceptor.jar /home/jenkins/jenkins-slave/maven3-interceptor-commons.jar
43697
<===[JENKINS REMOTING CAPACITY]===>channel started
   log4j:WARN No appenders could be found for logger (org.apache.commons.beanutils.converters.BooleanConverter).
log4j:WARN Please initialize the log4j system properly.
Executing Maven:  -B -f <https://builds.apache.org/job/clerezza-site/ws/pom.xml> -Dmaven.repo.local=/home/jenkins/jenkins-slave/maven-repositories/0
-Psite-build install site
[INFO] Scanning for projects...
[WARNING] 
[WARNING] Some problems were encountered while building the effective model for org.apache.clerezza:reactor:pom:0.3-SNAPSHOT
[WARNING] 'build.plugins.plugin.version' for org.apache.felix:maven-bundle-plugin is missing.
@ line 280, column 21
[WARNING] 'build.plugins.plugin.version' for org.apache.felix:maven-scr-plugin is missing.
@ line 284, column 21
[WARNING] 'build.plugins.plugin.version' for org.codehaus.xsite:xsite-maven-plugin is missing.
@ line 311, column 21
[WARNING] 
[WARNING] It is highly recommended to fix these problems because they threaten the stability
of your build.
[WARNING] 
[WARNING] For this reason, future Maven versions might no longer support building such malformed
projects.
[WARNING] 
[INFO]                                                                         
[INFO] ------------------------------------------------------------------------
[INFO] Building Clerezza - Reactor build (root) 0.3-SNAPSHOT
[INFO] ------------------------------------------------------------------------
Downloading: http://repo.maven.apache.org/maven2/org/codehaus/xsite/xsite-maven-plugin/maven-metadata.xml
Downloading: http://repository.apache.org/snapshots/org/codehaus/xsite/xsite-maven-plugin/maven-metadata.xml
Downloaded: http://repo.maven.apache.org/maven2/org/codehaus/xsite/xsite-maven-plugin/maven-metadata.xml
(903 B at 2.2 KB/sec)
Downloading: http://repository.apache.org/snapshots/org/codehaus/xsite/xsite-maven-plugin/1.3/xsite-maven-plugin-1.3.pom
Downloading: http://repo.maven.apache.org/maven2/org/codehaus/xsite/xsite-maven-plugin/1.3/xsite-maven-plugin-1.3.pom
Downloaded: http://repo.maven.apache.org/maven2/org/codehaus/xsite/xsite-maven-plugin/1.3/xsite-maven-plugin-1.3.pom
(3 KB at 10.2 KB/sec)
Downloading: http://repository.apache.org/snapshots/org/codehaus/xsite/xsite/1.3/xsite-1.3.pom
Downloading: http://repo.maven.apache.org/maven2/org/codehaus/xsite/xsite/1.3/xsite-1.3.pom
Downloaded: http://repo.maven.apache.org/maven2/org/codehaus/xsite/xsite/1.3/xsite-1.3.pom
(15 KB at 50.4 KB/sec)
Downloading: http://repository.apache.org/snapshots/org/codehaus/xsite/xsite-maven-plugin/1.3/xsite-maven-plugin-1.3.jar
Downloading: http://repo.maven.apache.org/maven2/org/codehaus/xsite/xsite-maven-plugin/1.3/xsite-maven-plugin-1.3.jar
Downloaded: http://repo.maven.apache.org/maven2/org/codehaus/xsite/xsite-maven-plugin/1.3/xsite-maven-plugin-1.3.jar
(6 KB at 24.3 KB/sec)
Downloading: http://repository.apache.org/snapshots/org/apache/felix/maven-bundle-plugin/maven-metadata.xml
Downloaded: http://repository.apache.org/snapshots/org/apache/felix/maven-bundle-plugin/maven-metadata.xml
(331 B at 2.4 KB/sec)
Downloading: http://repository.apache.org/snapshots/org/apache/felix/maven-scr-plugin/maven-metadata.xml
Downloading: http://repo.maven.apache.org/maven2/org/apache/felix/maven-scr-plugin/maven-metadata.xml
Downloaded: http://repo.maven.apache.org/maven2/org/apache/felix/maven-scr-plugin/maven-metadata.xml
(2 KB at 112.7 KB/sec)
Downloaded: http://repository.apache.org/snapshots/org/apache/felix/maven-scr-plugin/maven-metadata.xml
(570 B at 1.4 KB/sec)
Downloading: http://repository.apache.org/snapshots/org/apache/felix/maven-scr-plugin/1.15.0/maven-scr-plugin-1.15.0.pom
Downloading: http://repo.maven.apache.org/maven2/org/apache/felix/maven-scr-plugin/1.15.0/maven-scr-plugin-1.15.0.pom
Downloaded: http://repo.maven.apache.org/maven2/org/apache/felix/maven-scr-plugin/1.15.0/maven-scr-plugin-1.15.0.pom
(5 KB at 413.0 KB/sec)
Downloading: http://repository.apache.org/snapshots/org/apache/felix/maven-scr-plugin/1.15.0/maven-scr-plugin-1.15.0.jar
Downloading: http://repo.maven.apache.org/maven2/org/apache/felix/maven-scr-plugin/1.15.0/maven-scr-plugin-1.15.0.jar
Downloaded: http://repo.maven.apache.org/maven2/org/apache/felix/maven-scr-plugin/1.15.0/maven-scr-plugin-1.15.0.jar
(27 KB at 123.7 KB/sec)
[INFO] 
[INFO] --- maven-remote-resources-plugin:1.4:process (default) @ reactor ---
[INFO] 
[INFO] --- maven-site-plugin:3.2:attach-descriptor (attach-descriptor) @ reactor ---
[INFO] 
[INFO] --- maven-install-plugin:2.3.1:install (default-install) @ reactor ---
[INFO] Installing <https://builds.apache.org/job/clerezza-site/ws/pom.xml> to /home/jenkins/jenkins-slave/maven-repositories/0/org/apache/clerezza/reactor/0.3-SNAPSHOT/reactor-0.3-SNAPSHOT.pom
[INFO] Installing <https://builds.apache.org/job/clerezza-site/ws/target/reactor-0.3-SNAPSHOT-site.xml>
to /home/jenkins/jenkins-slave/maven-repositories/0/org/apache/clerezza/reactor/0.3-SNAPSHOT/reactor-0.3-SNAPSHOT-site.xml
[INFO] 
[INFO] --- maven-site-plugin:3.2:site (default-site) @ reactor ---
[INFO] configuring report plugin org.apache.maven.plugins:maven-javadoc-plugin:2.4
Downloading: http://repository.apache.org/snapshots/org/apache/maven/plugins/maven-javadoc-plugin/2.4/maven-javadoc-plugin-2.4.pom
Downloading: http://repo.maven.apache.org/maven2/org/apache/maven/plugins/maven-javadoc-plugin/2.4/maven-javadoc-plugin-2.4.pom
Downloaded: http://repo.maven.apache.org/maven2/org/apache/maven/plugins/maven-javadoc-plugin/2.4/maven-javadoc-plugin-2.4.pom
(10 KB at 829.7 KB/sec)
Downloading: http://repository.apache.org/snapshots/org/apache/maven/plugins/maven-javadoc-plugin/2.4/maven-javadoc-plugin-2.4.jar
Downloading: http://repo.maven.apache.org/maven2/org/apache/maven/plugins/maven-javadoc-plugin/2.4/maven-javadoc-plugin-2.4.jar
Downloaded: http://repo.maven.apache.org/maven2/org/apache/maven/plugins/maven-javadoc-plugin/2.4/maven-javadoc-plugin-2.4.jar
(73 KB at 3830.5 KB/sec)
[INFO] ------------------------------------------------------------------------
[INFO] BUILD FAILURE
[INFO] ------------------------------------------------------------------------
[INFO] Total time: 31.163s
[INFO] Finished at: Sat Feb 08 20:09:41 UTC 2014
[INFO] Final Memory: 13M/54M
[INFO] ------------------------------------------------------------------------
Waiting for Jenkins to finish collecting data[ERROR] Failed to execute goal org.apache.maven.plugins:maven-site-plugin:3.2:site
(default-site) on project reactor: failed to get report for org.apache.maven.plugins:maven-javadoc-plugin:
Unable to parse configuration of mojo org.apache.maven.plugins:maven-javadoc-plugin:2.4:javadoc:
Setter org.apache.maven.plugin.javadoc.JavadocReport.setReportOutputDirectory( java.io.File
) threw exception when called with parameter '<https://builds.apache.org/job/clerezza-site/ws/target/site/apidocs'>:
null: InvocationTargetException: NullPointerException -> [Help 1]
[ERROR] 
[ERROR] To see the full stack trace of the errors, re-run Maven with the -e switch.
[ERROR] Re-run Maven using the -X switch to enable full debug logging.
[ERROR] 
[ERROR] For more information about the errors and possible solutions, please read the following
articles:
[ERROR] [Help 1] http://cwiki.apache.org/confluence/display/MAVEN/MojoExecutionException

[JENKINS] Archiving <https://builds.apache.org/job/clerezza-site/ws/pom.xml> to org.apache.clerezza/reactor/0.3-SNAPSHOT/reactor-0.3-SNAPSHOT.pom
[JENKINS] Archiving <https://builds.apache.org/job/clerezza-site/ws/target/reactor-0.3-SNAPSHOT-site.xml>
to org.apache.clerezza/reactor/0.3-SNAPSHOT/reactor-0.3-SNAPSHOT-site.xml
Sending e-mails to: commits@clerezza.apache.org
channel stopped
[locks-and-latches] Releasing all the locks
[locks-and-latches] All the locks released

Mime
View raw message