asterixdb-notifications mailing list archives

Site index · List index
Message view « Date » · « Thread »
Top « Date » · « Thread »
From Asterix build server <jenk...@asterix-jenkins.ics.uci.edu>
Subject Build failed in Jenkins: hyracks-solo 28803b78
Date Fri, 04 Jun 2021 19:56:39 GMT
See <https://asterix-jenkins.ics.uci.edu/job/hyracks-solo/2905/display/redirect?page=changes>

Changes:

[Ali Alsuliman] [NO ISSUE][RT] Fix flush() of subplan runtime

[Michael Blow] [ASTERIXDB-2890] Minimum Java version 8->11


------------------------------------------
[...truncated 3.90 KB...]
[INFO] hyracks-ipc
[INFO] hyracks-net
[INFO] hyracks-comm
[INFO] hyracks-control
[INFO] hyracks-control-common
[INFO] hyracks-control-nc
[INFO] hyracks-data
[INFO] hyracks-data-std
[INFO] hyracks-dataflow-common
[INFO] hyracks-storage-common
[INFO] hyracks-dataflow-std
[INFO] hyracks-storage-am-common
[INFO] hyracks-storage-am-btree
[INFO] hyracks-storage-am-rtree
[INFO] hyracks-storage-am-bloomfilter
[INFO] hyracks-storage-am-lsm-common
[INFO] hyracks-test-support
[INFO] hyracks-http
[INFO] hyracks-control-cc
[INFO] hyracks-client
[INFO] hyracks-nc-service
[INFO] hyracks-storage-am-lsm-invertedindex
[INFO] hyracks-storage-am-lsm-btree
[INFO] hyracks-storage-am-lsm-rtree
[INFO] hyracks-tests
[INFO] hyracks-storage-common-test
[INFO] hyracks-storage-am-btree-test
[INFO] hyracks-storage-am-rtree-test
[INFO] hyracks-storage-am-lsm-common-test
[INFO] hyracks-storage-am-lsm-btree-test
[INFO] hyracks-storage-am-lsm-rtree-test
[INFO] hyracks-storage-am-lsm-invertedindex-test
[INFO] hyracks-storage-am-bloomfilter-test
[INFO] hyracks-dataflow-common-test
[INFO] hyracks-server
[INFO] hyracks-examples
[INFO] tpch-example
[INFO] tpchclient
[INFO] tpchserver
[INFO] text-example
[INFO] texthelper
[INFO] textclient
[INFO] hyracks-maven-plugins
[INFO] Hyracks VirtualCluster Maven Plugin
[INFO] textserver
[INFO] btree-example
[INFO] btreehelper
[INFO] btreeclient
[INFO] btreeserver
[INFO] hyracks-integration-tests
[INFO] hyracks-shutdown-test
[INFO] hyracks-documentation
[INFO] license-automation-plugin
[INFO] hyracks-hdfs
[INFO] hyracks-dist
[INFO] algebricks
[INFO] algebricks-common
[INFO] algebricks-data
[INFO] algebricks-runtime
[INFO] algebricks-core
[INFO] algebricks-compiler
[INFO] algebricks-rewriter
[INFO] algebricks-tests
[INFO] hyracks-fullstack-license
[INFO]                                                                         
[INFO] ------------------------------------------------------------------------
[INFO] Building hyracks-ecosystem-full-stack 0.3.7-SNAPSHOT
[INFO] ------------------------------------------------------------------------
[INFO] 
[INFO] --- maven-clean-plugin:3.0.0:clean (default-clean) @ apache-hyracks ---
[INFO] 
[INFO] --- apache-rat-plugin:0.12:check (default) @ apache-hyracks ---
[INFO] Added 1 additional default licenses.
[INFO] Added 1 custom approved licenses.
[INFO] Will parse SCM ignores for exclusions...
[INFO] Finished adding exclusions from SCM ignore files.
[INFO] 64 implicit excludes (use -debug for more details).
[INFO] Exclude: DEPENDENCIES
[INFO] Exclude: **/*.iml
[INFO] 6 resources included (use -debug for more details)
[INFO] Rat check: Summary over all files. Unapproved: 0, unknown: 0, generated: 0, approved:
4 licenses.
[INFO] 
[INFO] --- maven-antrun-plugin:1.8:run (check-pom-packaging) @ apache-hyracks ---
[INFO] Executing tasks

main:
     [echo] will enforce non-existence of test source dir due to pom packaging
[INFO] Executed tasks
[INFO] 
[INFO] --- maven-enforcer-plugin:3.0.0-M3:enforce (ensure-no-tests-for-pom-packaging) @ apache-hyracks
---
[INFO] 
[INFO] --- maven-enforcer-plugin:3.0.0-M3:enforce (enforce-versions) @ apache-hyracks ---
[WARNING] Rule 1: org.apache.maven.plugins.enforcer.RequireJavaVersion failed with message:
Detected JDK Version: 1.8.0-232 is not in the allowed range [11,).
[INFO] ------------------------------------------------------------------------
[INFO] Reactor Summary:
[INFO] 
[INFO] hyracks-ecosystem-full-stack ....................... FAILURE [  1.495 s]
[INFO] hyracks ............................................ SKIPPED
[INFO] hyracks-util ....................................... SKIPPED
[INFO] hyracks-api ........................................ SKIPPED
[INFO] hyracks-ipc ........................................ SKIPPED
[INFO] hyracks-net ........................................ SKIPPED
[INFO] hyracks-comm ....................................... SKIPPED
[INFO] hyracks-control .................................... SKIPPED
[INFO] hyracks-control-common ............................. SKIPPED
[INFO] hyracks-control-nc ................................. SKIPPED
[INFO] hyracks-data ....................................... SKIPPED
[INFO] hyracks-data-std ................................... SKIPPED
[INFO] hyracks-dataflow-common ............................ SKIPPED
[INFO] hyracks-storage-common ............................. SKIPPED
[INFO] hyracks-dataflow-std ............................... SKIPPED
[INFO] hyracks-storage-am-common .......................... SKIPPED
[INFO] hyracks-storage-am-btree ........................... SKIPPED
[INFO] hyracks-storage-am-rtree ........................... SKIPPED
[INFO] hyracks-storage-am-bloomfilter ..................... SKIPPED
[INFO] hyracks-storage-am-lsm-common ...................... SKIPPED
[INFO] hyracks-test-support ............................... SKIPPED
[INFO] hyracks-http ....................................... SKIPPED
[INFO] hyracks-control-cc ................................. SKIPPED
[INFO] hyracks-client ..................................... SKIPPED
[INFO] hyracks-nc-service ................................. SKIPPED
[INFO] hyracks-storage-am-lsm-invertedindex ............... SKIPPED
[INFO] hyracks-storage-am-lsm-btree ....................... SKIPPED
[INFO] hyracks-storage-am-lsm-rtree ....................... SKIPPED
[INFO] hyracks-tests ...................................... SKIPPED
[INFO] hyracks-storage-common-test ........................ SKIPPED
[INFO] hyracks-storage-am-btree-test ...................... SKIPPED
[INFO] hyracks-storage-am-rtree-test ...................... SKIPPED
[INFO] hyracks-storage-am-lsm-common-test ................. SKIPPED
[INFO] hyracks-storage-am-lsm-btree-test .................. SKIPPED
[INFO] hyracks-storage-am-lsm-rtree-test .................. SKIPPED
[INFO] hyracks-storage-am-lsm-invertedindex-test .......... SKIPPED
[INFO] hyracks-storage-am-bloomfilter-test ................ SKIPPED
[INFO] hyracks-dataflow-common-test ....................... SKIPPED
[INFO] hyracks-server ..................................... SKIPPED
[INFO] hyracks-examples ................................... SKIPPED
[INFO] tpch-example ....................................... SKIPPED
[INFO] tpchclient ......................................... SKIPPED
[INFO] tpchserver ......................................... SKIPPED
[INFO] text-example ....................................... SKIPPED
[INFO] texthelper ......................................... SKIPPED
[INFO] textclient ......................................... SKIPPED
[INFO] hyracks-maven-plugins .............................. SKIPPED
[INFO] Hyracks VirtualCluster Maven Plugin ................ SKIPPED
[INFO] textserver ......................................... SKIPPED
[INFO] btree-example ...................................... SKIPPED
[INFO] btreehelper ........................................ SKIPPED
[INFO] btreeclient ........................................ SKIPPED
[INFO] btreeserver ........................................ SKIPPED
[INFO] hyracks-integration-tests .......................... SKIPPED
[INFO] hyracks-shutdown-test .............................. SKIPPED
[INFO] hyracks-documentation .............................. SKIPPED
[INFO] license-automation-plugin .......................... SKIPPED
[INFO] hyracks-hdfs ....................................... SKIPPED
[INFO] hyracks-dist ....................................... SKIPPED
[INFO] algebricks ......................................... SKIPPED
[INFO] algebricks-common .................................. SKIPPED
[INFO] algebricks-data .................................... SKIPPED
[INFO] algebricks-runtime ................................. SKIPPED
[INFO] algebricks-core .................................... SKIPPED
[INFO] algebricks-compiler ................................ SKIPPED
[INFO] algebricks-rewriter ................................ SKIPPED
[INFO] algebricks-tests ................................... SKIPPED
[INFO] hyracks-fullstack-license .......................... SKIPPED
[INFO] ------------------------------------------------------------------------
[INFO] BUILD FAILURE
[INFO] ------------------------------------------------------------------------
[INFO] Total time: 10.424 s
[INFO] Finished at: 2021-06-04T12:56:27-07:00
[INFO] Final Memory: 39M/334M
[INFO] ------------------------------------------------------------------------
[ERROR] Failed to execute goal org.apache.maven.plugins:maven-enforcer-plugin:3.0.0-M3:enforce
(enforce-versions) on project apache-hyracks: Some Enforcer rules have failed. Look above
for specific messages explaining why the rule failed. -> [Help 1]
[ERROR] 
[ERROR] To see the full stack trace of the errors, re-run Maven with the -e switch.
[ERROR] Re-run Maven using the -X switch to enable full debug logging.
[ERROR] 
[ERROR] For more information about the errors and possible solutions, please read the following
articles:
[ERROR] [Help 1] http://cwiki.apache.org/confluence/display/MAVEN/MojoExecutionException
[JENKINS] Archiving <https://asterix-jenkins.ics.uci.edu/job/hyracks-solo/ws/hyracks-fullstack/algebricks/pom.xml>
to org.apache.hyracks/algebricks/0.3.7-SNAPSHOT/algebricks-0.3.7-SNAPSHOT.pom
[JENKINS] Archiving <https://asterix-jenkins.ics.uci.edu/job/hyracks-solo/ws/hyracks-fullstack/hyracks/hyracks-examples/tpch-example/pom.xml>
to org.apache.hyracks/tpch-example/0.3.7-SNAPSHOT/tpch-example-0.3.7-SNAPSHOT.pom
[JENKINS] Archiving <https://asterix-jenkins.ics.uci.edu/job/hyracks-solo/ws/hyracks-fullstack/hyracks/hyracks-examples/text-example/textclient/pom.xml>
to org.apache.hyracks/textclient/0.3.7-SNAPSHOT/textclient-0.3.7-SNAPSHOT.pom
[JENKINS] Archiving <https://asterix-jenkins.ics.uci.edu/job/hyracks-solo/ws/hyracks-fullstack/hyracks/hyracks-maven-plugins/hyracks-virtualcluster-maven-plugin/pom.xml>
to org.apache.hyracks/hyracks-virtualcluster-maven-plugin/0.3.7-SNAPSHOT/hyracks-virtualcluster-maven-plugin-0.3.7-SNAPSHOT.pom
[JENKINS] Archiving <https://asterix-jenkins.ics.uci.edu/job/hyracks-solo/ws/hyracks-fullstack/hyracks/hyracks-control/hyracks-control-nc/pom.xml>
to org.apache.hyracks/hyracks-control-nc/0.3.7-SNAPSHOT/hyracks-control-nc-0.3.7-SNAPSHOT.pom
[JENKINS] Archiving <https://asterix-jenkins.ics.uci.edu/job/hyracks-solo/ws/hyracks-fullstack/hyracks/hyracks-examples/btree-example/btreehelper/pom.xml>
to org.apache.hyracks.examples.btree/btreehelper/0.3.7-SNAPSHOT/btreehelper-0.3.7-SNAPSHOT.pom
[JENKINS] Archiving <https://asterix-jenkins.ics.uci.edu/job/hyracks-solo/ws/hyracks-fullstack/hyracks/hyracks-dataflow-common/pom.xml>
to org.apache.hyracks/hyracks-dataflow-common/0.3.7-SNAPSHOT/hyracks-dataflow-common-0.3.7-SNAPSHOT.pom
[JENKINS] Archiving <https://asterix-jenkins.ics.uci.edu/job/hyracks-solo/ws/hyracks-fullstack/hyracks/hyracks-storage-am-rtree/pom.xml>
to org.apache.hyracks/hyracks-storage-am-rtree/0.3.7-SNAPSHOT/hyracks-storage-am-rtree-0.3.7-SNAPSHOT.pom
[JENKINS] Archiving <https://asterix-jenkins.ics.uci.edu/job/hyracks-solo/ws/hyracks-fullstack/hyracks/hyracks-examples/tpch-example/tpchclient/pom.xml>
to org.apache.hyracks/tpchclient/0.3.7-SNAPSHOT/tpchclient-0.3.7-SNAPSHOT.pom
[JENKINS] Archiving <https://asterix-jenkins.ics.uci.edu/job/hyracks-solo/ws/hyracks-fullstack/algebricks/algebricks-tests/pom.xml>
to org.apache.hyracks/algebricks-tests/0.3.7-SNAPSHOT/algebricks-tests-0.3.7-SNAPSHOT.pom
[JENKINS] Archiving <https://asterix-jenkins.ics.uci.edu/job/hyracks-solo/ws/hyracks-fullstack/hyracks/hyracks-storage-common/pom.xml>
to org.apache.hyracks/hyracks-storage-common/0.3.7-SNAPSHOT/hyracks-storage-common-0.3.7-SNAPSHOT.pom
[JENKINS] Archiving <https://asterix-jenkins.ics.uci.edu/job/hyracks-solo/ws/hyracks-fullstack/hyracks/hyracks-test-support/pom.xml>
to org.apache.hyracks/hyracks-test-support/0.3.7-SNAPSHOT/hyracks-test-support-0.3.7-SNAPSHOT.pom
[JENKINS] Archiving <https://asterix-jenkins.ics.uci.edu/job/hyracks-solo/ws/hyracks-fullstack/hyracks/hyracks-tests/hyracks-storage-am-lsm-invertedindex-test/pom.xml>
to org.apache.hyracks/hyracks-storage-am-lsm-invertedindex-test/0.3.7-SNAPSHOT/hyracks-storage-am-lsm-invertedindex-test-0.3.7-SNAPSHOT.pom
[JENKINS] Archiving <https://asterix-jenkins.ics.uci.edu/job/hyracks-solo/ws/hyracks-fullstack/hyracks/hyracks-maven-plugins/pom.xml>
to org.apache.hyracks/hyracks-maven-plugins/0.3.7-SNAPSHOT/hyracks-maven-plugins-0.3.7-SNAPSHOT.pom
[JENKINS] Archiving <https://asterix-jenkins.ics.uci.edu/job/hyracks-solo/ws/hyracks-fullstack/pom.xml>
to org.apache.hyracks/apache-hyracks/0.3.7-SNAPSHOT/apache-hyracks-0.3.7-SNAPSHOT.pom
[JENKINS] Archiving <https://asterix-jenkins.ics.uci.edu/job/hyracks-solo/ws/hyracks-fullstack/hyracks/hyracks-examples/text-example/textserver/pom.xml>
to org.apache.hyracks.examples.text/textserver/0.3.7-SNAPSHOT/textserver-0.3.7-SNAPSHOT.pom
[JENKINS] Archiving <https://asterix-jenkins.ics.uci.edu/job/hyracks-solo/ws/hyracks-fullstack/algebricks/algebricks-common/pom.xml>
to org.apache.hyracks/algebricks-common/0.3.7-SNAPSHOT/algebricks-common-0.3.7-SNAPSHOT.pom
[JENKINS] Archiving <https://asterix-jenkins.ics.uci.edu/job/hyracks-solo/ws/hyracks-fullstack/hyracks/hyracks-data/pom.xml>
to org.apache.hyracks/hyracks-data/0.3.7-SNAPSHOT/hyracks-data-0.3.7-SNAPSHOT.pom
[JENKINS] Archiving <https://asterix-jenkins.ics.uci.edu/job/hyracks-solo/ws/hyracks-fullstack/hyracks/hyracks-storage-am-common/pom.xml>
to org.apache.hyracks/hyracks-storage-am-common/0.3.7-SNAPSHOT/hyracks-storage-am-common-0.3.7-SNAPSHOT.pom
[JENKINS] Archiving <https://asterix-jenkins.ics.uci.edu/job/hyracks-solo/ws/hyracks-fullstack/hyracks/hyracks-tests/hyracks-storage-am-lsm-common-test/pom.xml>
to org.apache.hyracks/hyracks-storage-am-lsm-common-test/0.3.7-SNAPSHOT/hyracks-storage-am-lsm-common-test-0.3.7-SNAPSHOT.pom
[JENKINS] Archiving <https://asterix-jenkins.ics.uci.edu/job/hyracks-solo/ws/hyracks-fullstack/hyracks/pom.xml>
to org.apache.hyracks/hyracks/0.3.7-SNAPSHOT/hyracks-0.3.7-SNAPSHOT.pom
[JENKINS] Archiving <https://asterix-jenkins.ics.uci.edu/job/hyracks-solo/ws/hyracks-fullstack/hyracks/hyracks-control/hyracks-control-common/pom.xml>
to org.apache.hyracks/hyracks-control-common/0.3.7-SNAPSHOT/hyracks-control-common-0.3.7-SNAPSHOT.pom
[JENKINS] Archiving <https://asterix-jenkins.ics.uci.edu/job/hyracks-solo/ws/hyracks-fullstack/hyracks/hyracks-dist/pom.xml>
to org.apache.hyracks/hyracks-dist/0.3.7-SNAPSHOT/hyracks-dist-0.3.7-SNAPSHOT.pom
[JENKINS] Archiving <https://asterix-jenkins.ics.uci.edu/job/hyracks-solo/ws/hyracks-fullstack/hyracks/hyracks-net/pom.xml>
to org.apache.hyracks/hyracks-net/0.3.7-SNAPSHOT/hyracks-net-0.3.7-SNAPSHOT.pom
[JENKINS] Archiving <https://asterix-jenkins.ics.uci.edu/job/hyracks-solo/ws/hyracks-fullstack/hyracks/hyracks-ipc/pom.xml>
to org.apache.hyracks/hyracks-ipc/0.3.7-SNAPSHOT/hyracks-ipc-0.3.7-SNAPSHOT.pom
[JENKINS] Archiving <https://asterix-jenkins.ics.uci.edu/job/hyracks-solo/ws/hyracks-fullstack/hyracks/hyracks-control/hyracks-control-cc/pom.xml>
to org.apache.hyracks/hyracks-control-cc/0.3.7-SNAPSHOT/hyracks-control-cc-0.3.7-SNAPSHOT.pom
[JENKINS] Archiving <https://asterix-jenkins.ics.uci.edu/job/hyracks-solo/ws/hyracks-fullstack/hyracks/hyracks-api/pom.xml>
to org.apache.hyracks/hyracks-api/0.3.7-SNAPSHOT/hyracks-api-0.3.7-SNAPSHOT.pom
[JENKINS] Archiving <https://asterix-jenkins.ics.uci.edu/job/hyracks-solo/ws/hyracks-fullstack/hyracks/hyracks-examples/pom.xml>
to org.apache.hyracks/hyracks-examples/0.3.7-SNAPSHOT/hyracks-examples-0.3.7-SNAPSHOT.pom
[JENKINS] Archiving <https://asterix-jenkins.ics.uci.edu/job/hyracks-solo/ws/hyracks-fullstack/hyracks/hyracks-storage-am-lsm-btree/pom.xml>
to org.apache.hyracks/hyracks-storage-am-lsm-btree/0.3.7-SNAPSHOT/hyracks-storage-am-lsm-btree-0.3.7-SNAPSHOT.pom
[JENKINS] Archiving <https://asterix-jenkins.ics.uci.edu/job/hyracks-solo/ws/hyracks-fullstack/hyracks/hyracks-examples/btree-example/btreeserver/pom.xml>
to org.apache.hyracks.examples.btree/btreeserver/0.3.7-SNAPSHOT/btreeserver-0.3.7-SNAPSHOT.pom
[JENKINS] Archiving <https://asterix-jenkins.ics.uci.edu/job/hyracks-solo/ws/hyracks-fullstack/hyracks/hyracks-control/pom.xml>
to org.apache.hyracks/hyracks-control/0.3.7-SNAPSHOT/hyracks-control-0.3.7-SNAPSHOT.pom
[JENKINS] Archiving <https://asterix-jenkins.ics.uci.edu/job/hyracks-solo/ws/hyracks-fullstack/hyracks/hyracks-hdfs/pom.xml>
to org.apache.hyracks/hyracks-hdfs/0.3.7-SNAPSHOT/hyracks-hdfs-0.3.7-SNAPSHOT.pom
[JENKINS] Archiving <https://asterix-jenkins.ics.uci.edu/job/hyracks-solo/ws/hyracks-fullstack/hyracks/hyracks-storage-am-lsm-rtree/pom.xml>
to org.apache.hyracks/hyracks-storage-am-lsm-rtree/0.3.7-SNAPSHOT/hyracks-storage-am-lsm-rtree-0.3.7-SNAPSHOT.pom
[JENKINS] Archiving <https://asterix-jenkins.ics.uci.edu/job/hyracks-solo/ws/hyracks-fullstack/algebricks/algebricks-data/pom.xml>
to org.apache.hyracks/algebricks-data/0.3.7-SNAPSHOT/algebricks-data-0.3.7-SNAPSHOT.pom
[JENKINS] Archiving <https://asterix-jenkins.ics.uci.edu/job/hyracks-solo/ws/hyracks-fullstack/algebricks/algebricks-compiler/pom.xml>
to org.apache.hyracks/algebricks-compiler/0.3.7-SNAPSHOT/algebricks-compiler-0.3.7-SNAPSHOT.pom
[JENKINS] Archiving <https://asterix-jenkins.ics.uci.edu/job/hyracks-solo/ws/hyracks-fullstack/hyracks/hyracks-tests/hyracks-storage-am-lsm-rtree-test/pom.xml>
to org.apache.hyracks/hyracks-storage-am-lsm-rtree-test/0.3.7-SNAPSHOT/hyracks-storage-am-lsm-rtree-test-0.3.7-SNAPSHOT.pom
[JENKINS] Archiving <https://asterix-jenkins.ics.uci.edu/job/hyracks-solo/ws/hyracks-fullstack/algebricks/algebricks-core/pom.xml>
to org.apache.hyracks/algebricks-core/0.3.7-SNAPSHOT/algebricks-core-0.3.7-SNAPSHOT.pom
[JENKINS] Archiving <https://asterix-jenkins.ics.uci.edu/job/hyracks-solo/ws/hyracks-fullstack/hyracks/hyracks-client/pom.xml>
to org.apache.hyracks/hyracks-client/0.3.7-SNAPSHOT/hyracks-client-0.3.7-SNAPSHOT.pom
[JENKINS] Archiving <https://asterix-jenkins.ics.uci.edu/job/hyracks-solo/ws/hyracks-fullstack/hyracks/hyracks-examples/hyracks-shutdown-test/pom.xml>
to org.apache.hyracks.examples.text/hyracks-shutdown-test/0.3.7-SNAPSHOT/hyracks-shutdown-test-0.3.7-SNAPSHOT.pom
[JENKINS] Archiving <https://asterix-jenkins.ics.uci.edu/job/hyracks-solo/ws/hyracks-fullstack/hyracks/hyracks-examples/text-example/texthelper/pom.xml>
to org.apache.hyracks/texthelper/0.3.7-SNAPSHOT/texthelper-0.3.7-SNAPSHOT.pom
[JENKINS] Archiving <https://asterix-jenkins.ics.uci.edu/job/hyracks-solo/ws/hyracks-fullstack/hyracks/hyracks-tests/hyracks-storage-am-btree-test/pom.xml>
to org.apache.hyracks/hyracks-storage-am-btree-test/0.3.7-SNAPSHOT/hyracks-storage-am-btree-test-0.3.7-SNAPSHOT.pom
[JENKINS] Archiving <https://asterix-jenkins.ics.uci.edu/job/hyracks-solo/ws/hyracks-fullstack/hyracks/hyracks-examples/tpch-example/tpchserver/pom.xml>
to org.apache.hyracks.examples.tpch/tpchserver/0.3.7-SNAPSHOT/tpchserver-0.3.7-SNAPSHOT.pom
[JENKINS] Archiving <https://asterix-jenkins.ics.uci.edu/job/hyracks-solo/ws/hyracks-fullstack/hyracks/hyracks-examples/btree-example/btreeclient/pom.xml>
to org.apache.hyracks.examples.btree/btreeclient/0.3.7-SNAPSHOT/btreeclient-0.3.7-SNAPSHOT.pom
[JENKINS] Archiving <https://asterix-jenkins.ics.uci.edu/job/hyracks-solo/ws/hyracks-fullstack/hyracks/hyracks-storage-am-btree/pom.xml>
to org.apache.hyracks/hyracks-storage-am-btree/0.3.7-SNAPSHOT/hyracks-storage-am-btree-0.3.7-SNAPSHOT.pom
[JENKINS] Archiving <https://asterix-jenkins.ics.uci.edu/job/hyracks-solo/ws/hyracks-fullstack/hyracks/hyracks-maven-plugins/license-automation-plugin/pom.xml>
to org.apache.hyracks/license-automation-plugin/0.3.7-SNAPSHOT/license-automation-plugin-0.3.7-SNAPSHOT.pom
[JENKINS] Archiving <https://asterix-jenkins.ics.uci.edu/job/hyracks-solo/ws/hyracks-fullstack/hyracks/hyracks-data/hyracks-data-std/pom.xml>
to org.apache.hyracks/hyracks-data-std/0.3.7-SNAPSHOT/hyracks-data-std-0.3.7-SNAPSHOT.pom
[JENKINS] Archiving <https://asterix-jenkins.ics.uci.edu/job/hyracks-solo/ws/hyracks-fullstack/hyracks/hyracks-tests/hyracks-storage-am-rtree-test/pom.xml>
to org.apache.hyracks/hyracks-storage-am-rtree-test/0.3.7-SNAPSHOT/hyracks-storage-am-rtree-test-0.3.7-SNAPSHOT.pom
[JENKINS] Archiving <https://asterix-jenkins.ics.uci.edu/job/hyracks-solo/ws/hyracks-fullstack/hyracks/hyracks-tests/hyracks-dataflow-common-test/pom.xml>
to org.apache.hyracks/hyracks-dataflow-common-test/0.3.7-SNAPSHOT/hyracks-dataflow-common-test-0.3.7-SNAPSHOT.pom
[JENKINS] Archiving <https://asterix-jenkins.ics.uci.edu/job/hyracks-solo/ws/hyracks-fullstack/algebricks/algebricks-rewriter/pom.xml>
to org.apache.hyracks/algebricks-rewriter/0.3.7-SNAPSHOT/algebricks-rewriter-0.3.7-SNAPSHOT.pom
[JENKINS] Archiving <https://asterix-jenkins.ics.uci.edu/job/hyracks-solo/ws/hyracks-fullstack/hyracks/hyracks-tests/hyracks-storage-am-bloomfilter-test/pom.xml>
to org.apache.hyracks/hyracks-storage-am-bloomfilter-test/0.3.7-SNAPSHOT/hyracks-storage-am-bloomfilter-test-0.3.7-SNAPSHOT.pom
[JENKINS] Archiving <https://asterix-jenkins.ics.uci.edu/job/hyracks-solo/ws/hyracks-fullstack/hyracks/hyracks-examples/text-example/pom.xml>
to org.apache.hyracks/text-example/0.3.7-SNAPSHOT/text-example-0.3.7-SNAPSHOT.pom
[JENKINS] Archiving <https://asterix-jenkins.ics.uci.edu/job/hyracks-solo/ws/hyracks-fullstack/hyracks/hyracks-tests/pom.xml>
to org.apache.hyracks/hyracks-tests/0.3.7-SNAPSHOT/hyracks-tests-0.3.7-SNAPSHOT.pom
[JENKINS] Archiving <https://asterix-jenkins.ics.uci.edu/job/hyracks-solo/ws/hyracks-fullstack/hyracks/hyracks-dataflow-std/pom.xml>
to org.apache.hyracks/hyracks-dataflow-std/0.3.7-SNAPSHOT/hyracks-dataflow-std-0.3.7-SNAPSHOT.pom
[JENKINS] Archiving <https://asterix-jenkins.ics.uci.edu/job/hyracks-solo/ws/hyracks-fullstack/hyracks/hyracks-storage-am-lsm-common/pom.xml>
to org.apache.hyracks/hyracks-storage-am-lsm-common/0.3.7-SNAPSHOT/hyracks-storage-am-lsm-common-0.3.7-SNAPSHOT.pom
[JENKINS] Archiving <https://asterix-jenkins.ics.uci.edu/job/hyracks-solo/ws/hyracks-fullstack/hyracks/hyracks-tests/hyracks-storage-am-lsm-btree-test/pom.xml>
to org.apache.hyracks/hyracks-storage-am-lsm-btree-test/0.3.7-SNAPSHOT/hyracks-storage-am-lsm-btree-test-0.3.7-SNAPSHOT.pom
[JENKINS] Archiving <https://asterix-jenkins.ics.uci.edu/job/hyracks-solo/ws/hyracks-fullstack/hyracks/hyracks-documentation/pom.xml>
to org.apache.hyracks/hyracks-documentation/0.3.7-SNAPSHOT/hyracks-documentation-0.3.7-SNAPSHOT.pom
[JENKINS] Archiving <https://asterix-jenkins.ics.uci.edu/job/hyracks-solo/ws/hyracks-fullstack/hyracks/hyracks-server/pom.xml>
to org.apache.hyracks/hyracks-server/0.3.7-SNAPSHOT/hyracks-server-0.3.7-SNAPSHOT.pom
[JENKINS] Archiving <https://asterix-jenkins.ics.uci.edu/job/hyracks-solo/ws/hyracks-fullstack/hyracks/hyracks-examples/btree-example/pom.xml>
to org.apache.hyracks.examples/btree-example/0.3.7-SNAPSHOT/btree-example-0.3.7-SNAPSHOT.pom
[JENKINS] Archiving <https://asterix-jenkins.ics.uci.edu/job/hyracks-solo/ws/hyracks-fullstack/hyracks/hyracks-examples/hyracks-integration-tests/pom.xml>
to org.apache.hyracks.examples/hyracks-integration-tests/0.3.7-SNAPSHOT/hyracks-integration-tests-0.3.7-SNAPSHOT.pom
[JENKINS] Archiving <https://asterix-jenkins.ics.uci.edu/job/hyracks-solo/ws/hyracks-fullstack/hyracks/hyracks-tests/hyracks-storage-common-test/pom.xml>
to org.apache.hyracks/hyracks-storage-common-test/0.3.7-SNAPSHOT/hyracks-storage-common-test-0.3.7-SNAPSHOT.pom
[JENKINS] Archiving <https://asterix-jenkins.ics.uci.edu/job/hyracks-solo/ws/hyracks-fullstack/hyracks/hyracks-comm/pom.xml>
to org.apache.hyracks/hyracks-comm/0.3.7-SNAPSHOT/hyracks-comm-0.3.7-SNAPSHOT.pom
[JENKINS] Archiving <https://asterix-jenkins.ics.uci.edu/job/hyracks-solo/ws/hyracks-fullstack/hyracks/hyracks-control/hyracks-nc-service/pom.xml>
to org.apache.hyracks/hyracks-nc-service/0.3.7-SNAPSHOT/hyracks-nc-service-0.3.7-SNAPSHOT.pom
[JENKINS] Archiving <https://asterix-jenkins.ics.uci.edu/job/hyracks-solo/ws/hyracks-fullstack/hyracks/hyracks-storage-am-bloomfilter/pom.xml>
to org.apache.hyracks/hyracks-storage-am-bloomfilter/0.3.7-SNAPSHOT/hyracks-storage-am-bloomfilter-0.3.7-SNAPSHOT.pom
[JENKINS] Archiving <https://asterix-jenkins.ics.uci.edu/job/hyracks-solo/ws/hyracks-fullstack/hyracks/hyracks-storage-am-lsm-invertedindex/pom.xml>
to org.apache.hyracks/hyracks-storage-am-lsm-invertedindex/0.3.7-SNAPSHOT/hyracks-storage-am-lsm-invertedindex-0.3.7-SNAPSHOT.pom
[JENKINS] Archiving <https://asterix-jenkins.ics.uci.edu/job/hyracks-solo/ws/hyracks-fullstack/algebricks/algebricks-runtime/pom.xml>
to org.apache.hyracks/algebricks-runtime/0.3.7-SNAPSHOT/algebricks-runtime-0.3.7-SNAPSHOT.pom
[JENKINS] Archiving <https://asterix-jenkins.ics.uci.edu/job/hyracks-solo/ws/hyracks-fullstack/hyracks/hyracks-util/pom.xml>
to org.apache.hyracks/hyracks-util/0.3.7-SNAPSHOT/hyracks-util-0.3.7-SNAPSHOT.pom
[JENKINS] Archiving <https://asterix-jenkins.ics.uci.edu/job/hyracks-solo/ws/hyracks-fullstack/hyracks/hyracks-http/pom.xml>
to org.apache.hyracks/hyracks-http/0.3.7-SNAPSHOT/hyracks-http-0.3.7-SNAPSHOT.pom
[JENKINS] Archiving <https://asterix-jenkins.ics.uci.edu/job/hyracks-solo/ws/hyracks-fullstack/hyracks-fullstack-license/pom.xml>
to org.apache.hyracks/hyracks-fullstack-license/0.3.7-SNAPSHOT/hyracks-fullstack-license-0.3.7-SNAPSHOT.pom
channel stopped
New run name is '28803b78'

Mime
View raw message