zookeeper-issues mailing list archives

Site index · List index
Message view « Date » · « Thread »
Top « Date » · « Thread »
From "Ling Mao (Jira)" <j...@apache.org>
Subject [jira] [Created] (ZOOKEEPER-4308) Flaky test: EagerACLFilterTest.testSetDataFail
Date Sun, 30 May 2021 09:32:00 GMT
Ling Mao created ZOOKEEPER-4308:
-----------------------------------

             Summary: Flaky test: EagerACLFilterTest.testSetDataFail
                 Key: ZOOKEEPER-4308
                 URL: https://issues.apache.org/jira/browse/ZOOKEEPER-4308
             Project: ZooKeeper
          Issue Type: Bug
          Components: tests
    Affects Versions: 3.8.0
            Reporter: Ling Mao


URL:[https://github.com/apache/zookeeper/pull/1425/checks?check_run_id=2702959273]
{code:java}
[INFO] 
947[ERROR] Failures: 
948[ERROR]   EagerACLFilterTest.testSetDataFail:222->assertTransactionState:115 Server
State: OBSERVING Check Enabled: true Transaction state on Leader after failed setData ==>
expected: <4294967298> but was: <4294967299>
949[INFO] 
950[ERROR] Tests run: 2913, Failures: 1, Errors: 0, Skipped: 4
951[INFO] {code}



--
This message was sent by Atlassian Jira
(v8.3.4#803005)

Mime
View raw message