zookeeper-dev mailing list archives

Site index · List index
Message view « Date » · « Thread »
Top « Date » · « Thread »
From Apache Jenkins Server <jenk...@builds.apache.org>
Subject ZooKeeper_branch35_jdk8 - Build # 1691 - Failure
Date Sun, 26 Jan 2020 12:31:21 GMT
See https://builds.apache.org/job/ZooKeeper_branch35_jdk8/1691/

###################################################################################
########################## LAST 60 LINES OF THE CONSOLE ###########################
[...truncated 221.23 KB...]
     [exec] ZooKeeper JMX enabled by default
     [exec] Using config: /home/jenkins/jenkins-slave/workspace/ZooKeeper_branch35_jdk8/zookeeper-client/zookeeper-client-c/../../build/test/test-cppunit/conf/0.conf
     [exec] ZooKeeper JMX enabled by default
     [exec] Using config: /home/jenkins/jenkins-slave/workspace/ZooKeeper_branch35_jdk8/zookeeper-client/zookeeper-client-c/../../build/test/test-cppunit/conf/1.conf
     [exec] ZooKeeper JMX enabled by default
     [exec] Using config: /home/jenkins/jenkins-slave/workspace/ZooKeeper_branch35_jdk8/zookeeper-client/zookeeper-client-c/../../build/test/test-cppunit/conf/2.conf
     [exec] ZooKeeper JMX enabled by default
     [exec] Using config: /home/jenkins/jenkins-slave/workspace/ZooKeeper_branch35_jdk8/zookeeper-client/zookeeper-client-c/../../build/test/test-cppunit/conf/0.conf
     [exec] ZooKeeper JMX enabled by default
     [exec] Using config: /home/jenkins/jenkins-slave/workspace/ZooKeeper_branch35_jdk8/zookeeper-client/zookeeper-client-c/../../build/test/test-cppunit/conf/1.conf
     [exec] ZooKeeper JMX enabled by default
     [exec] Using config: /home/jenkins/jenkins-slave/workspace/ZooKeeper_branch35_jdk8/zookeeper-client/zookeeper-client-c/../../build/test/test-cppunit/conf/2.conf
     [exec] ZooKeeper JMX enabled by default
     [exec] Using config: /home/jenkins/jenkins-slave/workspace/ZooKeeper_branch35_jdk8/zookeeper-client/zookeeper-client-c/../../build/test/test-cppunit/conf/0.conf
     [exec] ZooKeeper JMX enabled by default
     [exec] Using config: /home/jenkins/jenkins-slave/workspace/ZooKeeper_branch35_jdk8/zookeeper-client/zookeeper-client-c/../../build/test/test-cppunit/conf/0.conf
     [exec] /home/jenkins/jenkins-slave/workspace/ZooKeeper_branch35_jdk8/zookeeper-client/zookeeper-client-c/../../bin/zkServer.sh:
line 213: kill: (3402) - No such process
     [exec] ZooKeeper JMX enabled by default
     [exec] Using config: /home/jenkins/jenkins-slave/workspace/ZooKeeper_branch35_jdk8/zookeeper-client/zookeeper-client-c/../../build/test/test-cppunit/conf/1.conf
     [exec] Stopping zookeeper ... STOPPED
     [exec] Stopping zookeeper ... STOPPED
     [exec] ZooKeeper JMX enabled by default
     [exec] Using config: /home/jenkins/jenkins-slave/workspace/ZooKeeper_branch35_jdk8/zookeeper-client/zookeeper-client-c/../../build/test/test-cppunit/conf/2.conf
     [exec] /home/jenkins/jenkins-slave/workspace/ZooKeeper_branch35_jdk8/zookeeper-client/zookeeper-client-c/tests/zkServer.sh:
line 62: kill: (30318) - No such process
     [exec] Stopping zookeeper ... STOPPED
     [exec] Client port found: 4000. Client address: localhost.
     [exec] Error contacting service. It is probably not running.
     [exec] 
     [exec] Client port found: 4000. Client address: localhost.
     [exec] Error contacting service. It is probably not running.
     [exec] 
     [exec]  : elapsed 21701 : OK
     [exec] /home/jenkins/jenkins-slave/workspace/ZooKeeper_branch35_jdk8/zookeeper-client/zookeeper-client-c/tests/zkServer.sh:
line 62: kill: (4335) - No such process
     [exec] /bin/bash: line 5: 30306 Segmentation fault      ZKROOT=/home/jenkins/jenkins-slave/workspace/ZooKeeper_branch35_jdk8/zookeeper-client/zookeeper-client-c/../..
CLASSPATH=$CLASSPATH:$CLOVER_HOME/lib/clover*.jar ${dir}$tst
     [exec] Zookeeper_clientretry::testRetry ZooKeeper server process failed ZooKeeper server
NOT started ZooKeeper server process failed ZooKeeper server NOT started : assertion : elapsed
15488
     [exec] Zookeeper_operations::testAsyncWatcher1 : elapsed 5 : OK
     [exec] Zookeeper_operations::testAsyncGetOperation : elapsed 4 : OK
     [exec] Zookeeper_operations::testOperationsAndDisconnectConcurrently1FAIL: zktest-mt
     [exec] ==========================================
     [exec] 1 of 2 tests failed
     [exec] Please report to user@zookeeper.apache.org
     [exec] ==========================================
     [exec] Makefile:1751: recipe for target 'check-TESTS' failed
     [exec] make[1]: Leaving directory '/home/jenkins/jenkins-slave/workspace/ZooKeeper_branch35_jdk8/build/test/test-cppunit'
     [exec] Makefile:2007: recipe for target 'check-am' failed
     [exec] make[1]: *** [check-TESTS] Error 1
     [exec] make: *** [check-am] Error 2

BUILD FAILED
/home/jenkins/jenkins-slave/workspace/ZooKeeper_branch35_jdk8/build.xml:1480: The following
error occurred while executing this line:
/home/jenkins/jenkins-slave/workspace/ZooKeeper_branch35_jdk8/build.xml:1440: The following
error occurred while executing this line:
/home/jenkins/jenkins-slave/workspace/ZooKeeper_branch35_jdk8/build.xml:1450: exec returned:
2

Total time: 31 minutes 14 seconds
Build step 'Invoke Ant' marked build as failure
Archiving artifacts
Recording test results
Email was triggered for: Failure - Any
Sending email for trigger: Failure - Any



###################################################################################
############################## FAILED TESTS (if any) ##############################
All tests passed
Mime
  • Unnamed multipart/mixed (inline, None, 0 bytes)
View raw message