zookeeper-dev mailing list archives

Site index · List index
Message view « Date » · « Thread »
Top « Date » · « Thread »
From Apache Jenkins Server <jenk...@builds.apache.org>
Subject ZooKeeper_branch35_jdk8 - Build # 1624 - Failure
Date Tue, 03 Dec 2019 15:35:42 GMT
See https://builds.apache.org/job/ZooKeeper_branch35_jdk8/1624/

###################################################################################
########################## LAST 60 LINES OF THE CONSOLE ###########################
[...truncated 229.64 KB...]
     [exec] Log Message Received: [2019-12-03 15:34:03,165:10043(0x7f5fd522d740):ZOO_INFO@testLogCallbackInit@1031:
testLogCallbackInit #7]
     [exec] Log Message Received: [2019-12-03 15:34:03,165:10043(0x7f5fd522d740):ZOO_INFO@testLogCallbackInit@1031:
testLogCallbackInit #8]
     [exec] Log Message Received: [2019-12-03 15:34:03,165:10043(0x7f5fd522d740):ZOO_INFO@testLogCallbackInit@1031:
testLogCallbackInit #9]
     [exec] Log Message Received: [2019-12-03 15:34:03,165:10043(0x7f5fd522d740):ZOO_INFO@zookeeper_close@3278:
Closing zookeeper sessionId=0x100d0036ca3000f to [127.0.0.1:22181]
     [exec] ]
     [exec]  : elapsed 1001 : OK
     [exec] Zookeeper_simpleSystem::testLogCallbackClearLog Message Received: [2019-12-03
15:34:03,165:10043(0x7f5fd522d740):ZOO_INFO@log_env@1098: Client environment:zookeeper.version=zookeeper
C client 3.5.7]
     [exec] Log Message Received: [2019-12-03 15:34:03,165:10043(0x7f5fd522d740):ZOO_INFO@log_env@1102:
Client environment:host.name=asf948.gq1.ygridcore.net]
     [exec] Log Message Received: [2019-12-03 15:34:03,165:10043(0x7f5fd522d740):ZOO_INFO@log_env@1109:
Client environment:os.name=Linux]
     [exec] Log Message Received: [2019-12-03 15:34:03,165:10043(0x7f5fd522d740):ZOO_INFO@log_env@1110:
Client environment:os.arch=4.15.0-66-generic]
     [exec] Log Message Received: [2019-12-03 15:34:03,165:10043(0x7f5fd522d740):ZOO_INFO@log_env@1111:
Client environment:os.version=#75-Ubuntu SMP Tue Oct 1 05:24:09 UTC 2019]
     [exec] Log Message Received: [2019-12-03 15:34:03,165:10043(0x7f5fd522d740):ZOO_INFO@log_env@1119:
Client environment:user.name=jenkins]
     [exec] Log Message Received: [2019-12-03 15:34:03,165:10043(0x7f5fd522d740):ZOO_INFO@log_env@1127:
Client environment:user.home=/home/jenkins]
     [exec] Log Message Received: [2019-12-03 15:34:03,165:10043(0x7f5fd522d740):ZOO_INFO@log_env@1139:
Client environment:user.dir=/home/jenkins/jenkins-slave/workspace/ZooKeeper_branch35_jdk8/build/test/test-cppunit]
     [exec] Log Message Received: [2019-12-03 15:34:03,165:10043(0x7f5fd522d740):ZOO_INFO@zookeeper_init_internal@1182:
Initiating client connection, host=127.0.0.1:22181 sessionTimeout=10000 watcher=0x557967ff3f50
sessionId=0 sessionPasswd=<null> context=0x7ffc00a0e850 flags=0]
     [exec] Log Message Received: [2019-12-03 15:34:03,166:10043(0x7f5fd2489700):ZOO_INFO@check_events@2469:
initiated connection to server [127.0.0.1:22181]]
     [exec] Log Message Received: [2019-12-03 15:34:03,221:10043(0x7f5fd2489700):ZOO_INFO@check_events@2521:
session establishment complete on server [127.0.0.1:22181], sessionId=0x100d0036ca30010, negotiated
timeout=10000 ]
     [exec]  : elapsed 1000 : OK
     [exec] Zookeeper_simpleSystem::testAsyncWatcherAutoReset ZooKeeper server started : elapsed
11091 : OK
     [exec] Zookeeper_simpleSystem::testDeserializeString : elapsed 0 : OK
     [exec] Zookeeper_simpleSystem::testFirstServerDown : elapsed 1001 : OK
     [exec] Zookeeper_simpleSystem::testNullData : elapsed 1049 : OK
     [exec] Zookeeper_simpleSystem::testIPV6 : elapsed 1012 : OK
     [exec] Zookeeper_simpleSystem::testCreate : elapsed 1026 : OK
     [exec] Zookeeper_simpleSystem::testCreateContainer : elapsed 1017 : OK
     [exec] Zookeeper_simpleSystem::testCreateTtl : elapsed 2243 : OK
     [exec] Zookeeper_simpleSystem::testPath : elapsed 1063 : OK
     [exec] Zookeeper_simpleSystem::testPathValidation : elapsed 1267 : OK
     [exec] Zookeeper_simpleSystem::testPing : elapsed 18092 : OK
     [exec] Zookeeper_simpleSystem::testAcl : elapsed 1059 : OK
     [exec] Zookeeper_simpleSystem::testChroot : elapsed 4290 : OK
     [exec] terminate called after throwing an instance of 'CppUnit::Exception'
     [exec] Zookeeper_simpleSystem::testAuthFAIL: zktest-mt
     [exec] ==========================================
     [exec] 1 of 2 tests failed
     [exec] Please report to user@zookeeper.apache.org
     [exec] ==========================================
     [exec] Makefile:1751: recipe for target 'check-TESTS' failed
     [exec] make[1]: Leaving directory '/home/jenkins/jenkins-slave/workspace/ZooKeeper_branch35_jdk8/build/test/test-cppunit'
     [exec] Makefile:2007: recipe for target 'check-am' failed
     [exec]   what():  equality assertion failed
     [exec] - Expected: 0
     [exec] - Actual  : -116
     [exec] 
     [exec] /bin/bash: line 5: 10043 Aborted                 ZKROOT=/home/jenkins/jenkins-slave/workspace/ZooKeeper_branch35_jdk8/zookeeper-client/zookeeper-client-c/../..
CLASSPATH=$CLASSPATH:$CLOVER_HOME/lib/clover*.jar ${dir}$tst
     [exec] make[1]: *** [check-TESTS] Error 1
     [exec] make: *** [check-am] Error 2

BUILD FAILED
/home/jenkins/jenkins-slave/workspace/ZooKeeper_branch35_jdk8/build.xml:1480: The following
error occurred while executing this line:
/home/jenkins/jenkins-slave/workspace/ZooKeeper_branch35_jdk8/build.xml:1440: The following
error occurred while executing this line:
/home/jenkins/jenkins-slave/workspace/ZooKeeper_branch35_jdk8/build.xml:1450: exec returned:
2

Total time: 33 minutes 27 seconds
Build step 'Invoke Ant' marked build as failure
Archiving artifacts
Recording test results
Email was triggered for: Failure - Any
Sending email for trigger: Failure - Any



###################################################################################
############################## FAILED TESTS (if any) ##############################
All tests passed
Mime
  • Unnamed multipart/mixed (inline, None, 0 bytes)
View raw message