zookeeper-dev mailing list archives

Site index · List index
Message view « Date » · « Thread »
Top « Date » · « Thread »
From Apache Jenkins Server <jenk...@builds.apache.org>
Subject Build failed in Jenkins: zookeeper-master-maven-jdk12 #246
Date Mon, 25 Nov 2019 15:28:58 GMT
See <https://builds.apache.org/job/zookeeper-master-maven-jdk12/246/display/redirect?page=changes>

Changes:

[enrico.olivelli] ZOOKEEPER-3546 - Allow optional deletion of never used Container Nodes


------------------------------------------
[...truncated 417.96 KB...]
     [exec] /bin/bash ./libtool  --tag=CC   --mode=link gcc -Wall -Werror -Wdeclaration-after-statement  -g -O2 -D_GNU_SOURCE -no-undefined -version-info 2  -lssl -lcrypto -export-symbols-regex '(zoo_|zookeeper_|zhandle|Z|format_log_message|log_message|logLevel|deallocate_|allocate_|zerror|is_unrecoverable)'  -o libzookeeper_st.la -rpath <https://builds.apache.org/job/zookeeper-master-maven-jdk12/ws/zookeeper-client/zookeeper-client-c/target/c/lib>  libzkst.la libhashtable.la 
     [exec] libtool: link: /usr/bin/nm -B   ./.libs/libzkst.a ./.libs/libhashtable.a | sed -n -e 's/^.*[	 ]\([ABCDGIRSTW][ABCDGIRSTW]*\)[	 ][	 ]*\([_A-Za-z][_A-Za-z0-9]*\)$/\1 \2 \2/p' | sed '/ __gnu_lto/d' | /bin/sed 's/.* //' | sort | uniq > .libs/libzookeeper_st.exp
     [exec] libtool: link: /bin/grep -E -e "(zoo_|zookeeper_|zhandle|Z|format_log_message|log_message|logLevel|deallocate_|allocate_|zerror|is_unrecoverable)" ".libs/libzookeeper_st.exp" > ".libs/libzookeeper_st.expT"
     [exec] libtool: link: mv -f ".libs/libzookeeper_st.expT" ".libs/libzookeeper_st.exp"
     [exec] libtool: link: echo "{ global:" > .libs/libzookeeper_st.ver
     [exec] libtool: link:  cat .libs/libzookeeper_st.exp | sed -e "s/\(.*\)/\1;/" >> .libs/libzookeeper_st.ver
     [exec] libtool: link:  echo "local: *; };" >> .libs/libzookeeper_st.ver
     [exec] libtool: link:  gcc -shared  -fPIC -DPIC  -Wl,--whole-archive ./.libs/libzkst.a ./.libs/libhashtable.a -Wl,--no-whole-archive  -lssl -lcrypto -lm -lrt  -g -O2   -Wl,-soname -Wl,libzookeeper_st.so.2 -Wl,-version-script -Wl,.libs/libzookeeper_st.ver -o .libs/libzookeeper_st.so.2.0.0
     [exec] libtool: link: (cd ".libs" && rm -f "libzookeeper_st.so.2" && ln -s "libzookeeper_st.so.2.0.0" "libzookeeper_st.so.2")
     [exec] libtool: link: (cd ".libs" && rm -f "libzookeeper_st.so" && ln -s "libzookeeper_st.so.2.0.0" "libzookeeper_st.so")
     [exec] libtool: link: (cd .libs/libzookeeper_st.lax/libzkst.a && ar x "<https://builds.apache.org/job/zookeeper-master-maven-jdk12/ws/zookeeper-client/zookeeper-client-c/target/c/./.libs/libzkst.a")>
     [exec] ar: `u' modifier ignored since `D' is the default (see `U')
     [exec] libtool: link: (cd .libs/libzookeeper_st.lax/libhashtable.a && ar x "<https://builds.apache.org/job/zookeeper-master-maven-jdk12/ws/zookeeper-client/zookeeper-client-c/target/c/./.libs/libhashtable.a")>
     [exec] libtool: link: ar cru .libs/libzookeeper_st.a   .libs/libzookeeper_st.lax/libzkst.a/addrvec.o .libs/libzookeeper_st.lax/libzkst.a/recordio.o .libs/libzookeeper_st.lax/libzkst.a/st_adaptor.o .libs/libzookeeper_st.lax/libzkst.a/zk_hashtable.o .libs/libzookeeper_st.lax/libzkst.a/zk_log.o .libs/libzookeeper_st.lax/libzkst.a/zookeeper.jute.o .libs/libzookeeper_st.lax/libzkst.a/zookeeper.o  .libs/libzookeeper_st.lax/libhashtable.a/hashtable.o .libs/libzookeeper_st.lax/libhashtable.a/hashtable_itr.o 
     [exec] libtool: link: ranlib .libs/libzookeeper_st.a
     [exec] libtool: link: rm -fr .libs/libzookeeper_st.lax
     [exec] libtool: link: ( cd ".libs" && rm -f "libzookeeper_st.la" && ln -s "../libzookeeper_st.la" "libzookeeper_st.la" )
     [exec] /bin/bash ./libtool  --tag=CC   --mode=compile gcc -DHAVE_CONFIG_H -I. -I<https://builds.apache.org/job/zookeeper-master-maven-jdk12/ws/zookeeper-client/zookeeper-client-c>  -I<https://builds.apache.org/job/zookeeper-master-maven-jdk12/ws/zookeeper-client/zookeeper-client-c/include> -I<https://builds.apache.org/job/zookeeper-master-maven-jdk12/ws/zookeeper-client/zookeeper-client-c/tests> -I<https://builds.apache.org/job/zookeeper-master-maven-jdk12/ws/zookeeper-client/zookeeper-client-c/generated>  -DHAVE_OPENSSL_H -I/usr/include/openssl/  -DTHREADED -g -O2 -D_GNU_SOURCE -MT libzkmt_la-zookeeper.lo -MD -MP -MF .deps/libzkmt_la-zookeeper.Tpo -c -o libzkmt_la-zookeeper.lo `test -f 'src/zookeeper.c' || echo '<https://builds.apache.org/job/zookeeper-master-maven-jdk12/ws/zookeeper-client/zookeeper-client-c/'`src/zookeeper.c>
     [exec] libtool: compile:  gcc -DHAVE_CONFIG_H -I. -I<https://builds.apache.org/job/zookeeper-master-maven-jdk12/ws/zookeeper-client/zookeeper-client-c> -I<https://builds.apache.org/job/zookeeper-master-maven-jdk12/ws/zookeeper-client/zookeeper-client-c/include> -I<https://builds.apache.org/job/zookeeper-master-maven-jdk12/ws/zookeeper-client/zookeeper-client-c/tests> -I<https://builds.apache.org/job/zookeeper-master-maven-jdk12/ws/zookeeper-client/zookeeper-client-c/generated> -DHAVE_OPENSSL_H -I/usr/include/openssl/ -DTHREADED -g -O2 -D_GNU_SOURCE -MT libzkmt_la-zookeeper.lo -MD -MP -MF .deps/libzkmt_la-zookeeper.Tpo -c <https://builds.apache.org/job/zookeeper-master-maven-jdk12/ws/zookeeper-client/zookeeper-client-c/src/zookeeper.c>  -fPIC -DPIC -o .libs/libzkmt_la-zookeeper.o
     [exec] libtool: compile:  gcc -DHAVE_CONFIG_H -I. -I<https://builds.apache.org/job/zookeeper-master-maven-jdk12/ws/zookeeper-client/zookeeper-client-c> -I<https://builds.apache.org/job/zookeeper-master-maven-jdk12/ws/zookeeper-client/zookeeper-client-c/include> -I<https://builds.apache.org/job/zookeeper-master-maven-jdk12/ws/zookeeper-client/zookeeper-client-c/tests> -I<https://builds.apache.org/job/zookeeper-master-maven-jdk12/ws/zookeeper-client/zookeeper-client-c/generated> -DHAVE_OPENSSL_H -I/usr/include/openssl/ -DTHREADED -g -O2 -D_GNU_SOURCE -MT libzkmt_la-zookeeper.lo -MD -MP -MF .deps/libzkmt_la-zookeeper.Tpo -c <https://builds.apache.org/job/zookeeper-master-maven-jdk12/ws/zookeeper-client/zookeeper-client-c/src/zookeeper.c> -o libzkmt_la-zookeeper.o >/dev/null 2>&1
     [exec] mv -f .deps/libzkmt_la-zookeeper.Tpo .deps/libzkmt_la-zookeeper.Plo
     [exec] /bin/bash ./libtool  --tag=CC   --mode=compile gcc -DHAVE_CONFIG_H -I. -I<https://builds.apache.org/job/zookeeper-master-maven-jdk12/ws/zookeeper-client/zookeeper-client-c>  -I<https://builds.apache.org/job/zookeeper-master-maven-jdk12/ws/zookeeper-client/zookeeper-client-c/include> -I<https://builds.apache.org/job/zookeeper-master-maven-jdk12/ws/zookeeper-client/zookeeper-client-c/tests> -I<https://builds.apache.org/job/zookeeper-master-maven-jdk12/ws/zookeeper-client/zookeeper-client-c/generated>  -DHAVE_OPENSSL_H -I/usr/include/openssl/  -DTHREADED -g -O2 -D_GNU_SOURCE -MT libzkmt_la-recordio.lo -MD -MP -MF .deps/libzkmt_la-recordio.Tpo -c -o libzkmt_la-recordio.lo `test -f 'src/recordio.c' || echo '<https://builds.apache.org/job/zookeeper-master-maven-jdk12/ws/zookeeper-client/zookeeper-client-c/'`src/recordio.c>
     [exec] libtool: compile:  gcc -DHAVE_CONFIG_H -I. -I<https://builds.apache.org/job/zookeeper-master-maven-jdk12/ws/zookeeper-client/zookeeper-client-c> -I<https://builds.apache.org/job/zookeeper-master-maven-jdk12/ws/zookeeper-client/zookeeper-client-c/include> -I<https://builds.apache.org/job/zookeeper-master-maven-jdk12/ws/zookeeper-client/zookeeper-client-c/tests> -I<https://builds.apache.org/job/zookeeper-master-maven-jdk12/ws/zookeeper-client/zookeeper-client-c/generated> -DHAVE_OPENSSL_H -I/usr/include/openssl/ -DTHREADED -g -O2 -D_GNU_SOURCE -MT libzkmt_la-recordio.lo -MD -MP -MF .deps/libzkmt_la-recordio.Tpo -c <https://builds.apache.org/job/zookeeper-master-maven-jdk12/ws/zookeeper-client/zookeeper-client-c/src/recordio.c>  -fPIC -DPIC -o .libs/libzkmt_la-recordio.o
     [exec] libtool: compile:  gcc -DHAVE_CONFIG_H -I. -I<https://builds.apache.org/job/zookeeper-master-maven-jdk12/ws/zookeeper-client/zookeeper-client-c> -I<https://builds.apache.org/job/zookeeper-master-maven-jdk12/ws/zookeeper-client/zookeeper-client-c/include> -I<https://builds.apache.org/job/zookeeper-master-maven-jdk12/ws/zookeeper-client/zookeeper-client-c/tests> -I<https://builds.apache.org/job/zookeeper-master-maven-jdk12/ws/zookeeper-client/zookeeper-client-c/generated> -DHAVE_OPENSSL_H -I/usr/include/openssl/ -DTHREADED -g -O2 -D_GNU_SOURCE -MT libzkmt_la-recordio.lo -MD -MP -MF .deps/libzkmt_la-recordio.Tpo -c <https://builds.apache.org/job/zookeeper-master-maven-jdk12/ws/zookeeper-client/zookeeper-client-c/src/recordio.c> -o libzkmt_la-recordio.o >/dev/null 2>&1
     [exec] mv -f .deps/libzkmt_la-recordio.Tpo .deps/libzkmt_la-recordio.Plo
     [exec] /bin/bash ./libtool  --tag=CC   --mode=compile gcc -DHAVE_CONFIG_H -I. -I<https://builds.apache.org/job/zookeeper-master-maven-jdk12/ws/zookeeper-client/zookeeper-client-c>  -I<https://builds.apache.org/job/zookeeper-master-maven-jdk12/ws/zookeeper-client/zookeeper-client-c/include> -I<https://builds.apache.org/job/zookeeper-master-maven-jdk12/ws/zookeeper-client/zookeeper-client-c/tests> -I<https://builds.apache.org/job/zookeeper-master-maven-jdk12/ws/zookeeper-client/zookeeper-client-c/generated>  -DHAVE_OPENSSL_H -I/usr/include/openssl/  -DTHREADED -g -O2 -D_GNU_SOURCE -MT libzkmt_la-zookeeper.jute.lo -MD -MP -MF .deps/libzkmt_la-zookeeper.jute.Tpo -c -o libzkmt_la-zookeeper.jute.lo `test -f 'generated/zookeeper.jute.c' || echo '<https://builds.apache.org/job/zookeeper-master-maven-jdk12/ws/zookeeper-client/zookeeper-client-c/'`generated/zookeeper.jute.c>
     [exec] libtool: compile:  gcc -DHAVE_CONFIG_H -I. -I<https://builds.apache.org/job/zookeeper-master-maven-jdk12/ws/zookeeper-client/zookeeper-client-c> -I<https://builds.apache.org/job/zookeeper-master-maven-jdk12/ws/zookeeper-client/zookeeper-client-c/include> -I<https://builds.apache.org/job/zookeeper-master-maven-jdk12/ws/zookeeper-client/zookeeper-client-c/tests> -I<https://builds.apache.org/job/zookeeper-master-maven-jdk12/ws/zookeeper-client/zookeeper-client-c/generated> -DHAVE_OPENSSL_H -I/usr/include/openssl/ -DTHREADED -g -O2 -D_GNU_SOURCE -MT libzkmt_la-zookeeper.jute.lo -MD -MP -MF .deps/libzkmt_la-zookeeper.jute.Tpo -c <https://builds.apache.org/job/zookeeper-master-maven-jdk12/ws/zookeeper-client/zookeeper-client-c/generated/zookeeper.jute.c>  -fPIC -DPIC -o .libs/libzkmt_la-zookeeper.jute.o
     [exec] libtool: compile:  gcc -DHAVE_CONFIG_H -I. -I<https://builds.apache.org/job/zookeeper-master-maven-jdk12/ws/zookeeper-client/zookeeper-client-c> -I<https://builds.apache.org/job/zookeeper-master-maven-jdk12/ws/zookeeper-client/zookeeper-client-c/include> -I<https://builds.apache.org/job/zookeeper-master-maven-jdk12/ws/zookeeper-client/zookeeper-client-c/tests> -I<https://builds.apache.org/job/zookeeper-master-maven-jdk12/ws/zookeeper-client/zookeeper-client-c/generated> -DHAVE_OPENSSL_H -I/usr/include/openssl/ -DTHREADED -g -O2 -D_GNU_SOURCE -MT libzkmt_la-zookeeper.jute.lo -MD -MP -MF .deps/libzkmt_la-zookeeper.jute.Tpo -c <https://builds.apache.org/job/zookeeper-master-maven-jdk12/ws/zookeeper-client/zookeeper-client-c/generated/zookeeper.jute.c> -o libzkmt_la-zookeeper.jute.o >/dev/null 2>&1
     [exec] mv -f .deps/libzkmt_la-zookeeper.jute.Tpo .deps/libzkmt_la-zookeeper.jute.Plo
     [exec] /bin/bash ./libtool  --tag=CC   --mode=compile gcc -DHAVE_CONFIG_H -I. -I<https://builds.apache.org/job/zookeeper-master-maven-jdk12/ws/zookeeper-client/zookeeper-client-c>  -I<https://builds.apache.org/job/zookeeper-master-maven-jdk12/ws/zookeeper-client/zookeeper-client-c/include> -I<https://builds.apache.org/job/zookeeper-master-maven-jdk12/ws/zookeeper-client/zookeeper-client-c/tests> -I<https://builds.apache.org/job/zookeeper-master-maven-jdk12/ws/zookeeper-client/zookeeper-client-c/generated>  -DHAVE_OPENSSL_H -I/usr/include/openssl/  -DTHREADED -g -O2 -D_GNU_SOURCE -MT libzkmt_la-zk_log.lo -MD -MP -MF .deps/libzkmt_la-zk_log.Tpo -c -o libzkmt_la-zk_log.lo `test -f 'src/zk_log.c' || echo '<https://builds.apache.org/job/zookeeper-master-maven-jdk12/ws/zookeeper-client/zookeeper-client-c/'`src/zk_log.c>
     [exec] libtool: compile:  gcc -DHAVE_CONFIG_H -I. -I<https://builds.apache.org/job/zookeeper-master-maven-jdk12/ws/zookeeper-client/zookeeper-client-c> -I<https://builds.apache.org/job/zookeeper-master-maven-jdk12/ws/zookeeper-client/zookeeper-client-c/include> -I<https://builds.apache.org/job/zookeeper-master-maven-jdk12/ws/zookeeper-client/zookeeper-client-c/tests> -I<https://builds.apache.org/job/zookeeper-master-maven-jdk12/ws/zookeeper-client/zookeeper-client-c/generated> -DHAVE_OPENSSL_H -I/usr/include/openssl/ -DTHREADED -g -O2 -D_GNU_SOURCE -MT libzkmt_la-zk_log.lo -MD -MP -MF .deps/libzkmt_la-zk_log.Tpo -c <https://builds.apache.org/job/zookeeper-master-maven-jdk12/ws/zookeeper-client/zookeeper-client-c/src/zk_log.c>  -fPIC -DPIC -o .libs/libzkmt_la-zk_log.o
     [exec] libtool: compile:  gcc -DHAVE_CONFIG_H -I. -I<https://builds.apache.org/job/zookeeper-master-maven-jdk12/ws/zookeeper-client/zookeeper-client-c> -I<https://builds.apache.org/job/zookeeper-master-maven-jdk12/ws/zookeeper-client/zookeeper-client-c/include> -I<https://builds.apache.org/job/zookeeper-master-maven-jdk12/ws/zookeeper-client/zookeeper-client-c/tests> -I<https://builds.apache.org/job/zookeeper-master-maven-jdk12/ws/zookeeper-client/zookeeper-client-c/generated> -DHAVE_OPENSSL_H -I/usr/include/openssl/ -DTHREADED -g -O2 -D_GNU_SOURCE -MT libzkmt_la-zk_log.lo -MD -MP -MF .deps/libzkmt_la-zk_log.Tpo -c <https://builds.apache.org/job/zookeeper-master-maven-jdk12/ws/zookeeper-client/zookeeper-client-c/src/zk_log.c> -o libzkmt_la-zk_log.o >/dev/null 2>&1
     [exec] mv -f .deps/libzkmt_la-zk_log.Tpo .deps/libzkmt_la-zk_log.Plo
     [exec] /bin/bash ./libtool  --tag=CC   --mode=compile gcc -DHAVE_CONFIG_H -I. -I<https://builds.apache.org/job/zookeeper-master-maven-jdk12/ws/zookeeper-client/zookeeper-client-c>  -I<https://builds.apache.org/job/zookeeper-master-maven-jdk12/ws/zookeeper-client/zookeeper-client-c/include> -I<https://builds.apache.org/job/zookeeper-master-maven-jdk12/ws/zookeeper-client/zookeeper-client-c/tests> -I<https://builds.apache.org/job/zookeeper-master-maven-jdk12/ws/zookeeper-client/zookeeper-client-c/generated>  -DHAVE_OPENSSL_H -I/usr/include/openssl/  -DTHREADED -g -O2 -D_GNU_SOURCE -MT libzkmt_la-zk_hashtable.lo -MD -MP -MF .deps/libzkmt_la-zk_hashtable.Tpo -c -o libzkmt_la-zk_hashtable.lo `test -f 'src/zk_hashtable.c' || echo '<https://builds.apache.org/job/zookeeper-master-maven-jdk12/ws/zookeeper-client/zookeeper-client-c/'`src/zk_hashtable.c>
     [exec] libtool: compile:  gcc -DHAVE_CONFIG_H -I. -I<https://builds.apache.org/job/zookeeper-master-maven-jdk12/ws/zookeeper-client/zookeeper-client-c> -I<https://builds.apache.org/job/zookeeper-master-maven-jdk12/ws/zookeeper-client/zookeeper-client-c/include> -I<https://builds.apache.org/job/zookeeper-master-maven-jdk12/ws/zookeeper-client/zookeeper-client-c/tests> -I<https://builds.apache.org/job/zookeeper-master-maven-jdk12/ws/zookeeper-client/zookeeper-client-c/generated> -DHAVE_OPENSSL_H -I/usr/include/openssl/ -DTHREADED -g -O2 -D_GNU_SOURCE -MT libzkmt_la-zk_hashtable.lo -MD -MP -MF .deps/libzkmt_la-zk_hashtable.Tpo -c <https://builds.apache.org/job/zookeeper-master-maven-jdk12/ws/zookeeper-client/zookeeper-client-c/src/zk_hashtable.c>  -fPIC -DPIC -o .libs/libzkmt_la-zk_hashtable.o
     [exec] libtool: compile:  gcc -DHAVE_CONFIG_H -I. -I<https://builds.apache.org/job/zookeeper-master-maven-jdk12/ws/zookeeper-client/zookeeper-client-c> -I<https://builds.apache.org/job/zookeeper-master-maven-jdk12/ws/zookeeper-client/zookeeper-client-c/include> -I<https://builds.apache.org/job/zookeeper-master-maven-jdk12/ws/zookeeper-client/zookeeper-client-c/tests> -I<https://builds.apache.org/job/zookeeper-master-maven-jdk12/ws/zookeeper-client/zookeeper-client-c/generated> -DHAVE_OPENSSL_H -I/usr/include/openssl/ -DTHREADED -g -O2 -D_GNU_SOURCE -MT libzkmt_la-zk_hashtable.lo -MD -MP -MF .deps/libzkmt_la-zk_hashtable.Tpo -c <https://builds.apache.org/job/zookeeper-master-maven-jdk12/ws/zookeeper-client/zookeeper-client-c/src/zk_hashtable.c> -o libzkmt_la-zk_hashtable.o >/dev/null 2>&1
     [exec] mv -f .deps/libzkmt_la-zk_hashtable.Tpo .deps/libzkmt_la-zk_hashtable.Plo
     [exec] /bin/bash ./libtool  --tag=CC   --mode=compile gcc -DHAVE_CONFIG_H -I. -I<https://builds.apache.org/job/zookeeper-master-maven-jdk12/ws/zookeeper-client/zookeeper-client-c>  -I<https://builds.apache.org/job/zookeeper-master-maven-jdk12/ws/zookeeper-client/zookeeper-client-c/include> -I<https://builds.apache.org/job/zookeeper-master-maven-jdk12/ws/zookeeper-client/zookeeper-client-c/tests> -I<https://builds.apache.org/job/zookeeper-master-maven-jdk12/ws/zookeeper-client/zookeeper-client-c/generated>  -DHAVE_OPENSSL_H -I/usr/include/openssl/  -DTHREADED -g -O2 -D_GNU_SOURCE -MT libzkmt_la-addrvec.lo -MD -MP -MF .deps/libzkmt_la-addrvec.Tpo -c -o libzkmt_la-addrvec.lo `test -f 'src/addrvec.c' || echo '<https://builds.apache.org/job/zookeeper-master-maven-jdk12/ws/zookeeper-client/zookeeper-client-c/'`src/addrvec.c>
     [exec] libtool: compile:  gcc -DHAVE_CONFIG_H -I. -I<https://builds.apache.org/job/zookeeper-master-maven-jdk12/ws/zookeeper-client/zookeeper-client-c> -I<https://builds.apache.org/job/zookeeper-master-maven-jdk12/ws/zookeeper-client/zookeeper-client-c/include> -I<https://builds.apache.org/job/zookeeper-master-maven-jdk12/ws/zookeeper-client/zookeeper-client-c/tests> -I<https://builds.apache.org/job/zookeeper-master-maven-jdk12/ws/zookeeper-client/zookeeper-client-c/generated> -DHAVE_OPENSSL_H -I/usr/include/openssl/ -DTHREADED -g -O2 -D_GNU_SOURCE -MT libzkmt_la-addrvec.lo -MD -MP -MF .deps/libzkmt_la-addrvec.Tpo -c <https://builds.apache.org/job/zookeeper-master-maven-jdk12/ws/zookeeper-client/zookeeper-client-c/src/addrvec.c>  -fPIC -DPIC -o .libs/libzkmt_la-addrvec.o
     [exec] libtool: compile:  gcc -DHAVE_CONFIG_H -I. -I<https://builds.apache.org/job/zookeeper-master-maven-jdk12/ws/zookeeper-client/zookeeper-client-c> -I<https://builds.apache.org/job/zookeeper-master-maven-jdk12/ws/zookeeper-client/zookeeper-client-c/include> -I<https://builds.apache.org/job/zookeeper-master-maven-jdk12/ws/zookeeper-client/zookeeper-client-c/tests> -I<https://builds.apache.org/job/zookeeper-master-maven-jdk12/ws/zookeeper-client/zookeeper-client-c/generated> -DHAVE_OPENSSL_H -I/usr/include/openssl/ -DTHREADED -g -O2 -D_GNU_SOURCE -MT libzkmt_la-addrvec.lo -MD -MP -MF .deps/libzkmt_la-addrvec.Tpo -c <https://builds.apache.org/job/zookeeper-master-maven-jdk12/ws/zookeeper-client/zookeeper-client-c/src/addrvec.c> -o libzkmt_la-addrvec.o >/dev/null 2>&1
     [exec] mv -f .deps/libzkmt_la-addrvec.Tpo .deps/libzkmt_la-addrvec.Plo
     [exec] /bin/bash ./libtool  --tag=CC   --mode=compile gcc -DHAVE_CONFIG_H -I. -I<https://builds.apache.org/job/zookeeper-master-maven-jdk12/ws/zookeeper-client/zookeeper-client-c>  -I<https://builds.apache.org/job/zookeeper-master-maven-jdk12/ws/zookeeper-client/zookeeper-client-c/include> -I<https://builds.apache.org/job/zookeeper-master-maven-jdk12/ws/zookeeper-client/zookeeper-client-c/tests> -I<https://builds.apache.org/job/zookeeper-master-maven-jdk12/ws/zookeeper-client/zookeeper-client-c/generated>  -DHAVE_OPENSSL_H -I/usr/include/openssl/  -DTHREADED -g -O2 -D_GNU_SOURCE -MT libzkmt_la-mt_adaptor.lo -MD -MP -MF .deps/libzkmt_la-mt_adaptor.Tpo -c -o libzkmt_la-mt_adaptor.lo `test -f 'src/mt_adaptor.c' || echo '<https://builds.apache.org/job/zookeeper-master-maven-jdk12/ws/zookeeper-client/zookeeper-client-c/'`src/mt_adaptor.c>
     [exec] libtool: compile:  gcc -DHAVE_CONFIG_H -I. -I<https://builds.apache.org/job/zookeeper-master-maven-jdk12/ws/zookeeper-client/zookeeper-client-c> -I<https://builds.apache.org/job/zookeeper-master-maven-jdk12/ws/zookeeper-client/zookeeper-client-c/include> -I<https://builds.apache.org/job/zookeeper-master-maven-jdk12/ws/zookeeper-client/zookeeper-client-c/tests> -I<https://builds.apache.org/job/zookeeper-master-maven-jdk12/ws/zookeeper-client/zookeeper-client-c/generated> -DHAVE_OPENSSL_H -I/usr/include/openssl/ -DTHREADED -g -O2 -D_GNU_SOURCE -MT libzkmt_la-mt_adaptor.lo -MD -MP -MF .deps/libzkmt_la-mt_adaptor.Tpo -c <https://builds.apache.org/job/zookeeper-master-maven-jdk12/ws/zookeeper-client/zookeeper-client-c/src/mt_adaptor.c>  -fPIC -DPIC -o .libs/libzkmt_la-mt_adaptor.o
     [exec] libtool: compile:  gcc -DHAVE_CONFIG_H -I. -I<https://builds.apache.org/job/zookeeper-master-maven-jdk12/ws/zookeeper-client/zookeeper-client-c> -I<https://builds.apache.org/job/zookeeper-master-maven-jdk12/ws/zookeeper-client/zookeeper-client-c/include> -I<https://builds.apache.org/job/zookeeper-master-maven-jdk12/ws/zookeeper-client/zookeeper-client-c/tests> -I<https://builds.apache.org/job/zookeeper-master-maven-jdk12/ws/zookeeper-client/zookeeper-client-c/generated> -DHAVE_OPENSSL_H -I/usr/include/openssl/ -DTHREADED -g -O2 -D_GNU_SOURCE -MT libzkmt_la-mt_adaptor.lo -MD -MP -MF .deps/libzkmt_la-mt_adaptor.Tpo -c <https://builds.apache.org/job/zookeeper-master-maven-jdk12/ws/zookeeper-client/zookeeper-client-c/src/mt_adaptor.c> -o libzkmt_la-mt_adaptor.o >/dev/null 2>&1
     [exec] mv -f .deps/libzkmt_la-mt_adaptor.Tpo .deps/libzkmt_la-mt_adaptor.Plo
     [exec] /bin/bash ./libtool  --tag=CC   --mode=link gcc -DTHREADED -g -O2 -D_GNU_SOURCE   -o libzkmt.la  libzkmt_la-zookeeper.lo libzkmt_la-recordio.lo libzkmt_la-zookeeper.jute.lo libzkmt_la-zk_log.lo libzkmt_la-zk_hashtable.lo libzkmt_la-addrvec.lo libzkmt_la-mt_adaptor.lo -lm -lrt  
     [exec] ar: `u' modifier ignored since `D' is the default (see `U')
     [exec] libtool: link: ar cru .libs/libzkmt.a .libs/libzkmt_la-zookeeper.o .libs/libzkmt_la-recordio.o .libs/libzkmt_la-zookeeper.jute.o .libs/libzkmt_la-zk_log.o .libs/libzkmt_la-zk_hashtable.o .libs/libzkmt_la-addrvec.o .libs/libzkmt_la-mt_adaptor.o 
     [exec] libtool: link: ranlib .libs/libzkmt.a
     [exec] libtool: link: ( cd ".libs" && rm -f "libzkmt.la" && ln -s "../libzkmt.la" "libzkmt.la" )
     [exec] /bin/bash ./libtool  --tag=CC   --mode=link gcc -Wall -Werror -Wdeclaration-after-statement  -g -O2 -D_GNU_SOURCE -no-undefined -version-info 2  -lssl -lcrypto -export-symbols-regex '(zoo_|zookeeper_|zhandle|Z|format_log_message|log_message|logLevel|deallocate_|allocate_|zerror|is_unrecoverable)'  -o libzookeeper_mt.la -rpath <https://builds.apache.org/job/zookeeper-master-maven-jdk12/ws/zookeeper-client/zookeeper-client-c/target/c/lib>  libzkmt.la libhashtable.la -lpthread 
     [exec] libtool: link: /usr/bin/nm -B   ./.libs/libzkmt.a ./.libs/libhashtable.a | sed -n -e 's/^.*[	 ]\([ABCDGIRSTW][ABCDGIRSTW]*\)[	 ][	 ]*\([_A-Za-z][_A-Za-z0-9]*\)$/\1 \2 \2/p' | sed '/ __gnu_lto/d' | /bin/sed 's/.* //' | sort | uniq > .libs/libzookeeper_mt.exp
     [exec] libtool: link: /bin/grep -E -e "(zoo_|zookeeper_|zhandle|Z|format_log_message|log_message|logLevel|deallocate_|allocate_|zerror|is_unrecoverable)" ".libs/libzookeeper_mt.exp" > ".libs/libzookeeper_mt.expT"
     [exec] libtool: link: mv -f ".libs/libzookeeper_mt.expT" ".libs/libzookeeper_mt.exp"
     [exec] libtool: link: echo "{ global:" > .libs/libzookeeper_mt.ver
     [exec] libtool: link:  cat .libs/libzookeeper_mt.exp | sed -e "s/\(.*\)/\1;/" >> .libs/libzookeeper_mt.ver
     [exec] libtool: link:  echo "local: *; };" >> .libs/libzookeeper_mt.ver
     [exec] libtool: link:  gcc -shared  -fPIC -DPIC  -Wl,--whole-archive ./.libs/libzkmt.a ./.libs/libhashtable.a -Wl,--no-whole-archive  -lssl -lcrypto -lm -lrt -lpthread  -g -O2   -Wl,-soname -Wl,libzookeeper_mt.so.2 -Wl,-version-script -Wl,.libs/libzookeeper_mt.ver -o .libs/libzookeeper_mt.so.2.0.0
     [exec] libtool: link: (cd ".libs" && rm -f "libzookeeper_mt.so.2" && ln -s "libzookeeper_mt.so.2.0.0" "libzookeeper_mt.so.2")
     [exec] libtool: link: (cd ".libs" && rm -f "libzookeeper_mt.so" && ln -s "libzookeeper_mt.so.2.0.0" "libzookeeper_mt.so")
     [exec] libtool: link: (cd .libs/libzookeeper_mt.lax/libzkmt.a && ar x "<https://builds.apache.org/job/zookeeper-master-maven-jdk12/ws/zookeeper-client/zookeeper-client-c/target/c/./.libs/libzkmt.a")>
     [exec] libtool: link: (cd .libs/libzookeeper_mt.lax/libhashtable.a && ar x "<https://builds.apache.org/job/zookeeper-master-maven-jdk12/ws/zookeeper-client/zookeeper-client-c/target/c/./.libs/libhashtable.a")>
     [exec] ar: `u' modifier ignored since `D' is the default (see `U')
     [exec] libtool: link: ar cru .libs/libzookeeper_mt.a   .libs/libzookeeper_mt.lax/libzkmt.a/libzkmt_la-addrvec.o .libs/libzookeeper_mt.lax/libzkmt.a/libzkmt_la-mt_adaptor.o .libs/libzookeeper_mt.lax/libzkmt.a/libzkmt_la-recordio.o .libs/libzookeeper_mt.lax/libzkmt.a/libzkmt_la-zk_hashtable.o .libs/libzookeeper_mt.lax/libzkmt.a/libzkmt_la-zk_log.o .libs/libzookeeper_mt.lax/libzkmt.a/libzkmt_la-zookeeper.jute.o .libs/libzookeeper_mt.lax/libzkmt.a/libzkmt_la-zookeeper.o  .libs/libzookeeper_mt.lax/libhashtable.a/hashtable.o .libs/libzookeeper_mt.lax/libhashtable.a/hashtable_itr.o 
     [exec] libtool: link: ranlib .libs/libzookeeper_mt.a
     [exec] libtool: link: rm -fr .libs/libzookeeper_mt.lax
     [exec] libtool: link: ( cd ".libs" && rm -f "libzookeeper_mt.la" && ln -s "../libzookeeper_mt.la" "libzookeeper_mt.la" )
     [exec] gcc -DHAVE_CONFIG_H -I. -I<https://builds.apache.org/job/zookeeper-master-maven-jdk12/ws/zookeeper-client/zookeeper-client-c>  -I<https://builds.apache.org/job/zookeeper-master-maven-jdk12/ws/zookeeper-client/zookeeper-client-c/include> -I<https://builds.apache.org/job/zookeeper-master-maven-jdk12/ws/zookeeper-client/zookeeper-client-c/tests> -I<https://builds.apache.org/job/zookeeper-master-maven-jdk12/ws/zookeeper-client/zookeeper-client-c/generated>  -DHAVE_OPENSSL_H -I/usr/include/openssl/  -Wall -Werror -Wdeclaration-after-statement  -g -O2 -D_GNU_SOURCE -MT cli.o -MD -MP -MF .deps/cli.Tpo -c -o cli.o `test -f 'src/cli.c' || echo '<https://builds.apache.org/job/zookeeper-master-maven-jdk12/ws/zookeeper-client/zookeeper-client-c/'`src/cli.c>
     [exec] mv -f .deps/cli.Tpo .deps/cli.Po
     [exec] /bin/bash ./libtool  --tag=CC   --mode=link gcc -Wall -Werror -Wdeclaration-after-statement  -g -O2 -D_GNU_SOURCE   -o cli_st cli.o libzookeeper_st.la 
     [exec] libtool: link: gcc -Wall -Werror -Wdeclaration-after-statement -g -O2 -D_GNU_SOURCE -o .libs/cli_st cli.o  ./.libs/libzookeeper_st.so -Wl,-rpath -Wl,<https://builds.apache.org/job/zookeeper-master-maven-jdk12/ws/zookeeper-client/zookeeper-client-c/target/c/lib>
     [exec] gcc -DHAVE_CONFIG_H -I. -I<https://builds.apache.org/job/zookeeper-master-maven-jdk12/ws/zookeeper-client/zookeeper-client-c>  -I<https://builds.apache.org/job/zookeeper-master-maven-jdk12/ws/zookeeper-client/zookeeper-client-c/include> -I<https://builds.apache.org/job/zookeeper-master-maven-jdk12/ws/zookeeper-client/zookeeper-client-c/tests> -I<https://builds.apache.org/job/zookeeper-master-maven-jdk12/ws/zookeeper-client/zookeeper-client-c/generated>  -DHAVE_OPENSSL_H -I/usr/include/openssl/  -DTHREADED -g -O2 -D_GNU_SOURCE -MT cli_mt-cli.o -MD -MP -MF .deps/cli_mt-cli.Tpo -c -o cli_mt-cli.o `test -f 'src/cli.c' || echo '<https://builds.apache.org/job/zookeeper-master-maven-jdk12/ws/zookeeper-client/zookeeper-client-c/'`src/cli.c>
     [exec] mv -f .deps/cli_mt-cli.Tpo .deps/cli_mt-cli.Po
     [exec] /bin/bash ./libtool  --tag=CC   --mode=link gcc -DTHREADED -g -O2 -D_GNU_SOURCE   -o cli_mt cli_mt-cli.o libzookeeper_mt.la 
     [exec] libtool: link: gcc -DTHREADED -g -O2 -D_GNU_SOURCE -o .libs/cli_mt cli_mt-cli.o  ./.libs/libzookeeper_mt.so -Wl,-rpath -Wl,<https://builds.apache.org/job/zookeeper-master-maven-jdk12/ws/zookeeper-client/zookeeper-client-c/target/c/lib>
     [exec] gcc -DHAVE_CONFIG_H -I. -I<https://builds.apache.org/job/zookeeper-master-maven-jdk12/ws/zookeeper-client/zookeeper-client-c>  -I<https://builds.apache.org/job/zookeeper-master-maven-jdk12/ws/zookeeper-client/zookeeper-client-c/include> -I<https://builds.apache.org/job/zookeeper-master-maven-jdk12/ws/zookeeper-client/zookeeper-client-c/tests> -I<https://builds.apache.org/job/zookeeper-master-maven-jdk12/ws/zookeeper-client/zookeeper-client-c/generated>  -DHAVE_OPENSSL_H -I/usr/include/openssl/  -DTHREADED -g -O2 -D_GNU_SOURCE -MT load_gen-load_gen.o -MD -MP -MF .deps/load_gen-load_gen.Tpo -c -o load_gen-load_gen.o `test -f 'src/load_gen.c' || echo '<https://builds.apache.org/job/zookeeper-master-maven-jdk12/ws/zookeeper-client/zookeeper-client-c/'`src/load_gen.c>
     [exec] mv -f .deps/load_gen-load_gen.Tpo .deps/load_gen-load_gen.Po
     [exec] /bin/bash ./libtool  --tag=CC   --mode=link gcc -DTHREADED -g -O2 -D_GNU_SOURCE   -o load_gen load_gen-load_gen.o libzookeeper_mt.la 
     [exec] libtool: link: gcc -DTHREADED -g -O2 -D_GNU_SOURCE -o .libs/load_gen load_gen-load_gen.o  ./.libs/libzookeeper_mt.so -Wl,-rpath -Wl,<https://builds.apache.org/job/zookeeper-master-maven-jdk12/ws/zookeeper-client/zookeeper-client-c/target/c/lib>
     [exec] make[1]: Entering directory '<https://builds.apache.org/job/zookeeper-master-maven-jdk12/ws/zookeeper-client/zookeeper-client-c/target/c'>
     [exec]  /bin/mkdir -p '<https://builds.apache.org/job/zookeeper-master-maven-jdk12/ws/zookeeper-client/zookeeper-client-c/target/c/lib'>
     [exec]  /bin/bash ./libtool   --mode=install /usr/bin/install -c   libzookeeper_st.la libzookeeper_mt.la '<https://builds.apache.org/job/zookeeper-master-maven-jdk12/ws/zookeeper-client/zookeeper-client-c/target/c/lib'>
     [exec] libtool: install: /usr/bin/install -c .libs/libzookeeper_st.so.2.0.0 <https://builds.apache.org/job/zookeeper-master-maven-jdk12/ws/zookeeper-client/zookeeper-client-c/target/c/lib/libzookeeper_st.so.2.0.0>
     [exec] libtool: install: (cd <https://builds.apache.org/job/zookeeper-master-maven-jdk12/ws/zookeeper-client/zookeeper-client-c/target/c/lib> && { ln -s -f libzookeeper_st.so.2.0.0 libzookeeper_st.so.2 || { rm -f libzookeeper_st.so.2 && ln -s libzookeeper_st.so.2.0.0 libzookeeper_st.so.2; }; })
     [exec] libtool: install: (cd <https://builds.apache.org/job/zookeeper-master-maven-jdk12/ws/zookeeper-client/zookeeper-client-c/target/c/lib> && { ln -s -f libzookeeper_st.so.2.0.0 libzookeeper_st.so || { rm -f libzookeeper_st.so && ln -s libzookeeper_st.so.2.0.0 libzookeeper_st.so; }; })
     [exec] libtool: install: /usr/bin/install -c .libs/libzookeeper_st.lai <https://builds.apache.org/job/zookeeper-master-maven-jdk12/ws/zookeeper-client/zookeeper-client-c/target/c/lib/libzookeeper_st.la>
     [exec] libtool: install: /usr/bin/install -c .libs/libzookeeper_mt.so.2.0.0 <https://builds.apache.org/job/zookeeper-master-maven-jdk12/ws/zookeeper-client/zookeeper-client-c/target/c/lib/libzookeeper_mt.so.2.0.0>
     [exec] libtool: install: (cd <https://builds.apache.org/job/zookeeper-master-maven-jdk12/ws/zookeeper-client/zookeeper-client-c/target/c/lib> && { ln -s -f libzookeeper_mt.so.2.0.0 libzookeeper_mt.so.2 || { rm -f libzookeeper_mt.so.2 && ln -s libzookeeper_mt.so.2.0.0 libzookeeper_mt.so.2; }; })
     [exec] libtool: install: (cd <https://builds.apache.org/job/zookeeper-master-maven-jdk12/ws/zookeeper-client/zookeeper-client-c/target/c/lib> && { ln -s -f libzookeeper_mt.so.2.0.0 libzookeeper_mt.so || { rm -f libzookeeper_mt.so && ln -s libzookeeper_mt.so.2.0.0 libzookeeper_mt.so; }; })
     [exec] libtool: install: /usr/bin/install -c .libs/libzookeeper_mt.lai <https://builds.apache.org/job/zookeeper-master-maven-jdk12/ws/zookeeper-client/zookeeper-client-c/target/c/lib/libzookeeper_mt.la>
     [exec] libtool: install: /usr/bin/install -c .libs/libzookeeper_st.a <https://builds.apache.org/job/zookeeper-master-maven-jdk12/ws/zookeeper-client/zookeeper-client-c/target/c/lib/libzookeeper_st.a>
     [exec] libtool: install: chmod 644 <https://builds.apache.org/job/zookeeper-master-maven-jdk12/ws/zookeeper-client/zookeeper-client-c/target/c/lib/libzookeeper_st.a>
     [exec] libtool: install: ranlib <https://builds.apache.org/job/zookeeper-master-maven-jdk12/ws/zookeeper-client/zookeeper-client-c/target/c/lib/libzookeeper_st.a>
     [exec] libtool: install: /usr/bin/install -c .libs/libzookeeper_mt.a <https://builds.apache.org/job/zookeeper-master-maven-jdk12/ws/zookeeper-client/zookeeper-client-c/target/c/lib/libzookeeper_mt.a>
     [exec] libtool: install: chmod 644 <https://builds.apache.org/job/zookeeper-master-maven-jdk12/ws/zookeeper-client/zookeeper-client-c/target/c/lib/libzookeeper_mt.a>
     [exec] libtool: install: ranlib <https://builds.apache.org/job/zookeeper-master-maven-jdk12/ws/zookeeper-client/zookeeper-client-c/target/c/lib/libzookeeper_mt.a>
     [exec] libtool: finish: PATH="/home/jenkins/tools/maven/latest3/bin:/home/jenkins/tools/java/latest12/bin:/usr/local/sbin:/usr/local/bin:/usr/sbin:/usr/bin:/sbin:/bin:/snap/bin:<https://builds.apache.org/job/zookeeper-master-maven-jdk12/ws/zookeeper-client/zookeeper-client-c>:/sbin" ldconfig -n <https://builds.apache.org/job/zookeeper-master-maven-jdk12/ws/zookeeper-client/zookeeper-client-c/target/c/lib>
     [exec] ----------------------------------------------------------------------
     [exec] Libraries have been installed in:
     [exec]    <https://builds.apache.org/job/zookeeper-master-maven-jdk12/ws/zookeeper-client/zookeeper-client-c/target/c/lib>
     [exec] 
     [exec] If you ever happen to want to link against installed libraries
     [exec] in a given directory, LIBDIR, you must either use libtool, and
     [exec] specify the full pathname of the library, or use the '-LLIBDIR'
     [exec] flag during linking and do at least one of the following:
     [exec]    - add LIBDIR to the 'LD_LIBRARY_PATH' environment variable
     [exec]      during execution
     [exec]    - add LIBDIR to the 'LD_RUN_PATH' environment variable
     [exec]      during linking
     [exec]    - use the '-Wl,-rpath -Wl,LIBDIR' linker flag
     [exec]    - have your system administrator add LIBDIR to '/etc/ld.so.conf'
     [exec] 
     [exec] See any operating system documentation about shared libraries for
     [exec] more information, such as the ld(1) and ld.so(8) manual pages.
     [exec] ----------------------------------------------------------------------
     [exec]  /bin/mkdir -p '<https://builds.apache.org/job/zookeeper-master-maven-jdk12/ws/zookeeper-client/zookeeper-client-c/target/c/bin'>
     [exec]   /bin/bash ./libtool   --mode=install /usr/bin/install -c cli_st cli_mt load_gen '<https://builds.apache.org/job/zookeeper-master-maven-jdk12/ws/zookeeper-client/zookeeper-client-c/target/c/bin'>
     [exec] libtool: install: /usr/bin/install -c .libs/cli_st <https://builds.apache.org/job/zookeeper-master-maven-jdk12/ws/zookeeper-client/zookeeper-client-c/target/c/bin/cli_st>
     [exec] libtool: install: /usr/bin/install -c .libs/cli_mt <https://builds.apache.org/job/zookeeper-master-maven-jdk12/ws/zookeeper-client/zookeeper-client-c/target/c/bin/cli_mt>
     [exec] libtool: install: /usr/bin/install -c .libs/load_gen <https://builds.apache.org/job/zookeeper-master-maven-jdk12/ws/zookeeper-client/zookeeper-client-c/target/c/bin/load_gen>
     [exec]  /bin/mkdir -p '<https://builds.apache.org/job/zookeeper-master-maven-jdk12/ws/zookeeper-client/zookeeper-client-c/target/c/include/zookeeper'>
     [exec]  /usr/bin/install -c -m 644 <https://builds.apache.org/job/zookeeper-master-maven-jdk12/ws/zookeeper-client/zookeeper-client-c/include/zookeeper.h> <https://builds.apache.org/job/zookeeper-master-maven-jdk12/ws/zookeeper-client/zookeeper-client-c/include/zookeeper_version.h> <https://builds.apache.org/job/zookeeper-master-maven-jdk12/ws/zookeeper-client/zookeeper-client-c/include/zookeeper_log.h> <https://builds.apache.org/job/zookeeper-master-maven-jdk12/ws/zookeeper-client/zookeeper-client-c/include/proto.h> <https://builds.apache.org/job/zookeeper-master-maven-jdk12/ws/zookeeper-client/zookeeper-client-c/include/recordio.h> <https://builds.apache.org/job/zookeeper-master-maven-jdk12/ws/zookeeper-client/zookeeper-client-c/generated/zookeeper.jute.h> '<https://builds.apache.org/job/zookeeper-master-maven-jdk12/ws/zookeeper-client/zookeeper-client-c/target/c/include/zookeeper'>
     [exec] make[1]: Leaving directory '<https://builds.apache.org/job/zookeeper-master-maven-jdk12/ws/zookeeper-client/zookeeper-client-c/target/c'>
[INFO] Executed tasks
[INFO] 
[INFO] --- maven-resources-plugin:2.7:testResources (default-testResources) @ zookeeper-client-c ---
[INFO] Using 'UTF-8' encoding to copy filtered resources.
[INFO] skip non existing resourceDirectory <https://builds.apache.org/job/zookeeper-master-maven-jdk12/ws/zookeeper-client/zookeeper-client-c/src/test/resources>
[INFO] Copying 3 resources
[INFO] 
[INFO] --- maven-compiler-plugin:3.8.0:testCompile (default-testCompile) @ zookeeper-client-c ---
[INFO] No sources to compile
[INFO] 
[INFO] --- maven-surefire-plugin:2.22.1:test (default-test) @ zookeeper-client-c ---
[JENKINS] Recording test results
[INFO] 
[INFO] --- maven-antrun-plugin:1.8:run (test-cppunit) @ zookeeper-client-c ---
[WARNING] Parameter tasks is deprecated, use target instead
[INFO] Executing tasks

main:
     [exec] make  zktest-st zktest-mt
     [exec] make[1]: Entering directory '<https://builds.apache.org/job/zookeeper-master-maven-jdk12/ws/zookeeper-client/zookeeper-client-c/target/c'>
     [exec] g++ -DHAVE_CONFIG_H -I. -I<https://builds.apache.org/job/zookeeper-master-maven-jdk12/ws/zookeeper-client/zookeeper-client-c>  -I<https://builds.apache.org/job/zookeeper-master-maven-jdk12/ws/zookeeper-client/zookeeper-client-c/include> -I<https://builds.apache.org/job/zookeeper-master-maven-jdk12/ws/zookeeper-client/zookeeper-client-c/tests> -I<https://builds.apache.org/job/zookeeper-master-maven-jdk12/ws/zookeeper-client/zookeeper-client-c/generated>  -DHAVE_OPENSSL_H -I/usr/include/openssl/  -DUSE_STATIC_LIB -DZKSERVER_CMD="\"<https://builds.apache.org/job/zookeeper-master-maven-jdk12/ws/zookeeper-client/zookeeper-client-c/../../zookeeper-client/zookeeper-client-c/tests/zkServer.sh\""> -DZOO_IPV6_ENABLED  -g -O2 -std=c++11 -MT zktest_st-TestDriver.o -MD -MP -MF .deps/zktest_st-TestDriver.Tpo -c -o zktest_st-TestDriver.o `test -f 'tests/TestDriver.cc' || echo '<https://builds.apache.org/job/zookeeper-master-maven-jdk12/ws/zookeeper-client/zookeeper-client-c/'`tests/TestDriver.cc>
     [exec] mv -f .deps/zktest_st-TestDriver.Tpo .deps/zktest_st-TestDriver.Po
     [exec] g++ -DHAVE_CONFIG_H -I. -I<https://builds.apache.org/job/zookeeper-master-maven-jdk12/ws/zookeeper-client/zookeeper-client-c>  -I<https://builds.apache.org/job/zookeeper-master-maven-jdk12/ws/zookeeper-client/zookeeper-client-c/include> -I<https://builds.apache.org/job/zookeeper-master-maven-jdk12/ws/zookeeper-client/zookeeper-client-c/tests> -I<https://builds.apache.org/job/zookeeper-master-maven-jdk12/ws/zookeeper-client/zookeeper-client-c/generated>  -DHAVE_OPENSSL_H -I/usr/include/openssl/  -DUSE_STATIC_LIB -DZKSERVER_CMD="\"<https://builds.apache.org/job/zookeeper-master-maven-jdk12/ws/zookeeper-client/zookeeper-client-c/../../zookeeper-client/zookeeper-client-c/tests/zkServer.sh\""> -DZOO_IPV6_ENABLED  -g -O2 -std=c++11 -MT zktest_st-LibCMocks.o -MD -MP -MF .deps/zktest_st-LibCMocks.Tpo -c -o zktest_st-LibCMocks.o `test -f 'tests/LibCMocks.cc' || echo '<https://builds.apache.org/job/zookeeper-master-maven-jdk12/ws/zookeeper-client/zookeeper-client-c/'`tests/LibCMocks.cc>
     [exec] mv -f .deps/zktest_st-LibCMocks.Tpo .deps/zktest_st-LibCMocks.Po
     [exec] g++ -DHAVE_CONFIG_H -I. -I<https://builds.apache.org/job/zookeeper-master-maven-jdk12/ws/zookeeper-client/zookeeper-client-c>  -I<https://builds.apache.org/job/zookeeper-master-maven-jdk12/ws/zookeeper-client/zookeeper-client-c/include> -I<https://builds.apache.org/job/zookeeper-master-maven-jdk12/ws/zookeeper-client/zookeeper-client-c/tests> -I<https://builds.apache.org/job/zookeeper-master-maven-jdk12/ws/zookeeper-client/zookeeper-client-c/generated>  -DHAVE_OPENSSL_H -I/usr/include/openssl/  -DUSE_STATIC_LIB -DZKSERVER_CMD="\"<https://builds.apache.org/job/zookeeper-master-maven-jdk12/ws/zookeeper-client/zookeeper-client-c/../../zookeeper-client/zookeeper-client-c/tests/zkServer.sh\""> -DZOO_IPV6_ENABLED  -g -O2 -std=c++11 -MT zktest_st-LibCSymTable.o -MD -MP -MF .deps/zktest_st-LibCSymTable.Tpo -c -o zktest_st-LibCSymTable.o `test -f 'tests/LibCSymTable.cc' || echo '<https://builds.apache.org/job/zookeeper-master-maven-jdk12/ws/zookeeper-client/zookeeper-client-c/'`tests/LibCSymTable.cc>
     [exec] mv -f .deps/zktest_st-LibCSymTable.Tpo .deps/zktest_st-LibCSymTable.Po
     [exec] g++ -DHAVE_CONFIG_H -I. -I<https://builds.apache.org/job/zookeeper-master-maven-jdk12/ws/zookeeper-client/zookeeper-client-c>  -I<https://builds.apache.org/job/zookeeper-master-maven-jdk12/ws/zookeeper-client/zookeeper-client-c/include> -I<https://builds.apache.org/job/zookeeper-master-maven-jdk12/ws/zookeeper-client/zookeeper-client-c/tests> -I<https://builds.apache.org/job/zookeeper-master-maven-jdk12/ws/zookeeper-client/zookeeper-client-c/generated>  -DHAVE_OPENSSL_H -I/usr/include/openssl/  -DUSE_STATIC_LIB -DZKSERVER_CMD="\"<https://builds.apache.org/job/zookeeper-master-maven-jdk12/ws/zookeeper-client/zookeeper-client-c/../../zookeeper-client/zookeeper-client-c/tests/zkServer.sh\""> -DZOO_IPV6_ENABLED  -g -O2 -std=c++11 -MT zktest_st-MocksBase.o -MD -MP -MF .deps/zktest_st-MocksBase.Tpo -c -o zktest_st-MocksBase.o `test -f 'tests/MocksBase.cc' || echo '<https://builds.apache.org/job/zookeeper-master-maven-jdk12/ws/zookeeper-client/zookeeper-client-c/'`tests/MocksBase.cc>
     [exec] mv -f .deps/zktest_st-MocksBase.Tpo .deps/zktest_st-MocksBase.Po
     [exec] g++ -DHAVE_CONFIG_H -I. -I<https://builds.apache.org/job/zookeeper-master-maven-jdk12/ws/zookeeper-client/zookeeper-client-c>  -I<https://builds.apache.org/job/zookeeper-master-maven-jdk12/ws/zookeeper-client/zookeeper-client-c/include> -I<https://builds.apache.org/job/zookeeper-master-maven-jdk12/ws/zookeeper-client/zookeeper-client-c/tests> -I<https://builds.apache.org/job/zookeeper-master-maven-jdk12/ws/zookeeper-client/zookeeper-client-c/generated>  -DHAVE_OPENSSL_H -I/usr/include/openssl/  -DUSE_STATIC_LIB -DZKSERVER_CMD="\"<https://builds.apache.org/job/zookeeper-master-maven-jdk12/ws/zookeeper-client/zookeeper-client-c/../../zookeeper-client/zookeeper-client-c/tests/zkServer.sh\""> -DZOO_IPV6_ENABLED  -g -O2 -std=c++11 -MT zktest_st-ZKMocks.o -MD -MP -MF .deps/zktest_st-ZKMocks.Tpo -c -o zktest_st-ZKMocks.o `test -f 'tests/ZKMocks.cc' || echo '<https://builds.apache.org/job/zookeeper-master-maven-jdk12/ws/zookeeper-client/zookeeper-client-c/'`tests/ZKMocks.cc>
     [exec] mv -f .deps/zktest_st-ZKMocks.Tpo .deps/zktest_st-ZKMocks.Po
     [exec] g++ -DHAVE_CONFIG_H -I. -I<https://builds.apache.org/job/zookeeper-master-maven-jdk12/ws/zookeeper-client/zookeeper-client-c>  -I<https://builds.apache.org/job/zookeeper-master-maven-jdk12/ws/zookeeper-client/zookeeper-client-c/include> -I<https://builds.apache.org/job/zookeeper-master-maven-jdk12/ws/zookeeper-client/zookeeper-client-c/tests> -I<https://builds.apache.org/job/zookeeper-master-maven-jdk12/ws/zookeeper-client/zookeeper-client-c/generated>  -DHAVE_OPENSSL_H -I/usr/include/openssl/  -DUSE_STATIC_LIB -DZKSERVER_CMD="\"<https://builds.apache.org/job/zookeeper-master-maven-jdk12/ws/zookeeper-client/zookeeper-client-c/../../zookeeper-client/zookeeper-client-c/tests/zkServer.sh\""> -DZOO_IPV6_ENABLED  -g -O2 -std=c++11 -MT zktest_st-Util.o -MD -MP -MF .deps/zktest_st-Util.Tpo -c -o zktest_st-Util.o `test -f 'tests/Util.cc' || echo '<https://builds.apache.org/job/zookeeper-master-maven-jdk12/ws/zookeeper-client/zookeeper-client-c/'`tests/Util.cc>
     [exec] mv -f .deps/zktest_st-Util.Tpo .deps/zktest_st-Util.Po
     [exec] g++ -DHAVE_CONFIG_H -I. -I<https://builds.apache.org/job/zookeeper-master-maven-jdk12/ws/zookeeper-client/zookeeper-client-c>  -I<https://builds.apache.org/job/zookeeper-master-maven-jdk12/ws/zookeeper-client/zookeeper-client-c/include> -I<https://builds.apache.org/job/zookeeper-master-maven-jdk12/ws/zookeeper-client/zookeeper-client-c/tests> -I<https://builds.apache.org/job/zookeeper-master-maven-jdk12/ws/zookeeper-client/zookeeper-client-c/generated>  -DHAVE_OPENSSL_H -I/usr/include/openssl/  -DUSE_STATIC_LIB -DZKSERVER_CMD="\"<https://builds.apache.org/job/zookeeper-master-maven-jdk12/ws/zookeeper-client/zookeeper-client-c/../../zookeeper-client/zookeeper-client-c/tests/zkServer.sh\""> -DZOO_IPV6_ENABLED  -g -O2 -std=c++11 -MT zktest_st-ThreadingUtil.o -MD -MP -MF .deps/zktest_st-ThreadingUtil.Tpo -c -o zktest_st-ThreadingUtil.o `test -f 'tests/ThreadingUtil.cc' || echo '<https://builds.apache.org/job/zookeeper-master-maven-jdk12/ws/zookeeper-client/zookeeper-client-c/'`tests/ThreadingUtil.cc>
     [exec] mv -f .deps/zktest_st-ThreadingUtil.Tpo .deps/zktest_st-ThreadingUtil.Po
     [exec] g++ -DHAVE_CONFIG_H -I. -I<https://builds.apache.org/job/zookeeper-master-maven-jdk12/ws/zookeeper-client/zookeeper-client-c>  -I<https://builds.apache.org/job/zookeeper-master-maven-jdk12/ws/zookeeper-client/zookeeper-client-c/include> -I<https://builds.apache.org/job/zookeeper-master-maven-jdk12/ws/zookeeper-client/zookeeper-client-c/tests> -I<https://builds.apache.org/job/zookeeper-master-maven-jdk12/ws/zookeeper-client/zookeeper-client-c/generated>  -DHAVE_OPENSSL_H -I/usr/include/openssl/  -DUSE_STATIC_LIB -DZKSERVER_CMD="\"<https://builds.apache.org/job/zookeeper-master-maven-jdk12/ws/zookeeper-client/zookeeper-client-c/../../zookeeper-client/zookeeper-client-c/tests/zkServer.sh\""> -DZOO_IPV6_ENABLED  -g -O2 -std=c++11 -MT zktest_st-TestZookeeperInit.o -MD -MP -MF .deps/zktest_st-TestZookeeperInit.Tpo -c -o zktest_st-TestZookeeperInit.o `test -f 'tests/TestZookeeperInit.cc' || echo '<https://builds.apache.org/job/zookeeper-master-maven-jdk12/ws/zookeeper-client/zookeeper-client-c/'`tests/TestZookeeperInit.cc>
     [exec] mv -f .deps/zktest_st-TestZookeeperInit.Tpo .deps/zktest_st-TestZookeeperInit.Po
     [exec] g++ -DHAVE_CONFIG_H -I. -I<https://builds.apache.org/job/zookeeper-master-maven-jdk12/ws/zookeeper-client/zookeeper-client-c>  -I<https://builds.apache.org/job/zookeeper-master-maven-jdk12/ws/zookeeper-client/zookeeper-client-c/include> -I<https://builds.apache.org/job/zookeeper-master-maven-jdk12/ws/zookeeper-client/zookeeper-client-c/tests> -I<https://builds.apache.org/job/zookeeper-master-maven-jdk12/ws/zookeeper-client/zookeeper-client-c/generated>  -DHAVE_OPENSSL_H -I/usr/include/openssl/  -DUSE_STATIC_LIB -DZKSERVER_CMD="\"<https://builds.apache.org/job/zookeeper-master-maven-jdk12/ws/zookeeper-client/zookeeper-client-c/../../zookeeper-client/zookeeper-client-c/tests/zkServer.sh\""> -DZOO_IPV6_ENABLED  -g -O2 -std=c++11 -MT zktest_st-TestZookeeperClose.o -MD -MP -MF .deps/zktest_st-TestZookeeperClose.Tpo -c -o zktest_st-TestZookeeperClose.o `test -f 'tests/TestZookeeperClose.cc' || echo '<https://builds.apache.org/job/zookeeper-master-maven-jdk12/ws/zookeeper-client/zookeeper-client-c/'`tests/TestZookeeperClose.cc>
     [exec] mv -f .deps/zktest_st-TestZookeeperClose.Tpo .deps/zktest_st-TestZookeeperClose.Po
     [exec] g++ -DHAVE_CONFIG_H -I. -I<https://builds.apache.org/job/zookeeper-master-maven-jdk12/ws/zookeeper-client/zookeeper-client-c>  -I<https://builds.apache.org/job/zookeeper-master-maven-jdk12/ws/zookeeper-client/zookeeper-client-c/include> -I<https://builds.apache.org/job/zookeeper-master-maven-jdk12/ws/zookeeper-client/zookeeper-client-c/tests> -I<https://builds.apache.org/job/zookeeper-master-maven-jdk12/ws/zookeeper-client/zookeeper-client-c/generated>  -DHAVE_OPENSSL_H -I/usr/include/openssl/  -DUSE_STATIC_LIB -DZKSERVER_CMD="\"<https://builds.apache.org/job/zookeeper-master-maven-jdk12/ws/zookeeper-client/zookeeper-client-c/../../zookeeper-client/zookeeper-client-c/tests/zkServer.sh\""> -DZOO_IPV6_ENABLED  -g -O2 -std=c++11 -MT zktest_st-TestReconfig.o -MD -MP -MF .deps/zktest_st-TestReconfig.Tpo -c -o zktest_st-TestReconfig.o `test -f 'tests/TestReconfig.cc' || echo '<https://builds.apache.org/job/zookeeper-master-maven-jdk12/ws/zookeeper-client/zookeeper-client-c/'`tests/TestReconfig.cc>
     [exec] Makefile:1577: recipe for target 'zktest_st-TestReconfig.o' failed
     [exec] make[1]: Leaving directory '<https://builds.apache.org/job/zookeeper-master-maven-jdk12/ws/zookeeper-client/zookeeper-client-c/target/c'>
     [exec] Makefile:2076: recipe for target 'check-am' failed
     [exec] In file included from <https://builds.apache.org/job/zookeeper-master-maven-jdk12/ws/zookeeper-client/zookeeper-client-c/include/zookeeper_log.h>:22:0,
     [exec]                  from <https://builds.apache.org/job/zookeeper-master-maven-jdk12/ws/zookeeper-client/zookeeper-client-c/tests/Util.h>:26,
     [exec]                  from <https://builds.apache.org/job/zookeeper-master-maven-jdk12/ws/zookeeper-client/zookeeper-client-c/tests/TestReconfig.cc>:29:
     [exec] <https://builds.apache.org/job/zookeeper-master-maven-jdk12/ws/zookeeper-client/zookeeper-client-c/include/zookeeper.h>:36:10: fatal error: openssl/ossl_typ.h: No such file or directory
     [exec]  #include <openssl/ossl_typ.h>
     [exec]           ^~~~~~~~~~~~~~~~~~~~
     [exec] compilation terminated.
     [exec] make[1]: *** [zktest_st-TestReconfig.o] Error 1
     [exec] make: *** [check-am] Error 2
[INFO] ------------------------------------------------------------------------
[INFO] Reactor Summary for Apache ZooKeeper 3.6.0-SNAPSHOT:
[INFO] 
[INFO] Apache ZooKeeper ................................... SUCCESS [ 11.590 s]
[INFO] Apache ZooKeeper - Documentation ................... SUCCESS [  7.562 s]
[INFO] Apache ZooKeeper - Jute ............................ SUCCESS [01:28 min]
[INFO] Apache ZooKeeper - Server .......................... SUCCESS [12:22 min]
[INFO] Apache ZooKeeper - Metrics Providers ............... SUCCESS [  3.253 s]
[INFO] Apache ZooKeeper - Prometheus.io Metrics Provider .. SUCCESS [ 14.974 s]
[INFO] Apache ZooKeeper - Client .......................... SUCCESS [  3.203 s]
[INFO] Apache ZooKeeper - Client - C ...................... FAILURE [ 50.063 s]
[INFO] Apache ZooKeeper - Recipes ......................... SKIPPED
[INFO] Apache ZooKeeper - Recipes - Election .............. SKIPPED
[INFO] Apache ZooKeeper - Recipes - Lock .................. SKIPPED
[INFO] Apache ZooKeeper - Recipes - Queue ................. SKIPPED
[INFO] Apache ZooKeeper - Assembly ........................ SKIPPED
[INFO] Apache ZooKeeper - Contrib ......................... SKIPPED
[INFO] Apache ZooKeeper - Contrib - Loggraph .............. SKIPPED
[INFO] Apache ZooKeeper - Contrib - Rest .................. SKIPPED
[INFO] Apache ZooKeeper - Contrib - ZooInspector .......... SKIPPED
[INFO] ------------------------------------------------------------------------
[INFO] BUILD FAILURE
[INFO] ------------------------------------------------------------------------
[INFO] Total time:  16:09 min
[INFO] Finished at: 2019-11-25T15:28:26Z
[INFO] ------------------------------------------------------------------------
Waiting for Jenkins to finish collecting data
[ERROR] Failed to execute goal org.apache.maven.plugins:maven-antrun-plugin:1.8:run (test-cppunit) on project zookeeper-client-c: An Ant BuildException has occured: exec returned: 2
[ERROR] around Ant part ...<exec failonerror="true" dir="<https://builds.apache.org/job/zookeeper-master-maven-jdk12/ws/zookeeper-client/zookeeper-client-c/target/c"> executable="make">... @ 4:164 in <https://builds.apache.org/job/zookeeper-master-maven-jdk12/ws/zookeeper-client/zookeeper-client-c/target/antrun/build-main.xml>
[ERROR] -> [Help 1]
[ERROR] 
[ERROR] To see the full stack trace of the errors, re-run Maven with the -e switch.
[ERROR] Re-run Maven using the -X switch to enable full debug logging.
[ERROR] 
[ERROR] For more information about the errors and possible solutions, please read the following articles:
[ERROR] [Help 1] http://cwiki.apache.org/confluence/display/MAVEN/MojoExecutionException
[ERROR] 
[ERROR] After correcting the problems, you can resume the build with the command
[ERROR]   mvn <goals> -rf :zookeeper-client-c
[JENKINS] Archiving <https://builds.apache.org/job/zookeeper-master-maven-jdk12/ws/zookeeper-server/pom.xml> to org.apache.zookeeper/zookeeper/3.6.0-SNAPSHOT/zookeeper-3.6.0-SNAPSHOT.pom
[JENKINS] Archiving <https://builds.apache.org/job/zookeeper-master-maven-jdk12/ws/zookeeper-server/target/zookeeper-3.6.0-SNAPSHOT.jar> to org.apache.zookeeper/zookeeper/3.6.0-SNAPSHOT/zookeeper-3.6.0-SNAPSHOT.jar
[JENKINS] Archiving <https://builds.apache.org/job/zookeeper-master-maven-jdk12/ws/zookeeper-server/target/zookeeper-3.6.0-SNAPSHOT-tests.jar> to org.apache.zookeeper/zookeeper/3.6.0-SNAPSHOT/zookeeper-3.6.0-SNAPSHOT-tests.jar
[JENKINS] Archiving <https://builds.apache.org/job/zookeeper-master-maven-jdk12/ws/zookeeper-server/target/zookeeper-3.6.0-SNAPSHOT-sources.jar> to org.apache.zookeeper/zookeeper/3.6.0-SNAPSHOT/zookeeper-3.6.0-SNAPSHOT-sources.jar
[JENKINS] Archiving <https://builds.apache.org/job/zookeeper-master-maven-jdk12/ws/zookeeper-server/target/zookeeper-3.6.0-SNAPSHOT-javadoc.jar> to org.apache.zookeeper/zookeeper/3.6.0-SNAPSHOT/zookeeper-3.6.0-SNAPSHOT-javadoc.jar
[JENKINS] Archiving <https://builds.apache.org/job/zookeeper-master-maven-jdk12/ws/zookeeper-contrib/zookeeper-contrib-loggraph/pom.xml> to org.apache.zookeeper/zookeeper-contrib-loggraph/3.6.0-SNAPSHOT/zookeeper-contrib-loggraph-3.6.0-SNAPSHOT.pom
[JENKINS] Archiving <https://builds.apache.org/job/zookeeper-master-maven-jdk12/ws/zookeeper-metrics-providers/pom.xml> to org.apache.zookeeper/zookeeper-metrics-providers/3.6.0-SNAPSHOT/zookeeper-metrics-providers-3.6.0-SNAPSHOT.pom
[JENKINS] Archiving <https://builds.apache.org/job/zookeeper-master-maven-jdk12/ws/zookeeper-metrics-providers/zookeeper-prometheus-metrics/pom.xml> to org.apache.zookeeper/zookeeper-prometheus-metrics/3.6.0-SNAPSHOT/zookeeper-prometheus-metrics-3.6.0-SNAPSHOT.pom
[JENKINS] Archiving <https://builds.apache.org/job/zookeeper-master-maven-jdk12/ws/zookeeper-metrics-providers/zookeeper-prometheus-metrics/target/zookeeper-prometheus-metrics-3.6.0-SNAPSHOT.jar> to org.apache.zookeeper/zookeeper-prometheus-metrics/3.6.0-SNAPSHOT/zookeeper-prometheus-metrics-3.6.0-SNAPSHOT.jar
[JENKINS] Archiving <https://builds.apache.org/job/zookeeper-master-maven-jdk12/ws/zookeeper-metrics-providers/zookeeper-prometheus-metrics/target/zookeeper-prometheus-metrics-3.6.0-SNAPSHOT-tests.jar> to org.apache.zookeeper/zookeeper-prometheus-metrics/3.6.0-SNAPSHOT/zookeeper-prometheus-metrics-3.6.0-SNAPSHOT-tests.jar
[JENKINS] Archiving <https://builds.apache.org/job/zookeeper-master-maven-jdk12/ws/zookeeper-metrics-providers/zookeeper-prometheus-metrics/target/zookeeper-prometheus-metrics-3.6.0-SNAPSHOT-sources.jar> to org.apache.zookeeper/zookeeper-prometheus-metrics/3.6.0-SNAPSHOT/zookeeper-prometheus-metrics-3.6.0-SNAPSHOT-sources.jar
[JENKINS] Archiving <https://builds.apache.org/job/zookeeper-master-maven-jdk12/ws/zookeeper-metrics-providers/zookeeper-prometheus-metrics/target/zookeeper-prometheus-metrics-3.6.0-SNAPSHOT-javadoc.jar> to org.apache.zookeeper/zookeeper-prometheus-metrics/3.6.0-SNAPSHOT/zookeeper-prometheus-metrics-3.6.0-SNAPSHOT-javadoc.jar
[Fast Archiver] Compressed 444.23 KB of artifacts by 36.0% relative to #245
[JENKINS] Archiving <https://builds.apache.org/job/zookeeper-master-maven-jdk12/ws/zookeeper-recipes/zookeeper-recipes-election/pom.xml> to org.apache.zookeeper/zookeeper-recipes-election/3.6.0-SNAPSHOT/zookeeper-recipes-election-3.6.0-SNAPSHOT.pom
[JENKINS] Archiving <https://builds.apache.org/job/zookeeper-master-maven-jdk12/ws/pom.xml> to org.apache.zookeeper/parent/3.6.0-SNAPSHOT/parent-3.6.0-SNAPSHOT.pom
[JENKINS] Archiving <https://builds.apache.org/job/zookeeper-master-maven-jdk12/ws/zookeeper-recipes/zookeeper-recipes-lock/pom.xml> to org.apache.zookeeper/zookeeper-recipes-lock/3.6.0-SNAPSHOT/zookeeper-recipes-lock-3.6.0-SNAPSHOT.pom
[JENKINS] Archiving <https://builds.apache.org/job/zookeeper-master-maven-jdk12/ws/zookeeper-contrib/pom.xml> to org.apache.zookeeper/zookeeper-contrib/3.6.0-SNAPSHOT/zookeeper-contrib-3.6.0-SNAPSHOT.pom
[JENKINS] Archiving <https://builds.apache.org/job/zookeeper-master-maven-jdk12/ws/zookeeper-client/pom.xml> to org.apache.zookeeper/zookeeper-client/3.6.0-SNAPSHOT/zookeeper-client-3.6.0-SNAPSHOT.pom
[JENKINS] Archiving <https://builds.apache.org/job/zookeeper-master-maven-jdk12/ws/zookeeper-jute/pom.xml> to org.apache.zookeeper/zookeeper-jute/3.6.0-SNAPSHOT/zookeeper-jute-3.6.0-SNAPSHOT.pom
[JENKINS] Archiving <https://builds.apache.org/job/zookeeper-master-maven-jdk12/ws/zookeeper-jute/target/zookeeper-jute-3.6.0-SNAPSHOT.jar> to org.apache.zookeeper/zookeeper-jute/3.6.0-SNAPSHOT/zookeeper-jute-3.6.0-SNAPSHOT.jar
[JENKINS] Archiving <https://builds.apache.org/job/zookeeper-master-maven-jdk12/ws/zookeeper-jute/target/zookeeper-jute-3.6.0-SNAPSHOT-tests.jar> to org.apache.zookeeper/zookeeper-jute/3.6.0-SNAPSHOT/zookeeper-jute-3.6.0-SNAPSHOT-tests.jar
[JENKINS] Archiving <https://builds.apache.org/job/zookeeper-master-maven-jdk12/ws/zookeeper-jute/target/zookeeper-jute-3.6.0-SNAPSHOT-sources.jar> to org.apache.zookeeper/zookeeper-jute/3.6.0-SNAPSHOT/zookeeper-jute-3.6.0-SNAPSHOT-sources.jar
[JENKINS] Archiving <https://builds.apache.org/job/zookeeper-master-maven-jdk12/ws/zookeeper-jute/target/zookeeper-jute-3.6.0-SNAPSHOT-javadoc.jar> to org.apache.zookeeper/zookeeper-jute/3.6.0-SNAPSHOT/zookeeper-jute-3.6.0-SNAPSHOT-javadoc.jar
[Fast Archiver] Compressed 1.41 MB of artifacts by 13.3% relative to #245
[JENKINS] Archiving <https://builds.apache.org/job/zookeeper-master-maven-jdk12/ws/zookeeper-recipes/zookeeper-recipes-queue/pom.xml> to org.apache.zookeeper/zookeeper-recipes-queue/3.6.0-SNAPSHOT/zookeeper-recipes-queue-3.6.0-SNAPSHOT.pom
[JENKINS] Archiving <https://builds.apache.org/job/zookeeper-master-maven-jdk12/ws/zookeeper-docs/pom.xml> to org.apache.zookeeper/zookeeper-docs/3.6.0-SNAPSHOT/zookeeper-docs-3.6.0-SNAPSHOT.pom
[JENKINS] Archiving <https://builds.apache.org/job/zookeeper-master-maven-jdk12/ws/zookeeper-docs/target/zookeeper-docs-3.6.0-SNAPSHOT.jar> to org.apache.zookeeper/zookeeper-docs/3.6.0-SNAPSHOT/zookeeper-docs-3.6.0-SNAPSHOT.jar
[JENKINS] Archiving <https://builds.apache.org/job/zookeeper-master-maven-jdk12/ws/zookeeper-docs/target/zookeeper-docs-3.6.0-SNAPSHOT-tests.jar> to org.apache.zookeeper/zookeeper-docs/3.6.0-SNAPSHOT/zookeeper-docs-3.6.0-SNAPSHOT-tests.jar
[JENKINS] Archiving <https://builds.apache.org/job/zookeeper-master-maven-jdk12/ws/zookeeper-docs/target/zookeeper-docs-3.6.0-SNAPSHOT-sources.jar> to org.apache.zookeeper/zookeeper-docs/3.6.0-SNAPSHOT/zookeeper-docs-3.6.0-SNAPSHOT-sources.jar
[JENKINS] Archiving <https://builds.apache.org/job/zookeeper-master-maven-jdk12/ws/zookeeper-recipes/pom.xml> to org.apache.zookeeper/zookeeper-recipes/3.6.0-SNAPSHOT/zookeeper-recipes-3.6.0-SNAPSHOT.pom
[JENKINS] Archiving <https://builds.apache.org/job/zookeeper-master-maven-jdk12/ws/zookeeper-client/zookeeper-client-c/pom.xml> to org.apache.zookeeper/zookeeper-client-c/3.6.0-SNAPSHOT/zookeeper-client-c-3.6.0-SNAPSHOT.pom
[JENKINS] Archiving <https://builds.apache.org/job/zookeeper-master-maven-jdk12/ws/zookeeper-contrib/zookeeper-contrib-rest/pom.xml> to org.apache.zookeeper/zookeeper-contrib-rest/3.6.0-SNAPSHOT/zookeeper-contrib-rest-3.6.0-SNAPSHOT.pom
[JENKINS] Archiving <https://builds.apache.org/job/zookeeper-master-maven-jdk12/ws/zookeeper-assembly/pom.xml> to org.apache.zookeeper/zookeeper-assembly/3.6.0-SNAPSHOT/zookeeper-assembly-3.6.0-SNAPSHOT.pom
[JENKINS] Archiving <https://builds.apache.org/job/zookeeper-master-maven-jdk12/ws/zookeeper-contrib/zookeeper-contrib-zooinspector/pom.xml> to org.apache.zookeeper/zookeeper-contrib-zooinspector/3.6.0-SNAPSHOT/zookeeper-contrib-zooinspector-3.6.0-SNAPSHOT.pom
channel stopped
[SpotBugs] Skipping execution of recorder since overall result is 'FAILURE'

Mime
View raw message