zookeeper-dev mailing list archives

Site index · List index
Message view « Date » · « Thread »
Top « Date » · « Thread »
From Apache Jenkins Server <jenk...@builds.apache.org>
Subject ZooKeeper-trunk - Build # 769 - Failure
Date Mon, 11 Nov 2019 18:05:49 GMT
See https://builds.apache.org/job/ZooKeeper-trunk/769/

###################################################################################
########################## LAST 60 LINES OF THE CONSOLE ###########################
[...truncated 213.07 KB...]
    [junit] Running org.apache.zookeeper.test.SessionTimeoutTest in thread 3
    [junit] Tests run: 5, Failures: 0, Errors: 0, Skipped: 0, Time elapsed: 1.639 sec, Thread:
3, Class: org.apache.zookeeper.test.SessionTimeoutTest
    [junit] Running org.apache.zookeeper.test.SessionTrackerCheckTest in thread 3
    [junit] Tests run: 2, Failures: 0, Errors: 0, Skipped: 0, Time elapsed: 0.089 sec, Thread:
3, Class: org.apache.zookeeper.test.SessionTrackerCheckTest
    [junit] Running org.apache.zookeeper.test.SessionUpgradeTest in thread 3
    [junit] Tests run: 4, Failures: 0, Errors: 0, Skipped: 0, Time elapsed: 5.384 sec, Thread:
3, Class: org.apache.zookeeper.test.SessionUpgradeTest
    [junit] Running org.apache.zookeeper.test.StandaloneTest in thread 3
    [junit] Tests run: 109, Failures: 0, Errors: 0, Skipped: 0, Time elapsed: 301.038 sec,
Thread: 4, Class: org.apache.zookeeper.test.NettyNettySuiteTest
    [junit] Running org.apache.zookeeper.test.StatTest in thread 4
    [junit] Tests run: 4, Failures: 0, Errors: 0, Skipped: 0, Time elapsed: 2.843 sec, Thread:
3, Class: org.apache.zookeeper.test.StandaloneTest
    [junit] Tests run: 4, Failures: 0, Errors: 0, Skipped: 0, Time elapsed: 1.19 sec, Thread:
4, Class: org.apache.zookeeper.test.StatTest
    [junit] Running org.apache.zookeeper.test.StaticHostProviderTest in thread 3
    [junit] Running org.apache.zookeeper.test.StringUtilTest in thread 4
    [junit] Tests run: 1, Failures: 0, Errors: 0, Skipped: 0, Time elapsed: 0.074 sec, Thread:
4, Class: org.apache.zookeeper.test.StringUtilTest
    [junit] Running org.apache.zookeeper.test.SyncCallTest in thread 4
    [junit] Tests run: 1, Failures: 0, Errors: 0, Skipped: 0, Time elapsed: 0.792 sec, Thread:
4, Class: org.apache.zookeeper.test.SyncCallTest
    [junit] Tests run: 26, Failures: 0, Errors: 0, Skipped: 0, Time elapsed: 2.115 sec, Thread:
3, Class: org.apache.zookeeper.test.StaticHostProviderTest
    [junit] Running org.apache.zookeeper.test.TruncateTest in thread 3
    [junit] Running org.apache.zookeeper.test.UnsupportedAddWatcherTest in thread 4
    [junit] Tests run: 1, Failures: 0, Errors: 0, Skipped: 0, Time elapsed: 0.714 sec, Thread:
4, Class: org.apache.zookeeper.test.UnsupportedAddWatcherTest
    [junit] Running org.apache.zookeeper.test.WatchEventWhenAutoResetTest in thread 4
    [junit] Tests run: 3, Failures: 0, Errors: 0, Skipped: 0, Time elapsed: 4.478 sec, Thread:
3, Class: org.apache.zookeeper.test.TruncateTest
    [junit] Running org.apache.zookeeper.test.WatchedEventTest in thread 3
    [junit] Tests run: 4, Failures: 0, Errors: 0, Skipped: 0, Time elapsed: 0.081 sec, Thread:
3, Class: org.apache.zookeeper.test.WatchedEventTest
    [junit] Running org.apache.zookeeper.test.WatcherFuncTest in thread 3
    [junit] Tests run: 6, Failures: 0, Errors: 0, Skipped: 0, Time elapsed: 2.282 sec, Thread:
3, Class: org.apache.zookeeper.test.WatcherFuncTest
    [junit] Running org.apache.zookeeper.test.WatcherTest in thread 3
    [junit] Tests run: 4, Failures: 0, Errors: 0, Skipped: 0, Time elapsed: 13.581 sec, Thread:
4, Class: org.apache.zookeeper.test.WatchEventWhenAutoResetTest
    [junit] Running org.apache.zookeeper.test.X509AuthTest in thread 4
    [junit] Tests run: 3, Failures: 0, Errors: 0, Skipped: 0, Time elapsed: 0.094 sec, Thread:
4, Class: org.apache.zookeeper.test.X509AuthTest
    [junit] Running org.apache.zookeeper.test.ZkDatabaseCorruptionTest in thread 4
    [junit] Tests run: 2, Failures: 0, Errors: 0, Skipped: 0, Time elapsed: 3.878 sec, Thread:
4, Class: org.apache.zookeeper.test.ZkDatabaseCorruptionTest
    [junit] Running org.apache.zookeeper.test.ZooKeeperQuotaTest in thread 4
    [junit] Tests run: 3, Failures: 0, Errors: 0, Skipped: 0, Time elapsed: 1.194 sec, Thread:
4, Class: org.apache.zookeeper.test.ZooKeeperQuotaTest
    [junit] Running org.apache.zookeeper.util.PemReaderTest in thread 4
    [junit] Tests run: 64, Failures: 0, Errors: 0, Skipped: 0, Time elapsed: 4.382 sec, Thread:
4, Class: org.apache.zookeeper.util.PemReaderTest
    [junit] Running org.apache.jute.BinaryInputArchiveTest in thread 4
    [junit] Tests run: 9, Failures: 0, Errors: 0, Skipped: 0, Time elapsed: 0.155 sec, Thread:
4, Class: org.apache.jute.BinaryInputArchiveTest
    [junit] Tests run: 8, Failures: 0, Errors: 0, Skipped: 0, Time elapsed: 29.366 sec, Thread:
3, Class: org.apache.zookeeper.test.WatcherTest
    [junit] Tests run: 109, Failures: 0, Errors: 0, Skipped: 0, Time elapsed: 331.018 sec,
Thread: 1, Class: org.apache.zookeeper.test.NioNettySuiteTest
    [junit] Tests run: 13, Failures: 0, Errors: 0, Skipped: 0, Time elapsed: 239 sec, Thread:
2, Class: org.apache.zookeeper.test.ReconfigTest

fail.build.on.test.failure:

BUILD FAILED
/home/jenkins/jenkins-slave/workspace/ZooKeeper-trunk/build.xml:1492: The following error
occurred while executing this line:
/home/jenkins/jenkins-slave/workspace/ZooKeeper-trunk/build.xml:1345: The following error
occurred while executing this line:
/home/jenkins/jenkins-slave/workspace/ZooKeeper-trunk/build.xml:1349: Tests failed!

Total time: 17 minutes 9 seconds
Build step 'Execute shell' marked build as failure
[FINDBUGS] Skipping publisher since build result is FAILURE
[WARNINGS] Skipping publisher since build result is FAILURE
Archiving artifacts
[JIRA] Updating issue ZOOKEEPER-3598
[JIRA] Updating issue ZOOKEEPER-1260
Recording test results
Email was triggered for: Failure - Any
Sending email for trigger: Failure - Any



###################################################################################
############################## FAILED TESTS (if any) ##############################
2 tests failed.
FAILED:  org.apache.zookeeper.server.quorum.EagerACLFilterTest.testSetACLFail[0]

Error Message:
Forked Java VM exited abnormally. Please note the time in the report does not reflect the
time until the VM exit.

Stack Trace:
junit.framework.AssertionFailedError: Forked Java VM exited abnormally. Please note the time
in the report does not reflect the time until the VM exit.
	at java.lang.Thread.run(Thread.java:748)


FAILED:  org.apache.zookeeper.server.quorum.QuorumRequestPipelineTest.testDelete[0]

Error Message:
Forked Java VM exited abnormally. Please note the time in the report does not reflect the
time until the VM exit.

Stack Trace:
junit.framework.AssertionFailedError: Forked Java VM exited abnormally. Please note the time
in the report does not reflect the time until the VM exit.
	at java.lang.Thread.run(Thread.java:748)
Mime
  • Unnamed multipart/mixed (inline, None, 0 bytes)
View raw message