zookeeper-dev mailing list archives

Site index · List index
Message view « Date » · « Thread »
Top « Date » · « Thread »
From Apache Jenkins Server <jenk...@builds.apache.org>
Subject Build failed in Jenkins: PreCommit-ZOOKEEPER-github-pr-build-maven #1668
Date Fri, 29 Nov 2019 14:48:49 GMT
See <https://builds.apache.org/job/PreCommit-ZOOKEEPER-github-pr-build-maven/1668/display/redirect?page=changes>

Changes:

[andor] ZOOKEEPER-3539: Fix CI for branch-3.5:

[andor] ZOOKEEPER-3034: Facing issues while building from source


------------------------------------------
[...truncated 4.38 MB...]
[ERROR] target/classes/org/apache/zookeeper/txn/TxnHeader.java:[138,3] (javadoc) JavadocMethod:
Missing a Javadoc comment.
[ERROR] target/classes/org/apache/zookeeper/txn/TxnHeader.java:[138,25] (misc) FinalParameters:
Parameter peer_ should be final.
[ERROR] target/classes/org/apache/zookeeper/txn/TxnHeader.java:[138,32] (naming) ParameterName:
Name 'peer_' must match pattern '^[a-z][a-zA-Z0-9]*$'.
[ERROR] target/classes/org/apache/zookeeper/txn/TxnHeader.java:[147,20] (whitespace) WhitespaceAround:
'==' is not followed by whitespace.
[ERROR] target/classes/org/apache/zookeeper/txn/TxnHeader.java:[147,20] (whitespace) WhitespaceAround:
'==' is not preceded with whitespace.
[ERROR] target/classes/org/apache/zookeeper/txn/TxnHeader.java:[148] (blocks) NeedBraces:
'if' construct must use '{}'s.
[ERROR] target/classes/org/apache/zookeeper/txn/TxnHeader.java:[149,16] (whitespace) WhitespaceAround:
'==' is not followed by whitespace.
[ERROR] target/classes/org/apache/zookeeper/txn/TxnHeader.java:[149,16] (whitespace) WhitespaceAround:
'==' is not preceded with whitespace.
[ERROR] target/classes/org/apache/zookeeper/txn/TxnHeader.java:[150] (blocks) NeedBraces:
'if' construct must use '{}'s.
[ERROR] target/classes/org/apache/zookeeper/txn/TxnHeader.java:[151,16] (whitespace) WhitespaceAround:
'==' is not followed by whitespace.
[ERROR] target/classes/org/apache/zookeeper/txn/TxnHeader.java:[151,16] (whitespace) WhitespaceAround:
'==' is not preceded with whitespace.
[ERROR] target/classes/org/apache/zookeeper/txn/TxnHeader.java:[152] (blocks) NeedBraces:
'if' construct must use '{}'s.
[ERROR] target/classes/org/apache/zookeeper/txn/TxnHeader.java:[153,16] (whitespace) WhitespaceAround:
'==' is not followed by whitespace.
[ERROR] target/classes/org/apache/zookeeper/txn/TxnHeader.java:[153,16] (whitespace) WhitespaceAround:
'==' is not preceded with whitespace.
[ERROR] target/classes/org/apache/zookeeper/txn/TxnHeader.java:[154] (blocks) NeedBraces:
'if' construct must use '{}'s.
[ERROR] target/classes/org/apache/zookeeper/txn/TxnHeader.java:[155,16] (whitespace) WhitespaceAround:
'==' is not followed by whitespace.
[ERROR] target/classes/org/apache/zookeeper/txn/TxnHeader.java:[155,16] (whitespace) WhitespaceAround:
'==' is not preceded with whitespace.
[ERROR] target/classes/org/apache/zookeeper/txn/TxnHeader.java:[156] (blocks) NeedBraces:
'if' construct must use '{}'s.
[ERROR] target/classes/org/apache/zookeeper/txn/TxnHeader.java:[159,3] (design) DesignForExtension:
Class 'TxnHeader' looks like designed for extension (can be subclassed), but the method 'hashCode'
does not have javadoc that explains how to do that safely. If class is not designed for extension
consider making the class 'TxnHeader' final or making the method 'hashCode' static/final/abstract/empty,
or adding allowed annotation for the method.
[ERROR] target/classes/org/apache/zookeeper/txn/TxnHeader.java:[159,3] (javadoc) JavadocMethod:
Missing a Javadoc comment.
[ERROR] target/classes/org/apache/zookeeper/txn/TxnHeader.java:[160,18] (coding) MagicNumber:
'17' is a magic number.
[ERROR] target/classes/org/apache/zookeeper/txn/TxnHeader.java:[162,26] (whitespace) WhitespaceAround:
'^' is not followed by whitespace.
[ERROR] target/classes/org/apache/zookeeper/txn/TxnHeader.java:[162,26] (whitespace) WhitespaceAround:
'^' is not preceded with whitespace.
[ERROR] target/classes/org/apache/zookeeper/txn/TxnHeader.java:[162,36] (whitespace) WhitespaceAround:
'>>>' is not followed by whitespace.
[ERROR] target/classes/org/apache/zookeeper/txn/TxnHeader.java:[162,36] (whitespace) WhitespaceAround:
'>>>' is not preceded with whitespace.
[ERROR] target/classes/org/apache/zookeeper/txn/TxnHeader.java:[162,39] (coding) MagicNumber:
'32' is a magic number.
[ERROR] target/classes/org/apache/zookeeper/txn/TxnHeader.java:[163,14] (coding) MagicNumber:
'37' is a magic number.
[ERROR] target/classes/org/apache/zookeeper/txn/TxnHeader.java:[163,16] (whitespace) WhitespaceAround:
'*' is not followed by whitespace.
[ERROR] target/classes/org/apache/zookeeper/txn/TxnHeader.java:[163,16] (whitespace) WhitespaceAround:
'*' is not preceded with whitespace.
[ERROR] target/classes/org/apache/zookeeper/txn/TxnHeader.java:[164,15] (whitespace) WhitespaceAfter:
'typecast' is not followed by whitespace.
[ERROR] target/classes/org/apache/zookeeper/txn/TxnHeader.java:[165,14] (coding) MagicNumber:
'37' is a magic number.
[ERROR] target/classes/org/apache/zookeeper/txn/TxnHeader.java:[165,16] (whitespace) WhitespaceAround:
'*' is not followed by whitespace.
[ERROR] target/classes/org/apache/zookeeper/txn/TxnHeader.java:[165,16] (whitespace) WhitespaceAround:
'*' is not preceded with whitespace.
[ERROR] target/classes/org/apache/zookeeper/txn/TxnHeader.java:[166,22] (whitespace) WhitespaceAround:
'^' is not followed by whitespace.
[ERROR] target/classes/org/apache/zookeeper/txn/TxnHeader.java:[166,22] (whitespace) WhitespaceAround:
'^' is not preceded with whitespace.
[ERROR] target/classes/org/apache/zookeeper/txn/TxnHeader.java:[166,28] (whitespace) WhitespaceAround:
'>>>' is not followed by whitespace.
[ERROR] target/classes/org/apache/zookeeper/txn/TxnHeader.java:[166,28] (whitespace) WhitespaceAround:
'>>>' is not preceded with whitespace.
[ERROR] target/classes/org/apache/zookeeper/txn/TxnHeader.java:[166,31] (coding) MagicNumber:
'32' is a magic number.
[ERROR] target/classes/org/apache/zookeeper/txn/TxnHeader.java:[167,14] (coding) MagicNumber:
'37' is a magic number.
[ERROR] target/classes/org/apache/zookeeper/txn/TxnHeader.java:[167,16] (whitespace) WhitespaceAround:
'*' is not followed by whitespace.
[ERROR] target/classes/org/apache/zookeeper/txn/TxnHeader.java:[167,16] (whitespace) WhitespaceAround:
'*' is not preceded with whitespace.
[ERROR] target/classes/org/apache/zookeeper/txn/TxnHeader.java:[168,22] (whitespace) WhitespaceAround:
'^' is not followed by whitespace.
[ERROR] target/classes/org/apache/zookeeper/txn/TxnHeader.java:[168,22] (whitespace) WhitespaceAround:
'^' is not preceded with whitespace.
[ERROR] target/classes/org/apache/zookeeper/txn/TxnHeader.java:[168,28] (whitespace) WhitespaceAround:
'>>>' is not followed by whitespace.
[ERROR] target/classes/org/apache/zookeeper/txn/TxnHeader.java:[168,28] (whitespace) WhitespaceAround:
'>>>' is not preceded with whitespace.
[ERROR] target/classes/org/apache/zookeeper/txn/TxnHeader.java:[168,31] (coding) MagicNumber:
'32' is a magic number.
[ERROR] target/classes/org/apache/zookeeper/txn/TxnHeader.java:[169,14] (coding) MagicNumber:
'37' is a magic number.
[ERROR] target/classes/org/apache/zookeeper/txn/TxnHeader.java:[169,16] (whitespace) WhitespaceAround:
'*' is not followed by whitespace.
[ERROR] target/classes/org/apache/zookeeper/txn/TxnHeader.java:[169,16] (whitespace) WhitespaceAround:
'*' is not preceded with whitespace.
[ERROR] target/classes/org/apache/zookeeper/txn/TxnHeader.java:[170,15] (whitespace) WhitespaceAfter:
'typecast' is not followed by whitespace.
[ERROR] target/classes/org/apache/zookeeper/txn/TxnHeader.java:[171,14] (coding) MagicNumber:
'37' is a magic number.
[ERROR] target/classes/org/apache/zookeeper/txn/TxnHeader.java:[171,16] (whitespace) WhitespaceAround:
'*' is not followed by whitespace.
[ERROR] target/classes/org/apache/zookeeper/txn/TxnHeader.java:[171,16] (whitespace) WhitespaceAround:
'*' is not preceded with whitespace.
[ERROR] target/classes/org/apache/zookeeper/txn/TxnHeader.java:[174,3] (javadoc) JavadocMethod:
Missing a Javadoc comment.
[ERROR] target/classes/org/apache/zookeeper/txn/SetACLTxn.java:[22] (imports) AvoidStarImport:
Using the '.*' form of import should be avoided - org.apache.jute.*.
[ERROR] target/classes/org/apache/zookeeper/txn/SetACLTxn.java:[24] (javadoc) JavadocType:
Missing a Javadoc comment.
[ERROR] target/classes/org/apache/zookeeper/txn/SetACLTxn.java:[26,3] (javadoc) JavadocVariable:
Missing a Javadoc comment.
[ERROR] target/classes/org/apache/zookeeper/txn/SetACLTxn.java:[27,3] (javadoc) JavadocVariable:
Missing a Javadoc comment.
[ERROR] target/classes/org/apache/zookeeper/txn/SetACLTxn.java:[28,3] (javadoc) JavadocVariable:
Missing a Javadoc comment.
[ERROR] target/classes/org/apache/zookeeper/txn/SetACLTxn.java:[29,3] (javadoc) JavadocMethod:
Missing a Javadoc comment.
[ERROR] target/classes/org/apache/zookeeper/txn/SetACLTxn.java:[31,3] (javadoc) JavadocMethod:
Missing a Javadoc comment.
[ERROR] target/classes/org/apache/zookeeper/txn/SetACLTxn.java:[32,9] (misc) FinalParameters:
Parameter path should be final.
[ERROR] target/classes/org/apache/zookeeper/txn/SetACLTxn.java:[32,16] (coding) HiddenField:
'path' hides a field.
[ERROR] target/classes/org/apache/zookeeper/txn/SetACLTxn.java:[33,9] (misc) FinalParameters:
Parameter acl should be final.
[ERROR] target/classes/org/apache/zookeeper/txn/SetACLTxn.java:[33,55] (coding) HiddenField:
'acl' hides a field.
[ERROR] target/classes/org/apache/zookeeper/txn/SetACLTxn.java:[34,9] (misc) FinalParameters:
Parameter version should be final.
[ERROR] target/classes/org/apache/zookeeper/txn/SetACLTxn.java:[34,13] (coding) HiddenField:
'version' hides a field.
[ERROR] target/classes/org/apache/zookeeper/txn/SetACLTxn.java:[35,14] (whitespace) WhitespaceAround:
'=' is not followed by whitespace.
[ERROR] target/classes/org/apache/zookeeper/txn/SetACLTxn.java:[35,14] (whitespace) WhitespaceAround:
'=' is not preceded with whitespace.
[ERROR] target/classes/org/apache/zookeeper/txn/SetACLTxn.java:[36,13] (whitespace) WhitespaceAround:
'=' is not followed by whitespace.
[ERROR] target/classes/org/apache/zookeeper/txn/SetACLTxn.java:[36,13] (whitespace) WhitespaceAround:
'=' is not preceded with whitespace.
[ERROR] target/classes/org/apache/zookeeper/txn/SetACLTxn.java:[37,17] (whitespace) WhitespaceAround:
'=' is not followed by whitespace.
[ERROR] target/classes/org/apache/zookeeper/txn/SetACLTxn.java:[37,17] (whitespace) WhitespaceAround:
'=' is not preceded with whitespace.
[ERROR] target/classes/org/apache/zookeeper/txn/SetACLTxn.java:[39,3] (design) DesignForExtension:
Class 'SetACLTxn' looks like designed for extension (can be subclassed), but the method 'getPath'
does not have javadoc that explains how to do that safely. If class is not designed for extension
consider making the class 'SetACLTxn' final or making the method 'getPath' static/final/abstract/empty,
or adding allowed annotation for the method.
[ERROR] target/classes/org/apache/zookeeper/txn/SetACLTxn.java:[39,3] (javadoc) JavadocMethod:
Missing a Javadoc comment.
[ERROR] target/classes/org/apache/zookeeper/txn/SetACLTxn.java:[42,3] (design) DesignForExtension:
Class 'SetACLTxn' looks like designed for extension (can be subclassed), but the method 'setPath'
does not have javadoc that explains how to do that safely. If class is not designed for extension
consider making the class 'SetACLTxn' final or making the method 'setPath' static/final/abstract/empty,
or adding allowed annotation for the method.
[ERROR] target/classes/org/apache/zookeeper/txn/SetACLTxn.java:[42,3] (javadoc) JavadocMethod:
Missing a Javadoc comment.
[ERROR] target/classes/org/apache/zookeeper/txn/SetACLTxn.java:[42,23] (misc) FinalParameters:
Parameter m_ should be final.
[ERROR] target/classes/org/apache/zookeeper/txn/SetACLTxn.java:[42,30] (naming) ParameterName:
Name 'm_' must match pattern '^[a-z][a-zA-Z0-9]*$'.
[ERROR] target/classes/org/apache/zookeeper/txn/SetACLTxn.java:[43,9] (whitespace) WhitespaceAround:
'=' is not followed by whitespace.
[ERROR] target/classes/org/apache/zookeeper/txn/SetACLTxn.java:[43,9] (whitespace) WhitespaceAround:
'=' is not preceded with whitespace.
[ERROR] target/classes/org/apache/zookeeper/txn/SetACLTxn.java:[45,3] (design) DesignForExtension:
Class 'SetACLTxn' looks like designed for extension (can be subclassed), but the method 'getAcl'
does not have javadoc that explains how to do that safely. If class is not designed for extension
consider making the class 'SetACLTxn' final or making the method 'getAcl' static/final/abstract/empty,
or adding allowed annotation for the method.
[ERROR] target/classes/org/apache/zookeeper/txn/SetACLTxn.java:[45,3] (javadoc) JavadocMethod:
Missing a Javadoc comment.
[ERROR] target/classes/org/apache/zookeeper/txn/SetACLTxn.java:[48,3] (design) DesignForExtension:
Class 'SetACLTxn' looks like designed for extension (can be subclassed), but the method 'setAcl'
does not have javadoc that explains how to do that safely. If class is not designed for extension
consider making the class 'SetACLTxn' final or making the method 'setAcl' static/final/abstract/empty,
or adding allowed annotation for the method.
[ERROR] target/classes/org/apache/zookeeper/txn/SetACLTxn.java:[48,3] (javadoc) JavadocMethod:
Missing a Javadoc comment.
[ERROR] target/classes/org/apache/zookeeper/txn/SetACLTxn.java:[48,22] (misc) FinalParameters:
Parameter m_ should be final.
[ERROR] target/classes/org/apache/zookeeper/txn/SetACLTxn.java:[48,68] (naming) ParameterName:
Name 'm_' must match pattern '^[a-z][a-zA-Z0-9]*$'.
[ERROR] target/classes/org/apache/zookeeper/txn/SetACLTxn.java:[49,8] (whitespace) WhitespaceAround:
'=' is not followed by whitespace.
[ERROR] target/classes/org/apache/zookeeper/txn/SetACLTxn.java:[49,8] (whitespace) WhitespaceAround:
'=' is not preceded with whitespace.
[ERROR] target/classes/org/apache/zookeeper/txn/SetACLTxn.java:[51,3] (design) DesignForExtension:
Class 'SetACLTxn' looks like designed for extension (can be subclassed), but the method 'getVersion'
does not have javadoc that explains how to do that safely. If class is not designed for extension
consider making the class 'SetACLTxn' final or making the method 'getVersion' static/final/abstract/empty,
or adding allowed annotation for the method.
[ERROR] target/classes/org/apache/zookeeper/txn/SetACLTxn.java:[51,3] (javadoc) JavadocMethod:
Missing a Javadoc comment.
[ERROR] target/classes/org/apache/zookeeper/txn/SetACLTxn.java:[54,3] (design) DesignForExtension:
Class 'SetACLTxn' looks like designed for extension (can be subclassed), but the method 'setVersion'
does not have javadoc that explains how to do that safely. If class is not designed for extension
consider making the class 'SetACLTxn' final or making the method 'setVersion' static/final/abstract/empty,
or adding allowed annotation for the method.
[ERROR] target/classes/org/apache/zookeeper/txn/SetACLTxn.java:[54,3] (javadoc) JavadocMethod:
Missing a Javadoc comment.
[ERROR] target/classes/org/apache/zookeeper/txn/SetACLTxn.java:[54,26] (misc) FinalParameters:
Parameter m_ should be final.
[ERROR] target/classes/org/apache/zookeeper/txn/SetACLTxn.java:[54,30] (naming) ParameterName:
Name 'm_' must match pattern '^[a-z][a-zA-Z0-9]*$'.
[ERROR] target/classes/org/apache/zookeeper/txn/SetACLTxn.java:[55,12] (whitespace) WhitespaceAround:
'=' is not followed by whitespace.
[ERROR] target/classes/org/apache/zookeeper/txn/SetACLTxn.java:[55,12] (whitespace) WhitespaceAround:
'=' is not preceded with whitespace.
[ERROR] target/classes/org/apache/zookeeper/txn/SetACLTxn.java:[57] (sizes) LineLength: Line
is longer than 80 characters (found 82).
[ERROR] target/classes/org/apache/zookeeper/txn/SetACLTxn.java:[57,3] (design) DesignForExtension:
Class 'SetACLTxn' looks like designed for extension (can be subclassed), but the method 'serialize'
does not have javadoc that explains how to do that safely. If class is not designed for extension
consider making the class 'SetACLTxn' final or making the method 'serialize' static/final/abstract/empty,
or adding allowed annotation for the method.
[ERROR] target/classes/org/apache/zookeeper/txn/SetACLTxn.java:[57,3] (javadoc) JavadocMethod:
Missing a Javadoc comment.
[ERROR] target/classes/org/apache/zookeeper/txn/SetACLTxn.java:[57,25] (misc) FinalParameters:
Parameter a_ should be final.
[ERROR] target/classes/org/apache/zookeeper/txn/SetACLTxn.java:[57,39] (naming) ParameterName:
Name 'a_' must match pattern '^[a-z][a-zA-Z0-9]*$'.
[ERROR] target/classes/org/apache/zookeeper/txn/SetACLTxn.java:[57,43] (misc) FinalParameters:
Parameter tag should be final.
[ERROR] target/classes/org/apache/zookeeper/txn/SetACLTxn.java:[58,24] (whitespace) WhitespaceAfter:
',' is not followed by whitespace.
[ERROR] target/classes/org/apache/zookeeper/txn/SetACLTxn.java:[59,24] (whitespace) WhitespaceAfter:
',' is not followed by whitespace.
[ERROR] target/classes/org/apache/zookeeper/txn/SetACLTxn.java:[60,5] (blocks) AvoidNestedBlocks:
Avoid nested blocks.
[ERROR] target/classes/org/apache/zookeeper/txn/SetACLTxn.java:[61,25] (whitespace) WhitespaceAfter:
',' is not followed by whitespace.
[ERROR] target/classes/org/apache/zookeeper/txn/SetACLTxn.java:[62,14] (whitespace) WhitespaceAround:
'!=' is not preceded with whitespace.
[ERROR] target/classes/org/apache/zookeeper/txn/SetACLTxn.java:[62,23] (blocks) LeftCurly:
'{' at column 23 should have line break after.
[ERROR] target/classes/org/apache/zookeeper/txn/SetACLTxn.java:[63,11] (whitespace) WhitespaceAround:
'for' is not followed by whitespace.
[ERROR] target/classes/org/apache/zookeeper/txn/SetACLTxn.java:[63,35] (whitespace) WhitespaceAround:
'<' is not followed by whitespace.
[ERROR] target/classes/org/apache/zookeeper/txn/SetACLTxn.java:[63,35] (whitespace) WhitespaceAround:
'<' is not preceded with whitespace.
[ERROR] target/classes/org/apache/zookeeper/txn/SetACLTxn.java:[64] (sizes) LineLength: Line
is longer than 80 characters (found 94).
[ERROR] target/classes/org/apache/zookeeper/txn/SetACLTxn.java:[65,22] (whitespace) WhitespaceAfter:
',' is not followed by whitespace.
[ERROR] target/classes/org/apache/zookeeper/txn/SetACLTxn.java:[68,23] (whitespace) WhitespaceAfter:
',' is not followed by whitespace.
[ERROR] target/classes/org/apache/zookeeper/txn/SetACLTxn.java:[70,24] (whitespace) WhitespaceAfter:
',' is not followed by whitespace.
[ERROR] target/classes/org/apache/zookeeper/txn/SetACLTxn.java:[71,22] (whitespace) WhitespaceAfter:
',' is not followed by whitespace.
[ERROR] target/classes/org/apache/zookeeper/txn/SetACLTxn.java:[73] (sizes) LineLength: Line
is longer than 80 characters (found 83).
[ERROR] target/classes/org/apache/zookeeper/txn/SetACLTxn.java:[73,3] (design) DesignForExtension:
Class 'SetACLTxn' looks like designed for extension (can be subclassed), but the method 'deserialize'
does not have javadoc that explains how to do that safely. If class is not designed for extension
consider making the class 'SetACLTxn' final or making the method 'deserialize' static/final/abstract/empty,
or adding allowed annotation for the method.
[ERROR] target/classes/org/apache/zookeeper/txn/SetACLTxn.java:[73,3] (javadoc) JavadocMethod:
Missing a Javadoc comment.
[ERROR] target/classes/org/apache/zookeeper/txn/SetACLTxn.java:[73,27] (misc) FinalParameters:
Parameter a_ should be final.
[ERROR] target/classes/org/apache/zookeeper/txn/SetACLTxn.java:[73,40] (naming) ParameterName:
Name 'a_' must match pattern '^[a-z][a-zA-Z0-9]*$'.
[ERROR] target/classes/org/apache/zookeeper/txn/SetACLTxn.java:[73,44] (misc) FinalParameters:
Parameter tag should be final.
[ERROR] target/classes/org/apache/zookeeper/txn/SetACLTxn.java:[75,9] (whitespace) WhitespaceAround:
'=' is not followed by whitespace.
[ERROR] target/classes/org/apache/zookeeper/txn/SetACLTxn.java:[75,9] (whitespace) WhitespaceAround:
'=' is not preceded with whitespace.
[ERROR] target/classes/org/apache/zookeeper/txn/SetACLTxn.java:[76,5] (blocks) AvoidNestedBlocks:
Avoid nested blocks.
[ERROR] target/classes/org/apache/zookeeper/txn/SetACLTxn.java:[78] (sizes) LineLength: Line
is longer than 80 characters (found 96).
[ERROR] target/classes/org/apache/zookeeper/txn/SetACLTxn.java:[78,16] (whitespace) WhitespaceAround:
'!=' is not preceded with whitespace.
[ERROR] target/classes/org/apache/zookeeper/txn/SetACLTxn.java:[78,25] (blocks) LeftCurly:
'{' at column 25 should have line break after.
[ERROR] target/classes/org/apache/zookeeper/txn/SetACLTxn.java:[78,39] (whitespace) WhitespaceAround:
'=' is not followed by whitespace.
[ERROR] target/classes/org/apache/zookeeper/txn/SetACLTxn.java:[78,39] (whitespace) WhitespaceAround:
'=' is not preceded with whitespace.
[ERROR] target/classes/org/apache/zookeeper/txn/SetACLTxn.java:[81,7] (whitespace) WhitespaceAround:
'=' is not preceded with whitespace.
[ERROR] target/classes/org/apache/zookeeper/txn/SetACLTxn.java:[82,21] (whitespace) WhitespaceAfter:
',' is not followed by whitespace.
[ERROR] target/classes/org/apache/zookeeper/txn/SetACLTxn.java:[88,12] (whitespace) WhitespaceAround:
'=' is not followed by whitespace.
[ERROR] target/classes/org/apache/zookeeper/txn/SetACLTxn.java:[88,12] (whitespace) WhitespaceAround:
'=' is not preceded with whitespace.
[ERROR] target/classes/org/apache/zookeeper/txn/SetACLTxn.java:[91,3] (design) DesignForExtension:
Class 'SetACLTxn' looks like designed for extension (can be subclassed), but the method 'toString'
does not have javadoc that explains how to do that safely. If class is not designed for extension
consider making the class 'SetACLTxn' final or making the method 'toString' static/final/abstract/empty,
or adding allowed annotation for the method.
[ERROR] target/classes/org/apache/zookeeper/txn/SetACLTxn.java:[91,3] (javadoc) JavadocMethod:
Missing a Javadoc comment.
[ERROR] target/classes/org/apache/zookeeper/txn/SetACLTxn.java:[95] (regexp) RegexpSingleline:
Line has trailing spaces.
[ERROR] target/classes/org/apache/zookeeper/txn/SetACLTxn.java:[95,24] (naming) LocalVariableName:
Name 'a_' must match pattern '^[a-z][a-zA-Z0-9]*$'.
[ERROR] target/classes/org/apache/zookeeper/txn/SetACLTxn.java:[97,26] (whitespace) WhitespaceAfter:
',' is not followed by whitespace.
[ERROR] target/classes/org/apache/zookeeper/txn/SetACLTxn.java:[98,24] (whitespace) WhitespaceAfter:
',' is not followed by whitespace.
[ERROR] target/classes/org/apache/zookeeper/txn/SetACLTxn.java:[99,5] (blocks) AvoidNestedBlocks:
Avoid nested blocks.
[ERROR] target/classes/org/apache/zookeeper/txn/SetACLTxn.java:[100,25] (whitespace) WhitespaceAfter:
',' is not followed by whitespace.
[ERROR] target/classes/org/apache/zookeeper/txn/SetACLTxn.java:[101,14] (whitespace) WhitespaceAround:
'!=' is not preceded with whitespace.
[ERROR] target/classes/org/apache/zookeeper/txn/SetACLTxn.java:[101,23] (blocks) LeftCurly:
'{' at column 23 should have line break after.
[ERROR] target/classes/org/apache/zookeeper/txn/SetACLTxn.java:[102,11] (whitespace) WhitespaceAround:
'for' is not followed by whitespace.
[ERROR] target/classes/org/apache/zookeeper/txn/SetACLTxn.java:[102,35] (whitespace) WhitespaceAround:
'<' is not followed by whitespace.
[ERROR] target/classes/org/apache/zookeeper/txn/SetACLTxn.java:[102,35] (whitespace) WhitespaceAround:
'<' is not preceded with whitespace.
[ERROR] target/classes/org/apache/zookeeper/txn/SetACLTxn.java:[103] (sizes) LineLength: Line
is longer than 80 characters (found 94).
[ERROR] target/classes/org/apache/zookeeper/txn/SetACLTxn.java:[104,22] (whitespace) WhitespaceAfter:
',' is not followed by whitespace.
[ERROR] target/classes/org/apache/zookeeper/txn/SetACLTxn.java:[107,23] (whitespace) WhitespaceAfter:
',' is not followed by whitespace.
[ERROR] target/classes/org/apache/zookeeper/txn/SetACLTxn.java:[109,24] (whitespace) WhitespaceAfter:
',' is not followed by whitespace.
[ERROR] target/classes/org/apache/zookeeper/txn/SetACLTxn.java:[110,24] (whitespace) WhitespaceAfter:
',' is not followed by whitespace.
[ERROR] target/classes/org/apache/zookeeper/txn/SetACLTxn.java:[117,3] (design) DesignForExtension:
Class 'SetACLTxn' looks like designed for extension (can be subclassed), but the method 'write'
does not have javadoc that explains how to do that safely. If class is not designed for extension
consider making the class 'SetACLTxn' final or making the method 'write' static/final/abstract/empty,
or adding allowed annotation for the method.
[ERROR] target/classes/org/apache/zookeeper/txn/SetACLTxn.java:[117,3] (javadoc) JavadocMethod:
Missing a Javadoc comment.
[ERROR] target/classes/org/apache/zookeeper/txn/SetACLTxn.java:[117,21] (misc) FinalParameters:
Parameter out should be final.
[ERROR] target/classes/org/apache/zookeeper/txn/SetACLTxn.java:[121,3] (design) DesignForExtension:
Class 'SetACLTxn' looks like designed for extension (can be subclassed), but the method 'readFields'
does not have javadoc that explains how to do that safely. If class is not designed for extension
consider making the class 'SetACLTxn' final or making the method 'readFields' static/final/abstract/empty,
or adding allowed annotation for the method.
[ERROR] target/classes/org/apache/zookeeper/txn/SetACLTxn.java:[121,3] (javadoc) JavadocMethod:
Missing a Javadoc comment.
[ERROR] target/classes/org/apache/zookeeper/txn/SetACLTxn.java:[121,26] (misc) FinalParameters:
Parameter in should be final.
[ERROR] target/classes/org/apache/zookeeper/txn/SetACLTxn.java:[125,3] (design) DesignForExtension:
Class 'SetACLTxn' looks like designed for extension (can be subclassed), but the method 'compareTo'
does not have javadoc that explains how to do that safely. If class is not designed for extension
consider making the class 'SetACLTxn' final or making the method 'compareTo' static/final/abstract/empty,
or adding allowed annotation for the method.
[ERROR] target/classes/org/apache/zookeeper/txn/SetACLTxn.java:[125,3] (javadoc) JavadocMethod:
Missing a Javadoc comment.
[ERROR] target/classes/org/apache/zookeeper/txn/SetACLTxn.java:[125,24] (whitespace) MethodParamPad:
'(' is preceded with whitespace.
[ERROR] target/classes/org/apache/zookeeper/txn/SetACLTxn.java:[125,25] (misc) FinalParameters:
Parameter peer_ should be final.
[ERROR] target/classes/org/apache/zookeeper/txn/SetACLTxn.java:[125,32] (naming) ParameterName:
Name 'peer_' must match pattern '^[a-z][a-zA-Z0-9]*$'.
[ERROR] target/classes/org/apache/zookeeper/txn/SetACLTxn.java:[126] (sizes) LineLength: Line
is longer than 80 characters (found 84).
[ERROR] target/classes/org/apache/zookeeper/txn/SetACLTxn.java:[128,3] (design) DesignForExtension:
Class 'SetACLTxn' looks like designed for extension (can be subclassed), but the method 'equals'
does not have javadoc that explains how to do that safely. If class is not designed for extension
consider making the class 'SetACLTxn' final or making the method 'equals' static/final/abstract/empty,
or adding allowed annotation for the method.
[ERROR] target/classes/org/apache/zookeeper/txn/SetACLTxn.java:[128,3] (javadoc) JavadocMethod:
Missing a Javadoc comment.
[ERROR] target/classes/org/apache/zookeeper/txn/SetACLTxn.java:[128,25] (misc) FinalParameters:
Parameter peer_ should be final.
[ERROR] target/classes/org/apache/zookeeper/txn/SetACLTxn.java:[128,32] (naming) ParameterName:
Name 'peer_' must match pattern '^[a-z][a-zA-Z0-9]*$'.
[ERROR] target/classes/org/apache/zookeeper/txn/SetACLTxn.java:[138] (blocks) NeedBraces:
'if' construct must use '{}'s.
[ERROR] target/classes/org/apache/zookeeper/txn/SetACLTxn.java:[140] (blocks) NeedBraces:
'if' construct must use '{}'s.
[ERROR] target/classes/org/apache/zookeeper/txn/SetACLTxn.java:[141,19] (whitespace) WhitespaceAround:
'==' is not followed by whitespace.
[ERROR] target/classes/org/apache/zookeeper/txn/SetACLTxn.java:[141,19] (whitespace) WhitespaceAround:
'==' is not preceded with whitespace.
[ERROR] target/classes/org/apache/zookeeper/txn/SetACLTxn.java:[142] (blocks) NeedBraces:
'if' construct must use '{}'s.
[ERROR] target/classes/org/apache/zookeeper/txn/SetACLTxn.java:[145,3] (design) DesignForExtension:
Class 'SetACLTxn' looks like designed for extension (can be subclassed), but the method 'hashCode'
does not have javadoc that explains how to do that safely. If class is not designed for extension
consider making the class 'SetACLTxn' final or making the method 'hashCode' static/final/abstract/empty,
or adding allowed annotation for the method.
[ERROR] target/classes/org/apache/zookeeper/txn/SetACLTxn.java:[145,3] (javadoc) JavadocMethod:
Missing a Javadoc comment.
[ERROR] target/classes/org/apache/zookeeper/txn/SetACLTxn.java:[146,18] (coding) MagicNumber:
'17' is a magic number.
[ERROR] target/classes/org/apache/zookeeper/txn/SetACLTxn.java:[149,14] (coding) MagicNumber:
'37' is a magic number.
[ERROR] target/classes/org/apache/zookeeper/txn/SetACLTxn.java:[149,16] (whitespace) WhitespaceAround:
'*' is not followed by whitespace.
[ERROR] target/classes/org/apache/zookeeper/txn/SetACLTxn.java:[149,16] (whitespace) WhitespaceAround:
'*' is not preceded with whitespace.
[ERROR] target/classes/org/apache/zookeeper/txn/SetACLTxn.java:[151,14] (coding) MagicNumber:
'37' is a magic number.
[ERROR] target/classes/org/apache/zookeeper/txn/SetACLTxn.java:[151,16] (whitespace) WhitespaceAround:
'*' is not followed by whitespace.
[ERROR] target/classes/org/apache/zookeeper/txn/SetACLTxn.java:[151,16] (whitespace) WhitespaceAround:
'*' is not preceded with whitespace.
[ERROR] target/classes/org/apache/zookeeper/txn/SetACLTxn.java:[152,15] (whitespace) WhitespaceAfter:
'typecast' is not followed by whitespace.
[ERROR] target/classes/org/apache/zookeeper/txn/SetACLTxn.java:[153,14] (coding) MagicNumber:
'37' is a magic number.
[ERROR] target/classes/org/apache/zookeeper/txn/SetACLTxn.java:[153,16] (whitespace) WhitespaceAround:
'*' is not followed by whitespace.
[ERROR] target/classes/org/apache/zookeeper/txn/SetACLTxn.java:[153,16] (whitespace) WhitespaceAround:
'*' is not preceded with whitespace.
[ERROR] target/classes/org/apache/zookeeper/txn/SetACLTxn.java:[156,3] (javadoc) JavadocMethod:
Missing a Javadoc comment.
[INFO] ------------------------------------------------------------------------
[INFO] Reactor Summary for Apache ZooKeeper 3.4.14-SNAPSHOT:
[INFO] 
[INFO] Apache ZooKeeper ................................... SUCCESS [ 22.632 s]
[INFO] Apache ZooKeeper - Documentation ................... SUCCESS [ 10.001 s]
[INFO] Apache ZooKeeper - Jute ............................ FAILURE [01:24 min]
[INFO] Apache ZooKeeper - Server .......................... SKIPPED
[INFO] Apache ZooKeeper - Client .......................... SKIPPED
[INFO] Apache ZooKeeper - Client - C ...................... SKIPPED
[INFO] Apache ZooKeeper - Recipes ......................... SKIPPED
[INFO] Apache ZooKeeper - Recipes - Election .............. SKIPPED
[INFO] Apache ZooKeeper - Recipes - Lock .................. SKIPPED
[INFO] Apache ZooKeeper - Recipes - Queue ................. SKIPPED
[INFO] Apache ZooKeeper - Contrib ......................... SKIPPED
[INFO] Apache ZooKeeper - Contrib - Loggraph .............. SKIPPED
[INFO] Apache ZooKeeper - Contrib - Rest .................. SKIPPED
[INFO] Apache ZooKeeper - Contrib - ZooInspector .......... SKIPPED
[INFO] ------------------------------------------------------------------------
[INFO] BUILD FAILURE
[INFO] ------------------------------------------------------------------------
[INFO] Total time:  02:31 min
[INFO] Finished at: 2019-11-29T14:48:15Z
[INFO] ------------------------------------------------------------------------
Waiting for Jenkins to finish collecting data
[ERROR] Failed to execute goal org.apache.maven.plugins:maven-checkstyle-plugin:3.1.0:check
(default-cli) on project zookeeper-jute: You have 11800 Checkstyle violations. -> [Help
1]
[ERROR] 
[ERROR] To see the full stack trace of the errors, re-run Maven with the -e switch.
[ERROR] Re-run Maven using the -X switch to enable full debug logging.
[ERROR] 
[ERROR] For more information about the errors and possible solutions, please read the following
articles:
[ERROR] [Help 1] http://cwiki.apache.org/confluence/display/MAVEN/MojoFailureException
[ERROR] 
[ERROR] After correcting the problems, you can resume the build with the command
[ERROR]   mvn <goals> -rf :zookeeper-jute
[JENKINS] Archiving <https://builds.apache.org/job/PreCommit-ZOOKEEPER-github-pr-build-maven/ws/pom.xml>
to org.apache.zookeeper/zookeeper/3.4.14-SNAPSHOT/zookeeper-3.4.14-SNAPSHOT.pom
[JENKINS] Archiving <https://builds.apache.org/job/PreCommit-ZOOKEEPER-github-pr-build-maven/ws/target/zookeeper-3.4.14-SNAPSHOT-source-package.tar.gz>
to org.apache.zookeeper/zookeeper/3.4.14-SNAPSHOT/zookeeper-3.4.14-SNAPSHOT-source-package.tar.gz
[JENKINS] Archiving <https://builds.apache.org/job/PreCommit-ZOOKEEPER-github-pr-build-maven/ws/target/zookeeper-3.4.14-SNAPSHOT-source-package.zip>
to org.apache.zookeeper/zookeeper/3.4.14-SNAPSHOT/zookeeper-3.4.14-SNAPSHOT-source-package.zip
[JENKINS] Archiving <https://builds.apache.org/job/PreCommit-ZOOKEEPER-github-pr-build-maven/ws/zookeeper-contrib/zookeeper-contrib-loggraph/pom.xml>
to org.apache.zookeeper/zookeeper-contrib-loggraph/3.4.14-SNAPSHOT/zookeeper-contrib-loggraph-3.4.14-SNAPSHOT.pom
[JENKINS] Archiving <https://builds.apache.org/job/PreCommit-ZOOKEEPER-github-pr-build-maven/ws/zookeeper-recipes/zookeeper-recipes-election/pom.xml>
to org.apache.zookeeper/zookeeper-recipes-election/3.4.14-SNAPSHOT/zookeeper-recipes-election-3.4.14-SNAPSHOT.pom
[JENKINS] Archiving <https://builds.apache.org/job/PreCommit-ZOOKEEPER-github-pr-build-maven/ws/zookeeper-recipes/zookeeper-recipes-lock/pom.xml>
to org.apache.zookeeper/zookeeper-recipes-lock/3.4.14-SNAPSHOT/zookeeper-recipes-lock-3.4.14-SNAPSHOT.pom
[JENKINS] Archiving <https://builds.apache.org/job/PreCommit-ZOOKEEPER-github-pr-build-maven/ws/zookeeper-contrib/pom.xml>
to org.apache.zookeeper/zookeeper-contrib/3.4.14-SNAPSHOT/zookeeper-contrib-3.4.14-SNAPSHOT.pom
[JENKINS] Archiving <https://builds.apache.org/job/PreCommit-ZOOKEEPER-github-pr-build-maven/ws/zookeeper-client/pom.xml>
to org.apache.zookeeper/zookeeper-client/3.4.14-SNAPSHOT/zookeeper-client-3.4.14-SNAPSHOT.pom
[JENKINS] Archiving <https://builds.apache.org/job/PreCommit-ZOOKEEPER-github-pr-build-maven/ws/zookeeper-jute/pom.xml>
to org.apache.zookeeper/zookeeper-jute/3.4.14-SNAPSHOT/zookeeper-jute-3.4.14-SNAPSHOT.pom
[JENKINS] Archiving <https://builds.apache.org/job/PreCommit-ZOOKEEPER-github-pr-build-maven/ws/zookeeper-jute/target/zookeeper-jute-3.4.14-SNAPSHOT.jar>
to org.apache.zookeeper/zookeeper-jute/3.4.14-SNAPSHOT/zookeeper-jute-3.4.14-SNAPSHOT.jar
[JENKINS] Archiving <https://builds.apache.org/job/PreCommit-ZOOKEEPER-github-pr-build-maven/ws/zookeeper-jute/target/zookeeper-jute-3.4.14-SNAPSHOT-tests.jar>
to org.apache.zookeeper/zookeeper-jute/3.4.14-SNAPSHOT/zookeeper-jute-3.4.14-SNAPSHOT-tests.jar
[JENKINS] Archiving <https://builds.apache.org/job/PreCommit-ZOOKEEPER-github-pr-build-maven/ws/zookeeper-jute/target/zookeeper-jute-3.4.14-SNAPSHOT-sources.jar>
to org.apache.zookeeper/zookeeper-jute/3.4.14-SNAPSHOT/zookeeper-jute-3.4.14-SNAPSHOT-sources.jar
[JENKINS] Archiving <https://builds.apache.org/job/PreCommit-ZOOKEEPER-github-pr-build-maven/ws/zookeeper-jute/target/zookeeper-jute-3.4.14-SNAPSHOT-javadoc.jar>
to org.apache.zookeeper/zookeeper-jute/3.4.14-SNAPSHOT/zookeeper-jute-3.4.14-SNAPSHOT-javadoc.jar
[JENKINS] Archiving <https://builds.apache.org/job/PreCommit-ZOOKEEPER-github-pr-build-maven/ws/zookeeper-recipes/zookeeper-recipes-queue/pom.xml>
to org.apache.zookeeper/zookeeper-recipes-queue/3.4.14-SNAPSHOT/zookeeper-recipes-queue-3.4.14-SNAPSHOT.pom
[JENKINS] Archiving <https://builds.apache.org/job/PreCommit-ZOOKEEPER-github-pr-build-maven/ws/zookeeper-docs/pom.xml>
to org.apache.zookeeper/zookeeper-docs/3.4.14-SNAPSHOT/zookeeper-docs-3.4.14-SNAPSHOT.pom
[JENKINS] Archiving <https://builds.apache.org/job/PreCommit-ZOOKEEPER-github-pr-build-maven/ws/zookeeper-docs/target/zookeeper-docs-3.4.14-SNAPSHOT.jar>
to org.apache.zookeeper/zookeeper-docs/3.4.14-SNAPSHOT/zookeeper-docs-3.4.14-SNAPSHOT.jar
[JENKINS] Archiving <https://builds.apache.org/job/PreCommit-ZOOKEEPER-github-pr-build-maven/ws/zookeeper-docs/target/zookeeper-docs-3.4.14-SNAPSHOT-tests.jar>
to org.apache.zookeeper/zookeeper-docs/3.4.14-SNAPSHOT/zookeeper-docs-3.4.14-SNAPSHOT-tests.jar
[JENKINS] Archiving <https://builds.apache.org/job/PreCommit-ZOOKEEPER-github-pr-build-maven/ws/zookeeper-docs/target/zookeeper-docs-3.4.14-SNAPSHOT-sources.jar>
to org.apache.zookeeper/zookeeper-docs/3.4.14-SNAPSHOT/zookeeper-docs-3.4.14-SNAPSHOT-sources.jar
[JENKINS] Archiving <https://builds.apache.org/job/PreCommit-ZOOKEEPER-github-pr-build-maven/ws/zookeeper-recipes/pom.xml>
to org.apache.zookeeper/zookeeper-recipes/3.4.14-SNAPSHOT/zookeeper-recipes-3.4.14-SNAPSHOT.pom
[JENKINS] Archiving <https://builds.apache.org/job/PreCommit-ZOOKEEPER-github-pr-build-maven/ws/zookeeper-client/zookeeper-client-c/pom.xml>
to org.apache.zookeeper/zookeeper-client-c/3.4.14-SNAPSHOT/zookeeper-client-c-3.4.14-SNAPSHOT.pom
[JENKINS] Archiving <https://builds.apache.org/job/PreCommit-ZOOKEEPER-github-pr-build-maven/ws/zookeeper-contrib/zookeeper-contrib-rest/pom.xml>
to org.apache.zookeeper/zookeeper-contrib-rest/3.4.14-SNAPSHOT/zookeeper-contrib-rest-3.4.14-SNAPSHOT.pom
[JENKINS] Archiving <https://builds.apache.org/job/PreCommit-ZOOKEEPER-github-pr-build-maven/ws/zookeeper-server/pom.xml>
to org.apache.zookeeper/zookeeper-server/3.4.14-SNAPSHOT/zookeeper-server-3.4.14-SNAPSHOT.pom
[Fast Archiver] No prior successful build to compare, so performing full copy of artifacts
[JENKINS] Archiving <https://builds.apache.org/job/PreCommit-ZOOKEEPER-github-pr-build-maven/ws/zookeeper-contrib/zookeeper-contrib-zooinspector/pom.xml>
to org.apache.zookeeper/zookeeper-contrib-zooinspector/3.4.14-SNAPSHOT/zookeeper-contrib-zooinspector-3.4.14-SNAPSHOT.pom
channel stopped
[SpotBugs] Skipping execution of recorder since overall result is 'FAILURE'
Putting comment on the pull request

Mime
View raw message