zookeeper-dev mailing list archives

Site index · List index
Message view « Date » · « Thread »
Top « Date » · « Thread »
From Apache Jenkins Server <jenk...@builds.apache.org>
Subject ZooKeeper_branch34_openjdk8 - Build # 512 - Still Failing
Date Sat, 16 Nov 2019 12:11:11 GMT
See https://builds.apache.org/job/ZooKeeper_branch34_openjdk8/512/

###################################################################################
########################## LAST 60 LINES OF THE CONSOLE ###########################
[...truncated 48.08 KB...]
    [junit] Running org.apache.zookeeper.test.SessionInvalidationTest
    [junit] Tests run: 1, Failures: 0, Errors: 0, Skipped: 0, Time elapsed: 5.69 sec
    [junit] Running org.apache.zookeeper.test.SessionTest
    [junit] Tests run: 5, Failures: 0, Errors: 0, Skipped: 0, Time elapsed: 16.358 sec
    [junit] Running org.apache.zookeeper.test.SessionTimeoutTest
    [junit] Tests run: 4, Failures: 0, Errors: 0, Skipped: 0, Time elapsed: 5.871 sec
    [junit] Running org.apache.zookeeper.test.StandaloneTest
    [junit] Tests run: 1, Failures: 0, Errors: 0, Skipped: 0, Time elapsed: 5.884 sec
    [junit] Running org.apache.zookeeper.test.StatTest
    [junit] Tests run: 4, Failures: 0, Errors: 0, Skipped: 0, Time elapsed: 5.987 sec
    [junit] Running org.apache.zookeeper.test.StaticHostProviderTest
    [junit] Tests run: 13, Failures: 0, Errors: 0, Skipped: 0, Time elapsed: 1.717 sec
    [junit] Running org.apache.zookeeper.test.SyncCallTest
    [junit] Tests run: 1, Failures: 0, Errors: 0, Skipped: 0, Time elapsed: 5.674 sec
    [junit] Running org.apache.zookeeper.test.TruncateTest
    [junit] Tests run: 3, Failures: 0, Errors: 0, Skipped: 0, Time elapsed: 14.64 sec
    [junit] Running org.apache.zookeeper.test.UpgradeTest
    [junit] Tests run: 1, Failures: 0, Errors: 0, Skipped: 0, Time elapsed: 1.023 sec
    [junit] Running org.apache.zookeeper.test.WatchedEventTest
    [junit] Tests run: 4, Failures: 0, Errors: 0, Skipped: 0, Time elapsed: 0.085 sec
    [junit] Running org.apache.zookeeper.test.WatcherFuncTest
    [junit] Tests run: 6, Failures: 0, Errors: 0, Skipped: 0, Time elapsed: 6.38 sec
    [junit] Running org.apache.zookeeper.test.WatcherTest
    [junit] Tests run: 7, Failures: 0, Errors: 0, Skipped: 0, Time elapsed: 32.903 sec
    [junit] Running org.apache.zookeeper.test.ZkDatabaseCorruptionTest
    [junit] Tests run: 1, Failures: 0, Errors: 0, Skipped: 0, Time elapsed: 17.025 sec
    [junit] Running org.apache.zookeeper.test.ZooKeeperQuotaTest
    [junit] Tests run: 1, Failures: 0, Errors: 0, Skipped: 0, Time elapsed: 5.691 sec
    [junit] Running org.apache.jute.BinaryInputArchiveTest
    [junit] Tests run: 1, Failures: 0, Errors: 0, Skipped: 0, Time elapsed: 0.097 sec

fail.build.on.test.failure:

BUILD FAILED
/home/jenkins/jenkins-slave/workspace/ZooKeeper_branch34_openjdk8/build.xml:1425: The following
error occurred while executing this line:
/home/jenkins/jenkins-slave/workspace/ZooKeeper_branch34_openjdk8/build.xml:1428: Tests failed!

Total time: 66 minutes 55 seconds
Build step 'Invoke Ant' marked build as failure
Archiving artifacts
No JDK named ?OpenJDK 8 (on Ubuntu only) ? found
ERROR: No tool found matching OPENJDK_8_ON_UBUNTU_ONLY__HOME
Recording test results
No JDK named ?OpenJDK 8 (on Ubuntu only) ? found
ERROR: No tool found matching OPENJDK_8_ON_UBUNTU_ONLY__HOME
No JDK named ?OpenJDK 8 (on Ubuntu only) ? found
ERROR: No tool found matching OPENJDK_8_ON_UBUNTU_ONLY__HOME
No JDK named ?OpenJDK 8 (on Ubuntu only) ? found
ERROR: No tool found matching OPENJDK_8_ON_UBUNTU_ONLY__HOME
Email was triggered for: Failure - Any
Sending email for trigger: Failure - Any
No JDK named ?OpenJDK 8 (on Ubuntu only) ? found
ERROR: No tool found matching OPENJDK_8_ON_UBUNTU_ONLY__HOME
No JDK named ?OpenJDK 8 (on Ubuntu only) ? found
ERROR: No tool found matching OPENJDK_8_ON_UBUNTU_ONLY__HOME
No JDK named ?OpenJDK 8 (on Ubuntu only) ? found
ERROR: No tool found matching OPENJDK_8_ON_UBUNTU_ONLY__HOME
No JDK named ?OpenJDK 8 (on Ubuntu only) ? found
ERROR: No tool found matching OPENJDK_8_ON_UBUNTU_ONLY__HOME



###################################################################################
############################## FAILED TESTS (if any) ##############################
36 tests failed.
FAILED:  org.apache.zookeeper.SaslAuthTest.testAuth

Error Message:
KeeperErrorCode = InvalidACL for /path1

Stack Trace:
org.apache.zookeeper.KeeperException$InvalidACLException: KeeperErrorCode = InvalidACL for
/path1
	at org.apache.zookeeper.KeeperException.create(KeeperException.java:124)
	at org.apache.zookeeper.KeeperException.create(KeeperException.java:54)
	at org.apache.zookeeper.ZooKeeper.create(ZooKeeper.java:800)
	at org.apache.zookeeper.SaslAuthTest.testAuth(SaslAuthTest.java:117)
	at org.apache.zookeeper.JUnit4ZKTestRunner$LoggedInvokeMethod.evaluate(JUnit4ZKTestRunner.java:55)


FAILED:  org.apache.zookeeper.server.quorum.QuorumCnxManagerTest.testAuthConnection

Error Message:
Failed to initialize authentication mechanism using SASL

Stack Trace:
javax.security.sasl.SaslException: Failed to initialize authentication mechanism using SASL
[Caused by javax.security.auth.login.LoginException: SASL-authentication failed because the
specified JAAS configuration section 'QuorumLearner' could not be found.]
	at org.apache.zookeeper.server.quorum.auth.SaslQuorumAuthLearner.<init>(SaslQuorumAuthLearner.java:72)
	at org.apache.zookeeper.server.quorum.QuorumCnxManagerTest.createAndStartManager(QuorumCnxManagerTest.java:739)
	at org.apache.zookeeper.server.quorum.QuorumCnxManagerTest.createAndStartManager(QuorumCnxManagerTest.java:728)
	at org.apache.zookeeper.server.quorum.QuorumCnxManagerTest.testAuthConnection(QuorumCnxManagerTest.java:167)
	at org.apache.zookeeper.JUnit4ZKTestRunner$LoggedInvokeMethod.evaluate(JUnit4ZKTestRunner.java:55)
	at java.util.concurrent.FutureTask.run(java.base@9-internal/FutureTask.java:266)
	at java.lang.Thread.run(java.base@9-internal/Thread.java:804)
Caused by: javax.security.auth.login.LoginException: SASL-authentication failed because the
specified JAAS configuration section 'QuorumLearner' could not be found.
	at org.apache.zookeeper.server.quorum.auth.SaslQuorumAuthLearner.<init>(SaslQuorumAuthLearner.java:63)


FAILED:  org.apache.zookeeper.server.quorum.QuorumCnxManagerTest.testSaslQuorumAuthServerWithInvalidQuorumAuthPacket

Error Message:
Failed to initialize authentication mechanism using SASL

Stack Trace:
javax.security.sasl.SaslException: Failed to initialize authentication mechanism using SASL
[Caused by javax.security.auth.login.LoginException: SASL-authentication failed because the
specified JAAS configuration section 'QuorumServer' could not be found.]
	at org.apache.zookeeper.server.quorum.auth.SaslQuorumAuthServer.<init>(SaslQuorumAuthServer.java:67)
	at org.apache.zookeeper.server.quorum.QuorumCnxManagerTest.testSaslQuorumAuthServerWithInvalidQuorumAuthPacket(QuorumCnxManagerTest.java:656)
	at org.apache.zookeeper.JUnit4ZKTestRunner$LoggedInvokeMethod.evaluate(JUnit4ZKTestRunner.java:55)
	at java.util.concurrent.FutureTask.run(java.base@9-internal/FutureTask.java:266)
	at java.lang.Thread.run(java.base@9-internal/Thread.java:804)
Caused by: javax.security.auth.login.LoginException: SASL-authentication failed because the
specified JAAS configuration section 'QuorumServer' could not be found.
	at org.apache.zookeeper.server.quorum.auth.SaslQuorumAuthServer.<init>(SaslQuorumAuthServer.java:58)


FAILED:  org.apache.zookeeper.server.quorum.QuorumCnxManagerTest.testAuthLearnerBadCredToNoAuthServerWithLowerSid

Error Message:
Failed to initialize authentication mechanism using SASL

Stack Trace:
javax.security.sasl.SaslException: Failed to initialize authentication mechanism using SASL
[Caused by javax.security.auth.login.LoginException: SASL-authentication failed because the
specified JAAS configuration section 'QuorumLearnerInvalid' could not be found.]
	at org.apache.zookeeper.server.quorum.auth.SaslQuorumAuthLearner.<init>(SaslQuorumAuthLearner.java:72)
	at org.apache.zookeeper.server.quorum.QuorumCnxManagerTest.createAndStartManager(QuorumCnxManagerTest.java:739)
	at org.apache.zookeeper.server.quorum.QuorumCnxManagerTest.createAndStartManager(QuorumCnxManagerTest.java:728)
	at org.apache.zookeeper.server.quorum.QuorumCnxManagerTest.testAuthLearnerBadCredToNoAuthServerWithLowerSid(QuorumCnxManagerTest.java:318)
	at org.apache.zookeeper.JUnit4ZKTestRunner$LoggedInvokeMethod.evaluate(JUnit4ZKTestRunner.java:55)
	at java.util.concurrent.FutureTask.run(java.base@9-internal/FutureTask.java:266)
	at java.lang.Thread.run(java.base@9-internal/Thread.java:804)
Caused by: javax.security.auth.login.LoginException: SASL-authentication failed because the
specified JAAS configuration section 'QuorumLearnerInvalid' could not be found.
	at org.apache.zookeeper.server.quorum.auth.SaslQuorumAuthLearner.<init>(SaslQuorumAuthLearner.java:63)


FAILED:  org.apache.zookeeper.server.quorum.QuorumCnxManagerTest.testAuthLearnerBadCredToAuthRequiredServerWithLowerSid

Error Message:
Failed to initialize authentication mechanism using SASL

Stack Trace:
javax.security.sasl.SaslException: Failed to initialize authentication mechanism using SASL
[Caused by javax.security.auth.login.LoginException: SASL-authentication failed because the
specified JAAS configuration section 'QuorumLearner' could not be found.]
	at org.apache.zookeeper.server.quorum.auth.SaslQuorumAuthLearner.<init>(SaslQuorumAuthLearner.java:72)
	at org.apache.zookeeper.server.quorum.QuorumCnxManagerTest.createAndStartManager(QuorumCnxManagerTest.java:739)
	at org.apache.zookeeper.server.quorum.QuorumCnxManagerTest.createAndStartManager(QuorumCnxManagerTest.java:728)
	at org.apache.zookeeper.server.quorum.QuorumCnxManagerTest.testAuthLearnerBadCredToAuthRequiredServerWithLowerSid(QuorumCnxManagerTest.java:268)
	at org.apache.zookeeper.JUnit4ZKTestRunner$LoggedInvokeMethod.evaluate(JUnit4ZKTestRunner.java:55)
	at java.util.concurrent.FutureTask.run(java.base@9-internal/FutureTask.java:266)
	at java.lang.Thread.run(java.base@9-internal/Thread.java:804)
Caused by: javax.security.auth.login.LoginException: SASL-authentication failed because the
specified JAAS configuration section 'QuorumLearner' could not be found.
	at org.apache.zookeeper.server.quorum.auth.SaslQuorumAuthLearner.<init>(SaslQuorumAuthLearner.java:63)


FAILED:  org.apache.zookeeper.server.quorum.QuorumCnxManagerTest.testAuthLearnerBadCredToNoAuthServerWithHigherSid

Error Message:
Failed to initialize authentication mechanism using SASL

Stack Trace:
javax.security.sasl.SaslException: Failed to initialize authentication mechanism using SASL
[Caused by javax.security.auth.login.LoginException: SASL-authentication failed because the
specified JAAS configuration section 'QuorumLearner' could not be found.]
	at org.apache.zookeeper.server.quorum.auth.SaslQuorumAuthLearner.<init>(SaslQuorumAuthLearner.java:72)
	at org.apache.zookeeper.server.quorum.QuorumCnxManagerTest.createAndStartManager(QuorumCnxManagerTest.java:739)
	at org.apache.zookeeper.server.quorum.QuorumCnxManagerTest.createAndStartManager(QuorumCnxManagerTest.java:728)
	at org.apache.zookeeper.server.quorum.QuorumCnxManagerTest.testAuthLearnerBadCredToNoAuthServerWithHigherSid(QuorumCnxManagerTest.java:302)
	at org.apache.zookeeper.JUnit4ZKTestRunner$LoggedInvokeMethod.evaluate(JUnit4ZKTestRunner.java:55)
	at java.util.concurrent.FutureTask.run(java.base@9-internal/FutureTask.java:266)
	at java.lang.Thread.run(java.base@9-internal/Thread.java:804)
Caused by: javax.security.auth.login.LoginException: SASL-authentication failed because the
specified JAAS configuration section 'QuorumLearner' could not be found.
	at org.apache.zookeeper.server.quorum.auth.SaslQuorumAuthLearner.<init>(SaslQuorumAuthLearner.java:63)


FAILED:  org.apache.zookeeper.server.quorum.QuorumCnxManagerTest.testNoAuthLearnerConnectsToServerWithAuthNotRequired

Error Message:
Failed to initialize authentication mechanism using SASL

Stack Trace:
javax.security.sasl.SaslException: Failed to initialize authentication mechanism using SASL
[Caused by javax.security.auth.login.LoginException: SASL-authentication failed because the
specified JAAS configuration section 'QuorumServer' could not be found.]
	at org.apache.zookeeper.server.quorum.auth.SaslQuorumAuthServer.<init>(SaslQuorumAuthServer.java:67)
	at org.apache.zookeeper.server.quorum.QuorumCnxManagerTest.createQuorumPeer(QuorumCnxManagerTest.java:819)
	at org.apache.zookeeper.server.quorum.QuorumCnxManagerTest.testNoAuthLearnerConnectsToServerWithAuthNotRequired(QuorumCnxManagerTest.java:533)
	at org.apache.zookeeper.JUnit4ZKTestRunner$LoggedInvokeMethod.evaluate(JUnit4ZKTestRunner.java:55)
	at java.util.concurrent.FutureTask.run(java.base@9-internal/FutureTask.java:266)
	at java.lang.Thread.run(java.base@9-internal/Thread.java:804)
Caused by: javax.security.auth.login.LoginException: SASL-authentication failed because the
specified JAAS configuration section 'QuorumServer' could not be found.
	at org.apache.zookeeper.server.quorum.auth.SaslQuorumAuthServer.<init>(SaslQuorumAuthServer.java:58)


FAILED:  org.apache.zookeeper.server.quorum.QuorumCnxManagerTest.testAuthLearnerBadCredToAuthRequiredServerWithHigherSid

Error Message:
Failed to initialize authentication mechanism using SASL

Stack Trace:
javax.security.sasl.SaslException: Failed to initialize authentication mechanism using SASL
[Caused by javax.security.auth.login.LoginException: SASL-authentication failed because the
specified JAAS configuration section 'QuorumLearnerInvalid' could not be found.]
	at org.apache.zookeeper.server.quorum.auth.SaslQuorumAuthLearner.<init>(SaslQuorumAuthLearner.java:72)
	at org.apache.zookeeper.server.quorum.QuorumCnxManagerTest.createAndStartManager(QuorumCnxManagerTest.java:739)
	at org.apache.zookeeper.server.quorum.QuorumCnxManagerTest.createAndStartManager(QuorumCnxManagerTest.java:728)
	at org.apache.zookeeper.server.quorum.QuorumCnxManagerTest.testAuthLearnerBadCredToAuthRequiredServerWithHigherSid(QuorumCnxManagerTest.java:286)
	at org.apache.zookeeper.JUnit4ZKTestRunner$LoggedInvokeMethod.evaluate(JUnit4ZKTestRunner.java:55)
	at java.util.concurrent.FutureTask.run(java.base@9-internal/FutureTask.java:266)
	at java.lang.Thread.run(java.base@9-internal/Thread.java:804)
Caused by: javax.security.auth.login.LoginException: SASL-authentication failed because the
specified JAAS configuration section 'QuorumLearnerInvalid' could not be found.
	at org.apache.zookeeper.server.quorum.auth.SaslQuorumAuthLearner.<init>(SaslQuorumAuthLearner.java:63)


FAILED:  org.apache.zookeeper.server.quorum.QuorumCnxManagerTest.testClientAuthAgainstNoAuthServerWithLowerSid

Error Message:
Failed to initialize authentication mechanism using SASL

Stack Trace:
javax.security.sasl.SaslException: Failed to initialize authentication mechanism using SASL
[Caused by javax.security.auth.login.LoginException: SASL-authentication failed because the
specified JAAS configuration section 'QuorumLearner' could not be found.]
	at org.apache.zookeeper.server.quorum.auth.SaslQuorumAuthLearner.<init>(SaslQuorumAuthLearner.java:72)
	at org.apache.zookeeper.server.quorum.QuorumCnxManagerTest.createAndStartManager(QuorumCnxManagerTest.java:739)
	at org.apache.zookeeper.server.quorum.QuorumCnxManagerTest.createAndStartManager(QuorumCnxManagerTest.java:728)
	at org.apache.zookeeper.server.quorum.QuorumCnxManagerTest.testClientAuthAgainstNoAuthServerWithLowerSid(QuorumCnxManagerTest.java:185)
	at org.apache.zookeeper.JUnit4ZKTestRunner$LoggedInvokeMethod.evaluate(JUnit4ZKTestRunner.java:55)
	at java.util.concurrent.FutureTask.run(java.base@9-internal/FutureTask.java:266)
	at java.lang.Thread.run(java.base@9-internal/Thread.java:804)
Caused by: javax.security.auth.login.LoginException: SASL-authentication failed because the
specified JAAS configuration section 'QuorumLearner' could not be found.
	at org.apache.zookeeper.server.quorum.auth.SaslQuorumAuthLearner.<init>(SaslQuorumAuthLearner.java:63)


FAILED:  org.apache.zookeeper.server.quorum.QuorumCnxManagerTest.testNoAuthLearnerConnectsToServerWithAuthRequired

Error Message:
Failed to initialize authentication mechanism using SASL

Stack Trace:
javax.security.sasl.SaslException: Failed to initialize authentication mechanism using SASL
[Caused by javax.security.auth.login.LoginException: SASL-authentication failed because the
specified JAAS configuration section 'QuorumServer' could not be found.]
	at org.apache.zookeeper.server.quorum.auth.SaslQuorumAuthServer.<init>(SaslQuorumAuthServer.java:67)
	at org.apache.zookeeper.server.quorum.QuorumCnxManagerTest.createQuorumPeer(QuorumCnxManagerTest.java:819)
	at org.apache.zookeeper.server.quorum.QuorumCnxManagerTest.testNoAuthLearnerConnectsToServerWithAuthRequired(QuorumCnxManagerTest.java:573)
	at org.apache.zookeeper.JUnit4ZKTestRunner$LoggedInvokeMethod.evaluate(JUnit4ZKTestRunner.java:55)
	at java.util.concurrent.FutureTask.run(java.base@9-internal/FutureTask.java:266)
	at java.lang.Thread.run(java.base@9-internal/Thread.java:804)
Caused by: javax.security.auth.login.LoginException: SASL-authentication failed because the
specified JAAS configuration section 'QuorumServer' could not be found.
	at org.apache.zookeeper.server.quorum.auth.SaslQuorumAuthServer.<init>(SaslQuorumAuthServer.java:58)


FAILED:  org.apache.zookeeper.server.quorum.QuorumCnxManagerTest.testNoAuthLearnerConnectToAuthRequiredServerWithHigherSid

Error Message:
Failed to initialize authentication mechanism using SASL

Stack Trace:
javax.security.sasl.SaslException: Failed to initialize authentication mechanism using SASL
[Caused by javax.security.auth.login.LoginException: SASL-authentication failed because the
specified JAAS configuration section 'QuorumLearner' could not be found.]
	at org.apache.zookeeper.server.quorum.auth.SaslQuorumAuthLearner.<init>(SaslQuorumAuthLearner.java:72)
	at org.apache.zookeeper.server.quorum.QuorumCnxManagerTest.createAndStartManager(QuorumCnxManagerTest.java:739)
	at org.apache.zookeeper.server.quorum.QuorumCnxManagerTest.testNoAuthLearnerConnectToAuthRequiredServerWithHigherSid(QuorumCnxManagerTest.java:249)
	at org.apache.zookeeper.JUnit4ZKTestRunner$LoggedInvokeMethod.evaluate(JUnit4ZKTestRunner.java:55)
	at java.util.concurrent.FutureTask.run(java.base@9-internal/FutureTask.java:266)
	at java.lang.Thread.run(java.base@9-internal/Thread.java:804)
Caused by: javax.security.auth.login.LoginException: SASL-authentication failed because the
specified JAAS configuration section 'QuorumLearner' could not be found.
	at org.apache.zookeeper.server.quorum.auth.SaslQuorumAuthLearner.<init>(SaslQuorumAuthLearner.java:63)


FAILED:  org.apache.zookeeper.server.quorum.QuorumCnxManagerTest.testAuthLearnerConnectsToServerWithAuthNotRequired

Error Message:
Failed to initialize authentication mechanism using SASL

Stack Trace:
javax.security.sasl.SaslException: Failed to initialize authentication mechanism using SASL
[Caused by javax.security.auth.login.LoginException: SASL-authentication failed because the
specified JAAS configuration section 'QuorumServer' could not be found.]
	at org.apache.zookeeper.server.quorum.auth.SaslQuorumAuthServer.<init>(SaslQuorumAuthServer.java:67)
	at org.apache.zookeeper.server.quorum.QuorumCnxManagerTest.createQuorumPeer(QuorumCnxManagerTest.java:819)
	at org.apache.zookeeper.server.quorum.QuorumCnxManagerTest.testAuthLearnerConnectsToServerWithAuthNotRequired(QuorumCnxManagerTest.java:425)
	at org.apache.zookeeper.JUnit4ZKTestRunner$LoggedInvokeMethod.evaluate(JUnit4ZKTestRunner.java:55)
	at java.util.concurrent.FutureTask.run(java.base@9-internal/FutureTask.java:266)
	at java.lang.Thread.run(java.base@9-internal/Thread.java:804)
Caused by: javax.security.auth.login.LoginException: SASL-authentication failed because the
specified JAAS configuration section 'QuorumServer' could not be found.
	at org.apache.zookeeper.server.quorum.auth.SaslQuorumAuthServer.<init>(SaslQuorumAuthServer.java:58)


FAILED:  org.apache.zookeeper.server.quorum.QuorumCnxManagerTest.testLearnerHandlerAuthFailed

Error Message:
Failed to initialize authentication mechanism using SASL

Stack Trace:
javax.security.sasl.SaslException: Failed to initialize authentication mechanism using SASL
[Caused by javax.security.auth.login.LoginException: SASL-authentication failed because the
specified JAAS configuration section 'QuorumServer' could not be found.]
	at org.apache.zookeeper.server.quorum.auth.SaslQuorumAuthServer.<init>(SaslQuorumAuthServer.java:67)
	at org.apache.zookeeper.server.quorum.QuorumCnxManagerTest.createQuorumPeer(QuorumCnxManagerTest.java:819)
	at org.apache.zookeeper.server.quorum.QuorumCnxManagerTest.testLearnerHandlerAuthFailed(QuorumCnxManagerTest.java:340)
	at org.apache.zookeeper.JUnit4ZKTestRunner$LoggedInvokeMethod.evaluate(JUnit4ZKTestRunner.java:55)
	at java.util.concurrent.FutureTask.run(java.base@9-internal/FutureTask.java:266)
	at java.lang.Thread.run(java.base@9-internal/Thread.java:804)
Caused by: javax.security.auth.login.LoginException: SASL-authentication failed because the
specified JAAS configuration section 'QuorumServer' could not be found.
	at org.apache.zookeeper.server.quorum.auth.SaslQuorumAuthServer.<init>(SaslQuorumAuthServer.java:58)


FAILED:  org.apache.zookeeper.server.quorum.QuorumCnxManagerTest.testAuthLearnerConnectsToServerWithAuthRequired

Error Message:
Failed to initialize authentication mechanism using SASL

Stack Trace:
javax.security.sasl.SaslException: Failed to initialize authentication mechanism using SASL
[Caused by javax.security.auth.login.LoginException: SASL-authentication failed because the
specified JAAS configuration section 'QuorumServer' could not be found.]
	at org.apache.zookeeper.server.quorum.auth.SaslQuorumAuthServer.<init>(SaslQuorumAuthServer.java:67)
	at org.apache.zookeeper.server.quorum.QuorumCnxManagerTest.createQuorumPeer(QuorumCnxManagerTest.java:819)
	at org.apache.zookeeper.server.quorum.QuorumCnxManagerTest.testAuthLearnerConnectsToServerWithAuthRequired(QuorumCnxManagerTest.java:370)
	at org.apache.zookeeper.JUnit4ZKTestRunner$LoggedInvokeMethod.evaluate(JUnit4ZKTestRunner.java:55)
	at java.util.concurrent.FutureTask.run(java.base@9-internal/FutureTask.java:266)
	at java.lang.Thread.run(java.base@9-internal/Thread.java:804)
Caused by: javax.security.auth.login.LoginException: SASL-authentication failed because the
specified JAAS configuration section 'QuorumServer' could not be found.
	at org.apache.zookeeper.server.quorum.auth.SaslQuorumAuthServer.<init>(SaslQuorumAuthServer.java:58)


FAILED:  org.apache.zookeeper.server.quorum.QuorumCnxManagerTest.testClientAuthAgainstNoAuthServerWithHigherSid

Error Message:
Failed to initialize authentication mechanism using SASL

Stack Trace:
javax.security.sasl.SaslException: Failed to initialize authentication mechanism using SASL
[Caused by javax.security.auth.login.LoginException: SASL-authentication failed because the
specified JAAS configuration section 'QuorumLearner' could not be found.]
	at org.apache.zookeeper.server.quorum.auth.SaslQuorumAuthLearner.<init>(SaslQuorumAuthLearner.java:72)
	at org.apache.zookeeper.server.quorum.QuorumCnxManagerTest.createAndStartManager(QuorumCnxManagerTest.java:739)
	at org.apache.zookeeper.server.quorum.QuorumCnxManagerTest.createAndStartManager(QuorumCnxManagerTest.java:728)
	at org.apache.zookeeper.server.quorum.QuorumCnxManagerTest.testClientAuthAgainstNoAuthServerWithHigherSid(QuorumCnxManagerTest.java:202)
	at org.apache.zookeeper.JUnit4ZKTestRunner$LoggedInvokeMethod.evaluate(JUnit4ZKTestRunner.java:55)
	at java.util.concurrent.FutureTask.run(java.base@9-internal/FutureTask.java:266)
	at java.lang.Thread.run(java.base@9-internal/Thread.java:804)
Caused by: javax.security.auth.login.LoginException: SASL-authentication failed because the
specified JAAS configuration section 'QuorumLearner' could not be found.
	at org.apache.zookeeper.server.quorum.auth.SaslQuorumAuthLearner.<init>(SaslQuorumAuthLearner.java:63)


FAILED:  org.apache.zookeeper.server.quorum.QuorumCnxManagerTest.testNoAuthLearnerConnectsToNullAuthServer

Error Message:
Failed to initialize authentication mechanism using SASL

Stack Trace:
javax.security.sasl.SaslException: Failed to initialize authentication mechanism using SASL
[Caused by javax.security.auth.login.LoginException: SASL-authentication failed because the
specified JAAS configuration section 'QuorumServer' could not be found.]
	at org.apache.zookeeper.server.quorum.auth.SaslQuorumAuthServer.<init>(SaslQuorumAuthServer.java:67)
	at org.apache.zookeeper.server.quorum.QuorumCnxManagerTest.createQuorumPeer(QuorumCnxManagerTest.java:819)
	at org.apache.zookeeper.server.quorum.QuorumCnxManagerTest.testNoAuthLearnerConnectsToNullAuthServer(QuorumCnxManagerTest.java:612)
	at org.apache.zookeeper.JUnit4ZKTestRunner$LoggedInvokeMethod.evaluate(JUnit4ZKTestRunner.java:55)
	at java.util.concurrent.FutureTask.run(java.base@9-internal/FutureTask.java:266)
	at java.lang.Thread.run(java.base@9-internal/Thread.java:804)
Caused by: javax.security.auth.login.LoginException: SASL-authentication failed because the
specified JAAS configuration section 'QuorumServer' could not be found.
	at org.apache.zookeeper.server.quorum.auth.SaslQuorumAuthServer.<init>(SaslQuorumAuthServer.java:58)


FAILED:  org.apache.zookeeper.server.quorum.QuorumCnxManagerTest.testAuthLearnerConnectsToNullAuthServer

Error Message:
Failed to initialize authentication mechanism using SASL

Stack Trace:
javax.security.sasl.SaslException: Failed to initialize authentication mechanism using SASL
[Caused by javax.security.auth.login.LoginException: SASL-authentication failed because the
specified JAAS configuration section 'QuorumServer' could not be found.]
	at org.apache.zookeeper.server.quorum.auth.SaslQuorumAuthServer.<init>(SaslQuorumAuthServer.java:67)
	at org.apache.zookeeper.server.quorum.QuorumCnxManagerTest.createQuorumPeer(QuorumCnxManagerTest.java:819)
	at org.apache.zookeeper.server.quorum.QuorumCnxManagerTest.testAuthLearnerConnectsToNullAuthServer(QuorumCnxManagerTest.java:486)
	at org.apache.zookeeper.JUnit4ZKTestRunner$LoggedInvokeMethod.evaluate(JUnit4ZKTestRunner.java:55)
	at java.util.concurrent.FutureTask.run(java.base@9-internal/FutureTask.java:266)
	at java.lang.Thread.run(java.base@9-internal/Thread.java:804)
Caused by: javax.security.auth.login.LoginException: SASL-authentication failed because the
specified JAAS configuration section 'QuorumServer' could not be found.
	at org.apache.zookeeper.server.quorum.auth.SaslQuorumAuthServer.<init>(SaslQuorumAuthServer.java:58)


FAILED:  org.apache.zookeeper.server.quorum.QuorumCnxManagerTest.testNoAuthLearnerConnectToAuthRequiredServerWithLowerSid

Error Message:
Failed to initialize authentication mechanism using SASL

Stack Trace:
javax.security.sasl.SaslException: Failed to initialize authentication mechanism using SASL
[Caused by javax.security.auth.login.LoginException: SASL-authentication failed because the
specified JAAS configuration section 'QuorumLearner' could not be found.]
	at org.apache.zookeeper.server.quorum.auth.SaslQuorumAuthLearner.<init>(SaslQuorumAuthLearner.java:72)
	at org.apache.zookeeper.server.quorum.QuorumCnxManagerTest.createAndStartManager(QuorumCnxManagerTest.java:739)
	at org.apache.zookeeper.server.quorum.QuorumCnxManagerTest.createAndStartManager(QuorumCnxManagerTest.java:728)
	at org.apache.zookeeper.server.quorum.QuorumCnxManagerTest.testNoAuthLearnerConnectToAuthRequiredServerWithLowerSid(QuorumCnxManagerTest.java:218)
	at org.apache.zookeeper.JUnit4ZKTestRunner$LoggedInvokeMethod.evaluate(JUnit4ZKTestRunner.java:55)
	at java.util.concurrent.FutureTask.run(java.base@9-internal/FutureTask.java:266)
	at java.lang.Thread.run(java.base@9-internal/Thread.java:804)
Caused by: javax.security.auth.login.LoginException: SASL-authentication failed because the
specified JAAS configuration section 'QuorumLearner' could not be found.
	at org.apache.zookeeper.server.quorum.auth.SaslQuorumAuthLearner.<init>(SaslQuorumAuthLearner.java:63)


FAILED:  junit.framework.TestSuite.org.apache.zookeeper.server.quorum.auth.ApacheDSMiniKdcTest

Error Message:
class org.apache.zookeeper.server.quorum.auth.ApacheDSMiniKdc cannot access class sun.security.krb5.Config
(in module java.security.jgss) because module java.security.jgss does not export sun.security.krb5
to unnamed module @724f138e

Stack Trace:
java.lang.IllegalAccessException: class org.apache.zookeeper.server.quorum.auth.ApacheDSMiniKdc
cannot access class sun.security.krb5.Config (in module java.security.jgss) because module
java.security.jgss does not export sun.security.krb5 to unnamed module @724f138e
	at java.lang.reflect.AccessibleObject.slowCheckMemberAccess(java.base@9-internal/AccessibleObject.java:355)
	at java.lang.reflect.AccessibleObject.checkAccess(java.base@9-internal/AccessibleObject.java:347)
	at org.apache.zookeeper.server.quorum.auth.ApacheDSMiniKdc.initKDCServer(ApacheDSMiniKdc.java:479)
	at org.apache.zookeeper.server.quorum.auth.ApacheDSMiniKdc.start(ApacheDSMiniKdc.java:330)
	at org.apache.zookeeper.server.quorum.auth.ApacheDSKerberosSecurityTestcase.startMiniKdc(ApacheDSKerberosSecurityTestcase.java:70)
	at org.apache.zookeeper.server.quorum.auth.ApacheDSKerberosSecurityTestcase.setUpSasl(ApacheDSKerberosSecurityTestcase.java:56)


FAILED:  org.apache.zookeeper.server.quorum.auth.QuorumAuthUpgradeTest.testAuthLearnerAgainstNullAuthServer

Error Message:
test timed out after 30000 milliseconds

Stack Trace:
org.junit.runners.model.TestTimedOutException: test timed out after 30000 milliseconds
	at java.lang.Thread.sleep(java.base@9-internal/Native Method)
	at org.apache.zookeeper.test.ClientBase.waitForServerUp(ClientBase.java:297)
	at org.apache.zookeeper.server.quorum.auth.QuorumAuthTestBase.startQuorum(QuorumAuthTestBase.java:76)
	at org.apache.zookeeper.server.quorum.auth.QuorumAuthUpgradeTest.testAuthLearnerAgainstNullAuthServer(QuorumAuthUpgradeTest.java:106)
	at org.apache.zookeeper.JUnit4ZKTestRunner$LoggedInvokeMethod.evaluate(JUnit4ZKTestRunner.java:55)
	at java.util.concurrent.FutureTask.run(java.base@9-internal/FutureTask.java:266)
	at java.lang.Thread.run(java.base@9-internal/Thread.java:804)


FAILED:  org.apache.zookeeper.server.quorum.auth.QuorumAuthUpgradeTest.testRollingUpgrade

Error Message:
waiting for server0being up

Stack Trace:
junit.framework.AssertionFailedError: waiting for server0being up
	at org.apache.zookeeper.server.quorum.auth.QuorumAuthUpgradeTest.restartServer(QuorumAuthUpgradeTest.java:232)
	at org.apache.zookeeper.server.quorum.auth.QuorumAuthUpgradeTest.testRollingUpgrade(QuorumAuthUpgradeTest.java:194)
	at org.apache.zookeeper.JUnit4ZKTestRunner$LoggedInvokeMethod.evaluate(JUnit4ZKTestRunner.java:55)
	at java.util.concurrent.FutureTask.run(java.base@9-internal/FutureTask.java:266)
	at java.lang.Thread.run(java.base@9-internal/Thread.java:804)


FAILED:  org.apache.zookeeper.server.quorum.auth.QuorumAuthUpgradeTest.testAuthLearnerAgainstNoAuthRequiredServer

Error Message:
test timed out after 30000 milliseconds

Stack Trace:
org.junit.runners.model.TestTimedOutException: test timed out after 30000 milliseconds
	at java.lang.Thread.sleep(java.base@9-internal/Native Method)
	at org.apache.zookeeper.test.ClientBase.waitForServerUp(ClientBase.java:297)
	at org.apache.zookeeper.server.quorum.auth.QuorumAuthTestBase.startQuorum(QuorumAuthTestBase.java:76)
	at org.apache.zookeeper.server.quorum.auth.QuorumAuthUpgradeTest.testAuthLearnerAgainstNoAuthRequiredServer(QuorumAuthUpgradeTest.java:126)
	at org.apache.zookeeper.JUnit4ZKTestRunner$LoggedInvokeMethod.evaluate(JUnit4ZKTestRunner.java:55)
	at java.util.concurrent.FutureTask.run(java.base@9-internal/FutureTask.java:266)
	at java.lang.Thread.run(java.base@9-internal/Thread.java:804)


FAILED:  org.apache.zookeeper.server.quorum.auth.QuorumAuthUpgradeTest.testAuthLearnerServer

Error Message:
test timed out after 30000 milliseconds

Stack Trace:
org.junit.runners.model.TestTimedOutException: test timed out after 30000 milliseconds
	at java.lang.Thread.sleep(java.base@9-internal/Native Method)
	at org.apache.zookeeper.test.ClientBase.waitForServerUp(ClientBase.java:297)
	at org.apache.zookeeper.server.quorum.auth.QuorumAuthTestBase.startQuorum(QuorumAuthTestBase.java:76)
	at org.apache.zookeeper.server.quorum.auth.QuorumAuthUpgradeTest.testAuthLearnerServer(QuorumAuthUpgradeTest.java:148)
	at org.apache.zookeeper.JUnit4ZKTestRunner$LoggedInvokeMethod.evaluate(JUnit4ZKTestRunner.java:55)
	at java.util.concurrent.FutureTask.run(java.base@9-internal/FutureTask.java:266)
	at java.lang.Thread.run(java.base@9-internal/Thread.java:804)


FAILED:  org.apache.zookeeper.server.quorum.auth.QuorumDigestAuthTest.testObserverWithValidCredentials

Error Message:
test timed out after 30000 milliseconds

Stack Trace:
org.junit.runners.model.TestTimedOutException: test timed out after 30000 milliseconds
	at java.lang.Thread.sleep(java.base@9-internal/Native Method)
	at org.apache.zookeeper.test.ClientBase.waitForServerUp(ClientBase.java:297)
	at org.apache.zookeeper.server.quorum.auth.QuorumAuthTestBase.startQuorum(QuorumAuthTestBase.java:105)
	at org.apache.zookeeper.server.quorum.auth.QuorumDigestAuthTest.testObserverWithValidCredentials(QuorumDigestAuthTest.java:240)
	at org.apache.zookeeper.JUnit4ZKTestRunner$LoggedInvokeMethod.evaluate(JUnit4ZKTestRunner.java:55)
	at java.util.concurrent.FutureTask.run(java.base@9-internal/FutureTask.java:266)
	at java.lang.Thread.run(java.base@9-internal/Thread.java:804)


FAILED:  org.apache.zookeeper.server.quorum.auth.QuorumDigestAuthTest.testValidCredentials

Error Message:
test timed out after 30000 milliseconds

Stack Trace:
org.junit.runners.model.TestTimedOutException: test timed out after 30000 milliseconds
	at java.lang.Thread.sleep(java.base@9-internal/Native Method)
	at org.apache.zookeeper.test.ClientBase.waitForServerUp(ClientBase.java:297)
	at org.apache.zookeeper.server.quorum.auth.QuorumAuthTestBase.startQuorum(QuorumAuthTestBase.java:76)
	at org.apache.zookeeper.server.quorum.auth.QuorumDigestAuthTest.testValidCredentials(QuorumDigestAuthTest.java:90)
	at org.apache.zookeeper.JUnit4ZKTestRunner$LoggedInvokeMethod.evaluate(JUnit4ZKTestRunner.java:55)
	at java.util.concurrent.FutureTask.run(java.base@9-internal/FutureTask.java:266)
	at java.lang.Thread.run(java.base@9-internal/Thread.java:804)


FAILED:  org.apache.zookeeper.server.quorum.auth.QuorumDigestAuthTest.testRelectionWithValidCredentials

Error Message:
test timed out after 30000 milliseconds

Stack Trace:
org.junit.runners.model.TestTimedOutException: test timed out after 30000 milliseconds
	at java.lang.Thread.sleep(java.base@9-internal/Native Method)
	at org.apache.zookeeper.test.ClientBase.waitForServerUp(ClientBase.java:297)
	at org.apache.zookeeper.server.quorum.auth.QuorumAuthTestBase.startQuorum(QuorumAuthTestBase.java:76)
	at org.apache.zookeeper.server.quorum.auth.QuorumDigestAuthTest.testRelectionWithValidCredentials(QuorumDigestAuthTest.java:313)
	at org.apache.zookeeper.JUnit4ZKTestRunner$LoggedInvokeMethod.evaluate(JUnit4ZKTestRunner.java:55)
	at java.util.concurrent.FutureTask.run(java.base@9-internal/FutureTask.java:266)
	at java.lang.Thread.run(java.base@9-internal/Thread.java:804)


FAILED:  org.apache.zookeeper.server.quorum.auth.QuorumDigestAuthTest.testNonAuthEnabledObserverJoiningAuthEnabledQuorum

Error Message:
test timed out after 30000 milliseconds

Stack Trace:
org.junit.runners.model.TestTimedOutException: test timed out after 30000 milliseconds
	at java.lang.Thread.sleep(java.base@9-internal/Native Method)
	at org.apache.zookeeper.test.ClientBase.waitForServerUp(ClientBase.java:297)
	at org.apache.zookeeper.server.quorum.auth.QuorumAuthTestBase.startQuorum(QuorumAuthTestBase.java:76)
	at org.apache.zookeeper.server.quorum.auth.QuorumDigestAuthTest.testNonAuthEnabledObserverJoiningAuthEnabledQuorum(QuorumDigestAuthTest.java:264)
	at org.apache.zookeeper.JUnit4ZKTestRunner$LoggedInvokeMethod.evaluate(JUnit4ZKTestRunner.java:55)
	at java.util.concurrent.FutureTask.run(java.base@9-internal/FutureTask.java:266)
	at java.lang.Thread.run(java.base@9-internal/Thread.java:804)


FAILED:  org.apache.zookeeper.server.quorum.auth.QuorumKerberosAuthTest.testValidCredentials

Error Message:
waiting for server 0 being up

Stack Trace:
junit.framework.AssertionFailedError: waiting for server 0 being up
	at org.apache.zookeeper.server.quorum.auth.QuorumAuthTestBase.startQuorum(QuorumAuthTestBase.java:75)
	at org.apache.zookeeper.server.quorum.auth.QuorumKerberosAuthTest.testValidCredentials(QuorumKerberosAuthTest.java:114)
	at org.apache.zookeeper.JUnit4ZKTestRunner$LoggedInvokeMethod.evaluate(JUnit4ZKTestRunner.java:55)
	at java.util.concurrent.FutureTask.run(java.base@9-internal/FutureTask.java:266)
	at java.lang.Thread.run(java.base@9-internal/Thread.java:804)


FAILED:  org.apache.zookeeper.server.quorum.auth.QuorumKerberosHostBasedAuthTest.testConnectBadServer

Error Message:
waiting for server 0 being up

Stack Trace:
junit.framework.AssertionFailedError: waiting for server 0 being up
	at org.apache.zookeeper.server.quorum.auth.QuorumAuthTestBase.startQuorum(QuorumAuthTestBase.java:75)
	at org.apache.zookeeper.server.quorum.auth.QuorumKerberosHostBasedAuthTest.testConnectBadServer(QuorumKerberosHostBasedAuthTest.java:158)
	at org.apache.zookeeper.JUnit4ZKTestRunner$LoggedInvokeMethod.evaluate(JUnit4ZKTestRunner.java:55)
	at java.util.concurrent.FutureTask.run(java.base@9-internal/FutureTask.java:266)
	at java.lang.Thread.run(java.base@9-internal/Thread.java:804)


FAILED:  org.apache.zookeeper.server.quorum.auth.QuorumKerberosHostBasedAuthTest.testValidCredentials

Error Message:
waiting for server 0 being up

Stack Trace:
junit.framework.AssertionFailedError: waiting for server 0 being up
	at org.apache.zookeeper.server.quorum.auth.QuorumAuthTestBase.startQuorum(QuorumAuthTestBase.java:75)
	at org.apache.zookeeper.server.quorum.auth.QuorumKerberosHostBasedAuthTest.testValidCredentials(QuorumKerberosHostBasedAuthTest.java:137)
	at org.apache.zookeeper.JUnit4ZKTestRunner$LoggedInvokeMethod.evaluate(JUnit4ZKTestRunner.java:55)
	at java.util.concurrent.FutureTask.run(java.base@9-internal/FutureTask.java:266)
	at java.lang.Thread.run(java.base@9-internal/Thread.java:804)


FAILED:  org.apache.zookeeper.test.SaslAuthDesignatedClientTest.testAuth

Error Message:
test failed :org.apache.zookeeper.KeeperException$InvalidACLException: KeeperErrorCode = InvalidACL
for /path1

Stack Trace:
junit.framework.AssertionFailedError: test failed :org.apache.zookeeper.KeeperException$InvalidACLException:
KeeperErrorCode = InvalidACL for /path1
	at org.apache.zookeeper.test.SaslAuthDesignatedClientTest.testAuth(SaslAuthDesignatedClientTest.java:75)
	at org.apache.zookeeper.JUnit4ZKTestRunner$LoggedInvokeMethod.evaluate(JUnit4ZKTestRunner.java:55)


FAILED:  org.apache.zookeeper.test.SaslAuthDesignatedClientTest.testSaslConfig

Error Message:
null

Stack Trace:
java.lang.NullPointerException
	at org.apache.zookeeper.test.SaslAuthDesignatedClientTest.testSaslConfig(SaslAuthDesignatedClientTest.java:88)
	at org.apache.zookeeper.JUnit4ZKTestRunner$LoggedInvokeMethod.evaluate(JUnit4ZKTestRunner.java:55)


FAILED:  org.apache.zookeeper.test.SaslAuthDesignatedServerTest.testAuth

Error Message:
test failed :org.apache.zookeeper.KeeperException$AuthFailedException: KeeperErrorCode = AuthFailed
for /path1

Stack Trace:
junit.framework.AssertionFailedError: test failed :org.apache.zookeeper.KeeperException$AuthFailedException:
KeeperErrorCode = AuthFailed for /path1
	at org.apache.zookeeper.test.SaslAuthDesignatedServerTest.testAuth(SaslAuthDesignatedServerTest.java:98)
	at org.apache.zookeeper.JUnit4ZKTestRunner$LoggedInvokeMethod.evaluate(JUnit4ZKTestRunner.java:55)


FAILED:  org.apache.zookeeper.test.SaslAuthFailNotifyTest.testBadSaslAuthNotifiesWatch

Error Message:
Timeout occurred. Please note the time in the report does not reflect the time until the timeout.

Stack Trace:
junit.framework.AssertionFailedError: Timeout occurred. Please note the time in the report
does not reflect the time until the timeout.


FAILED:  junit.framework.TestSuite.org.apache.zookeeper.server.quorum.auth.ApacheDSQuorumKerberosAuthTest

Error Message:
class org.apache.zookeeper.server.quorum.auth.ApacheDSMiniKdc cannot access class sun.security.krb5.Config
(in module java.security.jgss) because module java.security.jgss does not export sun.security.krb5
to unnamed module @26be6ca7

Stack Trace:
java.lang.IllegalAccessException: class org.apache.zookeeper.server.quorum.auth.ApacheDSMiniKdc
cannot access class sun.security.krb5.Config (in module java.security.jgss) because module
java.security.jgss does not export sun.security.krb5 to unnamed module @26be6ca7
	at java.lang.reflect.AccessibleObject.slowCheckMemberAccess(java.base@9-internal/AccessibleObject.java:355)
	at java.lang.reflect.AccessibleObject.checkAccess(java.base@9-internal/AccessibleObject.java:347)
	at org.apache.zookeeper.server.quorum.auth.ApacheDSMiniKdc.initKDCServer(ApacheDSMiniKdc.java:479)
	at org.apache.zookeeper.server.quorum.auth.ApacheDSMiniKdc.start(ApacheDSMiniKdc.java:330)
	at org.apache.zookeeper.server.quorum.auth.ApacheDSKerberosSecurityTestcase.startMiniKdc(ApacheDSKerberosSecurityTestcase.java:70)
	at org.apache.zookeeper.server.quorum.auth.ApacheDSKerberosSecurityTestcase.setUpSasl(ApacheDSKerberosSecurityTestcase.java:56)


FAILED:  junit.framework.TestSuite.org.apache.zookeeper.server.quorum.auth.ApacheDSQuorumKerberosHostBasedAuthTest

Error Message:
class org.apache.zookeeper.server.quorum.auth.ApacheDSMiniKdc cannot access class sun.security.krb5.Config
(in module java.security.jgss) because module java.security.jgss does not export sun.security.krb5
to unnamed module @70fab835

Stack Trace:
java.lang.IllegalAccessException: class org.apache.zookeeper.server.quorum.auth.ApacheDSMiniKdc
cannot access class sun.security.krb5.Config (in module java.security.jgss) because module
java.security.jgss does not export sun.security.krb5 to unnamed module @70fab835
	at java.lang.reflect.AccessibleObject.slowCheckMemberAccess(java.base@9-internal/AccessibleObject.java:355)
	at java.lang.reflect.AccessibleObject.checkAccess(java.base@9-internal/AccessibleObject.java:347)
	at org.apache.zookeeper.server.quorum.auth.ApacheDSMiniKdc.initKDCServer(ApacheDSMiniKdc.java:479)
	at org.apache.zookeeper.server.quorum.auth.ApacheDSMiniKdc.start(ApacheDSMiniKdc.java:330)
	at org.apache.zookeeper.server.quorum.auth.ApacheDSKerberosSecurityTestcase.startMiniKdc(ApacheDSKerberosSecurityTestcase.java:70)
	at org.apache.zookeeper.server.quorum.auth.ApacheDSKerberosSecurityTestcase.setUpSasl(ApacheDSKerberosSecurityTestcase.java:56)
Mime
  • Unnamed multipart/mixed (inline, None, 0 bytes)
View raw message