zookeeper-dev mailing list archives

Site index · List index
Message view « Date » · « Thread »
Top « Date » · « Thread »
From Apache Jenkins Server <jenk...@builds.apache.org>
Subject ZooKeeper-trunk - Build # 785 - Still Failing
Date Wed, 20 Nov 2019 06:34:00 GMT
See https://builds.apache.org/job/ZooKeeper-trunk/785/

###################################################################################
########################## LAST 60 LINES OF THE CONSOLE ###########################
[...truncated 3.17 KB...]
        RX errors 0  dropped 53  overruns 751  frame 0
        TX packets 74169954  bytes 53070546976 (53.0 GB)
        TX errors 0  dropped 0 overruns 0  carrier 0  collisions 0
        device memory 0xc0400000-c041ffff  

enp7s0f1: flags=4098<BROADCAST,MULTICAST>  mtu 1500
        ether 78:e3:b5:17:55:9f  txqueuelen 1000  (Ethernet)
        RX packets 0  bytes 0 (0.0 B)
        RX errors 0  dropped 0  overruns 0  frame 0
        TX packets 0  bytes 0 (0.0 B)
        TX errors 0  dropped 0 overruns 0  carrier 0  collisions 0
        device memory 0xc0460000-c047ffff  

lo: flags=73<UP,LOOPBACK,RUNNING>  mtu 65536
        inet 127.0.0.1  netmask 255.0.0.0
        inet6 ::1  prefixlen 128  scopeid 0x10<host>
        loop  txqueuelen 1000  (Local Loopback)
        RX packets 85042096  bytes 36600149172 (36.6 GB)
        RX errors 0  dropped 0  overruns 0  frame 0
        TX packets 85042096  bytes 36600149172 (36.6 GB)
        TX errors 0  dropped 0 overruns 0  carrier 0  collisions 0

core file size          (blocks, -c) 0
data seg size           (kbytes, -d) unlimited
scheduling priority             (-e) 0
file size               (blocks, -f) unlimited
pending signals                 (-i) 192965
max locked memory       (kbytes, -l) 16384
max memory size         (kbytes, -m) unlimited
open files                      (-n) 60000
pipe size            (512 bytes, -p) 8
POSIX message queues     (bytes, -q) 819200
real-time priority              (-r) 0
stack size              (kbytes, -s) 8192
cpu time               (seconds, -t) unlimited
max user processes              (-u) 10240
virtual memory          (kbytes, -v) unlimited
file locks                      (-x) unlimited
60000
/home/jenkins/tools/ant/latest1.9/bin/ant clean
Buildfile: build.xml does not exist!
Build failed
Buildfile: build.xml does not exist!
Build failed
mv: cannot stat 'build/*.tar.gz': No such file or directory
mv: cannot stat 'build/*.jar': No such file or directory
mv: cannot stat 'build/test/findbugs': No such file or directory
mv: cannot stat 'build/docs/api': No such file or directory
mv: cannot stat 'build/test/logs': No such file or directory
Build Failed
Build step 'Execute shell' marked build as failure
[FINDBUGS] Skipping publisher since build result is FAILURE
[WARNINGS] Skipping publisher since build result is FAILURE
Archiving artifacts
[JIRA] Updating issue ZOOKEEPER-3502
Recording test results
ERROR: Step ?Publish JUnit test result report? failed: No test report files were found. Configuration
error?
Email was triggered for: Failure - Any
Sending email for trigger: Failure - Any



###################################################################################
############################## FAILED TESTS (if any) ##############################
No tests ran.
Mime
  • Unnamed multipart/mixed (inline, None, 0 bytes)
View raw message