zookeeper-dev mailing list archives

Site index · List index
Message view « Date » · « Thread »
Top « Date » · « Thread »
From Apache Jenkins Server <jenk...@builds.apache.org>
Subject Build failed in Jenkins: PreCommit-ZOOKEEPER-github-pr-build-maven #1650
Date Sun, 24 Nov 2019 22:22:56 GMT
See <https://builds.apache.org/job/PreCommit-ZOOKEEPER-github-pr-build-maven/1650/display/redirect?page=changes>

Changes:

[phunt] ZOOKEEPER-1505. Multi-thread CommitProcessor (Jay Shrauner via phunt)

[phunt] ZOOKEEPER-1564. Allow JUnit test build with IBM Java (Paulo Ricardo Paz

[phunt] ZOOKEEPER-1596. Zab1_0Test should ensure that the file is closed (Enis

[phunt] ZOOKEEPER-1513. "Unreasonable length" exception while starting a server

[phunt] ZOOKEEPER-1581. change copyright in notice to 2012 (breed via phunt)

[phunt] ZOOKEEPER-1598. Ability to support more digits in the version string

[phunt] ZOOKEEPER-721. Minor cleanup related to the log4j version change from

[phunt] ZOOKEEPER-1553. Findbugs configuration is missing some dependencies

[phunt] ZOOKEEPER-1583. Document maxClientCnxns in conf/zoo_sample.cfg

[phunt] ZOOKEEPER-1478. Small bug in QuorumTest.testFollowersStartAfterLeader( )

[phunt] ZOOKEEPER-1387. Wrong epoch file created (Benjamin Busjaeger via breed,

[phunt] ZOOKEEPER-1584. Adding mvn-install target for deploying the zookeeper

[phunt] ZOOKEEPER-1602. a change to QuorumPeerConfig's API broke compatibility

[mahadev] ZOOKEEPER-1335. Add support for --config to zkEnv.sh to specify a config

[mahadev] ZOOKEEPER-1578. org.apache.zookeeper.server.quorum.Zab1_0Test failed due

[phunt] ZOOKEEPER-1334. Zookeeper 3.4.x is not OSGi compliant - MANIFEST.MF is

[phunt] ZOOKEEPER-1504. Multi-thread NIOServerCnxn (Jay Shrauner via phunt)

[phunt] ZOOKEEPER-1297. Add stat information to create() call (Lenni Kuff via

[phunt] ZOOKEEPER-1603. StaticHostProviderTest testUpdateClientMigrateOrNot

[phunt] ZOOKEEPER-1597. Windows build failing (michim via phunt)

[camille] ZOOKEEPER-1535. ZK Shell/Cli re-executes last command on exit (Edward

[fpj] ZOOKEEPER-1324. Remove Duplicate NEWLEADER packets from the Leader to

[fpj] Reverting previous commit and going back to revision 1427034.

[michim] ZOOKEEPER-1625. zkServer.sh is looking for clientPort in config file,

[phunt] ZOOKEEPER-1495. ZK client hangs when using a function not available on

[phunt] ZOOKEEPER-1597. Windows build failing (michim via phunt) part 2

[phunt] ZOOKEEPER-1620. NIOServerCnxnFactory (new code introduced in ZK-1504)

[phunt] ZOOKEEPER-1619. Allow spaces in URL (Edward Ribeiro via phunt)

[phunt] ZOOKEEPER-1628. Documented list of allowable characters in ZK doc not in

[phunt] ZOOKEEPER-1615. minor typos in ZooKeeper Programmer's Guide web page

[phunt] ZOOKEEPER-1613. The documentation still points to 2008 in the copyright

[phunt] ZOOKEEPER-1601. document changes for multi-threaded CommitProcessor and

[phunt] Allow 26 release audit warnings - new windows build files

[phunt] ZOOKEEPER-1562. Memory leaks in zoo_multi API (Deepak Jagtap via phunt)

[camille] ZOOKEEPER-1572. Add an async (Java) interface for multi request (Sijie

[phunt] ZOOKEEPER-1645. ZooKeeper OSGi package imports not complete (Arnoud

[phunt] ZOOKEEPER-1641. Using slope=positive results in a jagged ganglia graph

[phunt] ZOOKEEPER-1648. Fix WatcherTest in JDK7 (Thawan Kooburat via phunt)

[phunt] ZOOKEEPER-1606. intermittent failures in ZkDatabaseCorruptionTest on

[phunt] ZOOKEEPER-1647. OSGi package import/export changes not applied to

[phunt] ZOOKEEPER-1597. Windows build failing (michim via phunt) part 3

[michim] ZOOKEEPER-1643. Windows: fetch_and_add not 64bit-compatible, may not be

[breed] ZOOKEEPER-107. Allow dynamic changes to server cluster membership (Alex

[camille] ZOOKEEPER-107. Allow dynamic changes to server cluster membership, small

[camille] ZOOKEEPER-107. Allow dynamic changes to server cluster membership. Small

[phunt] ZOOKEEPER-1672. zookeeper client does not accept "-members" option in

[camille] ZOOKEEPER-107. Allow dynamic changes to server cluster membership. C++

[michim] ZOOKEEPER-1411. Consolidate membership management, distinguish between

[fpj] ZOOKEEPER-1700. FLETest consistently failing - setLastSeenQuorumVerifier

[fpj] ZOOKEEPER-1697. large snapshots can cause continuous quorum failure  

[fpj] ZOOKEEPER-1706.  Typo in Double Barriers example (Jingguo Yao via fpj)

[fpj] ZOOKEEPER-1324. Remove Duplicate NEWLEADER packets from the Leader to

[camille] ZOOKEEPER-1642. Leader loading database twice (fpj via camille)

[camille] ZOOKEEPER-1663. scripts don't work when path contains spaces (Amichai

[michim] ZOOKEEPER-1400. Allow logging via callback instead of raw FILE pointer

[camille] ZOOKEEPER-1663. scripts don't work when path contains spaces (Amichai

[camille] ZOOKEEPER-1417. investigate differences in client last zxid handling btw

[camille] ZOOKEEPER-1714 perl client segfaults if ZOO_READ_ACL_UNSAFE constant is

[camille] ZOOKEEPER-1719. zkCli.sh, zkServer.sh and zkEnv.sh regression caused by

[thawan] ZOOKEEPER-1413. Use on-disk transaction log for learner sync up (thawan)

[phunt] ZOOKEEPER-1702. ZooKeeper client may write operation packets before

[camille]  ZOOKEEPER-1629. testTransactionLogCorruption occasionally fails.

[camille] ZOOKEEPER-1629. testTransactionLogCorruption occasionally fails.

[fpj] ZOOKEEPER-1400. Allow logging via callback instead of raw FILE pointer

[fpj] ZOOKEEPER-1679. c client: use -Wdeclaration-after-statement (michi via

[fpj] ZOOKEEPER-1713. wrong time calculation in zkfuse.cc (german via fpj)

[fpj] ZOOKEEPER-1379. 'printwatches, redo, history and connect '. client

[fpj] ZOOKEEPER-1670. zookeeper should set a default value for SERVER_JVMFLAGS

[fpj] ZOOKEEPER-1448. Node+Quota creation in transaction log can crash leader

[michim] ZOOKEEPER-1750 Race condition producing NPE in NIOServerCnxn.toString

[camille]  ZOOKEEPER-1664. Kerberos auth doesn't work with native platform GSS

[michim] ZOOKEEPER-1750 Handle NIOServerCnxn#toString returning null (Rakesh R

[fpj] ZOOKEEPER-1754. Read-only server allows to create znode (Rakesh R via

[mahadev] ZOOKEEPER-1751. ClientCnxn#run could miss the second ping or connection

[fpj] ZOOKEEPER-1657. Increased CPU usage by unnecessary SASL checks (Philip

[fpj] ZOOKEEPER-1753. ClientCnxn is not properly releasing the resources,

[camille] ZOOKEEPER-1759. Adding ability to allow READ operations for

[fpj] ZOOKEEPER-1096. Leader communication should listen on specified IP, not

[mahadev] ZOOKEEPER-1696. Fail to run zookeeper client on Weblogic application

[fpj] ZOOKEEPER-87. Follower does not shut itself down if its too far behind

[mahadev] Reverting ZOOKEEPER-1696 patch that was committed.

[mahadev] ZOOKEEPER-1696. Fail to run zookeeper client on Weblogic application

[camille] ZOOKEEPER-1759. Adding ability to allow READ operations for

[thawan] ZOOKEEPER-1552. Enable sync request processor in Observer (thawan, fpj)

[thawan] ZOOKEEPER-1758. Add documentation for zookeeper.observer.syncEnabled

[phunt] ZOOKEEPER-1769. ZooInspector can't display node data/metadata/ACLs

[phunt] ZOOKEEPER-1718. Support JLine 2 (Manikumar Reddy via phunt)

[phunt] ZOOKEEPER-1655. Make jline dependency optional in maven pom (Thomas

[phunt] ZOOKEEPER-1770. NullPointerException in SnapshotFormatter (Germán Blanco

[phunt] ZOOKEEPER-1733. FLETest#testLE is flaky on windows boxes (Jeffrey Zhong

[phunt] ZOOKEEPER-1771. ZooInspector authentication (Benjamin Jaton via phunt)

[phunt] ZOOKEEPER-1773. incorrect reference to jline version/lib in docs

[fpj] ZOOKEEPER-732. Improper translation of error into Python exception

[michim] ZOOKEEPER-1766 Consistent log severity level guards and statements

[michim] ZOOKEEPER-1778. Use static final Logger objects (Rakesh R via michim)

[thawan] ZOOKEEPER-1551. Observers ignore txns that come after snapshot and

[phunt] ZOOKEEPER-1781. ZooKeeper Server fails if snapCount is set to 1 (Takashi

[phunt] ZOOKEEPER-1781. ZooKeeper Server fails if snapCount is set to 1 (Takashi

[phunt] ZOOKEEPER-1774. QuorumPeerMainTest fails consistently with complains

[phunt] ZOOKEEPER-1771. ZooInspector authentication (Benjamin Jaton via phunt)

[phunt] ZOOKEEPER-877. zkpython does not work with python3.1 (Daniel Enman via

[phunt] ZOOKEEPER-1509. Please update documentation to reflect updated FreeBSD

[thawan] ZOOKEEPER-1147. Add support for local sessions (Jay Shrauner, thawan via

[phunt] ZOOKEEPER-1627. Add org.apache.zookeeper.common to exported packages in

[camille] ZOOKEEPER-1624. PrepRequestProcessor abort multi-operation incorrectly.

[phunt] ZOOKEEPER-1610. Some classes are using == or != to compare Long/String

[phunt] ZOOKEEPER-1715. Upgrade netty version (Sean Bridges via phunt)

[phunt] ZOOKEEPER-1795. unable to build c client on ubuntu (Raul Gutierrez

[phunt] ZOOKEEPER-1646. mt c client tests fail on Ubuntu Raring (phunt)

[fpj] ZOOKEEPER-1732. ZooKeeper server unable to join established ensemble

[fpj] ZOOKEEPER-1667. Watch event isn't handled correctly when a client

[phunt] ZOOKEEPER-1799. SaslAuthFailDesignatedClientTest.testAuth fails

[phunt] ZOOKEEPER-1557. jenkins jdk7 test failure in

[phunt] ZOOKEEPER-1744. clientPortAddress breaks "zkServer.sh status" (Nick

[phunt] ZOOKEEPER-1499. clientPort config changes not backwards-compatible

[thawan] ZOOKEEPER-1798. Fix race condition in testNormalObserverRun (thawan, fpj

[camille] ZOOKEEPER-1666. Avoid Reverse DNS lookup if the hostname in connection

[breed] ZOOKEEPER-1783. Distinguish initial configuration from first established

[phunt] ZOOKEEPER-1812. ZooInspector reconnection always fails if first

[thawan] ZOOKEEPER-1798. Fix race condition in testNormalObserverRun (Part 2)

[fpj] ZOOKEEPER-1786. ZooKeeper data model documentation is incorrect (Niraj

[michim] ZOOKEEPER-1815. Tolerate incorrectly set system hostname in tests (some

[fpj] ZOOKEEPER-1821. very ugly warning when compiling load_gen.c (german

[michim] ZOOKEEPER-1632. fix memory leaks in cli_st (fpj via michim)

[fpj] ZOOKEEPER-1459. Standalone ZooKeeperServer is not closing   the

[michim] ZOOKEEPER-1019. zkfuse doesn't list dependency on boost in README (Raul

[michim] ZOOKEEPER-1834. Catch IOException in FileTxnLog (fpj via michim)

[camille] ZOOKEEPER-1382. Zookeeper server holds onto dead/expired session ids in

[michim] ZOOKEEPER-1839. Deadlock in NettyServerCnxn (Rakesh R via michim)

[phunt] ZOOKEEPER-1622. session ids will be negative in the year 2022 (Eric

[michim] ZOOKEEPER-1756. zookeeper_interest() in C client can return a timeval of

[phunt] ZOOKEEPER-1388. Client side 'PathValidation' is missing for the

[phunt] ZOOKEEPER-1430. add maven deploy support to the build (Giridharan

[fpj] ZOOKEEPER-1849. Need to properly tear down tests in various cases  

[fpj] ZOOKEEPER-1179. NettyServerCnxn does not properly close socket on   4

[fpj] ZOOKEEPER-1179.  NettyServerCnxn does not properly close socket on 4

[fpj] ZOOKEEPER-1852. ServerCnxnFactory instance is not properly cleanedup

[fpj] ZOOKEEPER-1852. ServerCnxnFactory instance is not properly cleanedup

[michim] ZOOKEEPER-1414. QuorumPeerMainTest.testQuorum, testBadPackets are

[michim] ZOOKEEPER-1057. zookeeper c-client, connection to offline server fails

[michim] ZOOKEEPER-1857. PrepRequestProcessotTest doesn't shutdown ZooKeeper

[phunt] ZOOKEEPER-1860. Async versions of reconfig don't actually throw

[fpj] ZOOKEEPER-1837. Fix JMXEnv checks (potential race conditions)   (Germán

[michim] ZOOKEEPER-1691. Add a flag to disable standalone mode (Helen Hastings

[michim] ZOOKEEPER-1691. Add StandaloneDisabledTest.java (Helen Hastings via

[phunt] ZOOKEEPER-442. need a way to remove watches that are no longer of

[fpj] ZOOKEEPER-1858. JMX checks - potential race conditions while stopping  

[fpj] ZOOKEEPER-1867. Bug in ZkDatabaseCorruptionTest (fpj)

[phunt] ZOOKEEPER-1573. Unable to load database due to missing parent node

[phunt] ZOOKEEPER-1811. The ZooKeeperSaslClient service name principal is

[michim] ZOOKEEPER-1874 Add proper teardown/cleanups in ReconfigTest to shutdown

[michim] ZOOKEEPER-1873. Unnecessarily InstanceNotFoundException is coming when

[fpj] ZOOKEEPER-1844. TruncateTest fails on windows (Rakesh R via fpj)

[camille] ZOOKEEPER-1861. ConcurrentHashMap isn't used properly in

[camille]  ZOOKEEPER-1755. Concurrent operations of four letter 'dump' ephemeral  

[michim] ZOOKEEPER-1779. ReconfigTest littering the source root with test files

[michim] ZOOKEEPER-1888. ZkCli.cmd commands fail with "'java' is not recognized

[michim] ZOOKEEPER-1662. Fix to two small bugs in ReconfigTest.testPortChange()

[michim] ZOOKEEPER-1440. Spurious log error messages when QuorumCnxManager is

[michim] ZOOKEEPER-1883. C client unit test failures (Raul Gutierrez Segales via

[michim] ZOOKEEPER-1638. Redundant zk.getZKDatabase().clear(); (neil bhakta via

[michim] Revert "ZOOKEEPER-1883. C client unit test failures (Raul Gutierrez

[michim] ZOOKEEPER-1883. C client unit test failures (Raul Gutierrez Segales via

[michim] KEEPER-1878. Inconsistent behavior in autocreation of dataDir and

[michim] ZOOKEEPER-1862. ServerCnxnTest.testServerCnxnExpiry is intermittently

[michim] ZOOKEEPER-1796. Move common code from {Follower,

[michim] ZOOKEEPER-602. log all exceptions not caught by ZK threads (Rakesh R via

[michim] ZOOKEEPER-1901. [JDK8] Sort children for comparison in AsyncOps tests

[michim] ZOOKEEPER-1263. fix handling of min/max session timeout value

[michim] ZOOKEEPER-1904. WatcherTest#testWatchAutoResetWithPending is failing

[michim] ZOOKEEPER-1878. Reset zookeeper.datadir.autocreate (Rakesh R via michim)

[camille] ZOOKEEPER-1894. ObserverTest.testObserver fails consistently. (michim

[michim] ZOOKEEPER-297. centralize version numbering in the source/build (Diego

[michim] ZOOKEEPER-1408. CLI: sort output of ls command (Hartmut Lang via michim)

[michim] ZOOKEEPER-1219. LeaderElectionSupport recipe is unnecessarily

[michim] ZOOKEEPER-1728. Better error message when reconfig invoked in standalone

[michim] ZOOKEEPER-1725. Zookeeper Dynamic Conf writes out hostnames when IPs are

[michim] ZOOKEEPER-1701. When new and old config have the same version, no need

[michim] ZOOKEEPER-1730. Make ZooKeeper easier to test - support simulating a

[michim] ZOOKEEPER-1906. zkpython: invalid data in GetData for empty node (Nikita

[michim] ZOOKEEPER-1897. ZK Shell/Cli not processing commands (stack via michim)

[michim] ZOOKEEPER-1830. Support command line shell for removing watches (Rakesh

[michim] ZOOKEEPER-1831. Document remove watches details to the guide (Rakesh R

[michim] Set svn:eol-style property to native.

[michim] ZOOKEEPER-1575. adding .gitattributes to prevent CRLF and LF mismatches

[michim] Revert "ZOOKEEPER-297. centralize version numbering in the source/build

[michim] zkEnv.cmd: Set svn:eol-style property to 'native'.

[michim] ZOOKEEPER-1357. Zab1_0Test uses hard-wired port numbers. Specifically,

[michim] ZOOKEEPER-1887. C implementation of removeWatches (Raul Gutierrez

[michim] ZOOKEEPER-1840. Server tries to connect to itself during dynamic

[rakeshr] ZOOKEEPER-1909. removeWatches doesn't return NOWATCHER when there is no

[michim] ZOOKEEPER-1913. Invalid manifest files due to bogus revision property

[michim] ZOOKEEPER-1911. REST contrib module does not include all required files

[michim] ZOOKEEPER-1819. DeserializationPerfTest calls method with wrong

[michim] ZOOKEEPER-1673. Zookeeper don't support cidr in expression in ACL with

[michim] ZOOKEEPER-1843. Oddity in ByteBufferInputStream skip (Bill Havanki via

[camille] ZOOKEEPER-1910. RemoveWatches wrongly removes the watcher if multiple

[rakeshr] ZOOKEEPER-1695. Inconsistent error code and type for new errors

[rakeshr] ZOOKEEPER-751. Recipe heading refers to 'recoverable' but should be

[michim] ZOOKEEPER-1923. A typo in zookeeperStarted document (Chengwei Yang via

[michim] ZOOKEEPER-1926. Unit tests should only use build/test/data for data

[rakeshr] ZOOKEEPER-1891. StaticHostProviderTest.testUpdateLoadBalancing times out

[rakeshr] ZOOKEEPER-657. Cut down the running time of ZKDatabase corruption (Michi

[michim] ZOOKEEPER-1836. addrvec_next() fails to set next parameter if

[michim] ZOOKEEPER-1895. update all notice files, copyright, etc... with the new

[michim] ZOOKEEPER-1062. Net-ZooKeeper: Net::ZooKeeper consumes 100% cpu on wait

[rakeshr] ZOOKEEPER-1864. quorumVerifier is null when creating a QuorumPeerConfig

[michim] ZOOKEEPER-1797. PurgeTxnLog may delete data logs during roll (Rakesh R

[michim] ZOOKEEPER-1791. ZooKeeper package includes unnecessary jars that are

[michim] ZOOKEEPER-1214. QuorumPeer should unregister only its previsously

[rakeshr] ZOOKEEPER-716. dump server memory detail to the log during startup

[michim] ZOOKEEPER-1699. Leader should timeout and give up leadership when losing

[michim] ZOOKEEPER-1699. Forgot to add a new file.

[fpj] ZOOKEEPER-1914. TestWatchers.cc failure - workaround (michim via fpj)

[michim] ZOOKEEPER-1930. A typo in zookeeper recipes.html (Chengwei Yang via

[michim] ZOOKEEPER-1659. Add JMX support for dynamic reconfiguration (Rakesh R

[fpj] ZOOKEEPER-1928. add configurable throttling to the number of snapshots

[fpj] ZOOKEEPER-1870. flakey test in

[fpj] ZOOKEEPER-1945. deb - zkCli.sh, zkServer.sh and zkEnv.sh regression

[phunt] ZOOKEEPER-1746. AsyncCallback.*Callback don't have any Javadoc (Hongchao

[phunt] ZOOKEEPER-1939. ReconfigRecoveryTest.testNextConfigUnreachable is

[phunt] ZOOKEEPER-1938. bump version in the C library as we prepare for 3.5.0

[camille] ZOOKEEPER-1576. Zookeeper cluster - failed to connect to cluster if one

[shralex] ZOOKEEPER-1900

[phunt] ZOOKEEPER-1918. Add 64 bit Windows as a supported development platform

[phunt] ZOOKEEPER-1946. Server logging should reflect dynamically reconfigured

[rakeshr] ZOOKEEPER-1835. dynamic configuration file renaming fails on

[fpj] ZOOKEEPER-827. enable r/o mode in C client library (rgs via fpj)

[michim] ZOOKEEPER-1810. Add version to FLE notifications for trunk Germán Blanco

[rakeshr] ZOOKEEPER-1222. getACL should only call DataTree.copyStat when passed in

[fpj] ZOOKEEPER-1953. Add solution and project files to enable build with

[fpj] ZOOKEEPER-1964. Fix Flaky Test in ReconfigTest.java (Hongchao Deng via

[camille] ZOOKEEPER-1863. Race condition in commit processor leading to out of

[fpj] Removing files as part of ZOOKEEPER-1966.

[fpj] ZOOKEEPER-1966. VS and line breaks (Orion Hodson via fpj)

[fpj] ZOOKEEPER-1966. VS and line breaks - second fix (Orion Hodson via fpj)

[michim] ZOOKEEPER-1683. ZooKeeper client NPE when updating server list on

[phunt] ZOOKEEPER-1346. Add Jetty HTTP server support for four letter words.

[phunt] ZOOKEEPER-1969. Fix Port Already In Use for JettyAdminServerTest

[phunt] ZOOKEEPER-1968. Make Jetty dependencies optional in ivy.xml (Bill

[rakeshr] ZOOKEEPER-1851. Follower and Observer Request Processors Do Not Forward

[fpj] ZOOKEEPER-1807. Observers spam each other creating connections to the

[phunt] ZOOKEEPER-927. there are currently 24 RAT warnings in the build --

[phunt] ZOOKEEPER-1972. Fix invalid volatile long/int increment (++) (Hongchao

[phunt] ZOOKEEPER-1973. Jetty Server changes broke ibm6 support (Bill Havanki

[phunt] ZOOKEEPER-1975. Turn off "internationalization warnings" in findbugs

[phunt] ZOOKEEPER-1979. Fix Performance Warnings found by Findbugs 2.0.3

[phunt] ZOOKEEPER-1981. Fix Dodgy Code Warnings identified by findbugs 2.0.3

[phunt] ZOOKEEPER-1984. testLeaderTimesoutOnNewQuorum is a flakey test (Alex

[phunt] ZOOKEEPER-1789. 3.4.x observer causes NPE on 3.5.0 (trunk) participants

[phunt] ZOOKEEPER-1982. Refactor (touch|add)Session in SessionTrackerImpl.java

[phunt] ZOOKEEPER-1986. refactor log trace on touchSession (Hongchao Deng via

[phunt] ZOOKEEPER-1937. init script needs fixing for ZOOKEEPER-1719 (Marshall

[phunt] ZOOKEEPER-1877. Malformed ACL Id can crash server with skipACL=yes

[phunt] ZOOKEEPER-1974. winvs2008 jenkins job failing with "unresolved external

[phunt] ZOOKEEPER-1933. Windows release build of zk client cannot connect to zk

[rakeshr] ZOOKEEPER-1988. new test patch to verify dynamic reconfig backward

[shralex] ZOOKEEPER-1992. Backward compatibility of the static configuration file

[phunt] Preparing for release 3.5.0

[phunt] Preparing for 3.6 development

[shralex] ZOOKEEPER-1994. Auto-backup configuration files; config version becomes

[shralex] ZOOKEEPER-2008. Missing leader election port in system test. (Kfir

[shralex] ZOOKEEPER-2008-Fix. Correcting small issue in committed 2008 patch.

[shralex] ZOOKEEPER-2006. Standalone mode won't take client port from dynamic

[michim] ZOOKEEPER-2000. Fix ReconfigTest.testPortChange (Alexander Shraer via

[shralex] ZOOKEEPER-2013. Typos in programmer guide. (Tim Chambers via Alex

[michim] ZOOKEEPER-2017 New tests for reconfig failure cases (Alexander Shraer

[shralex] ZOOKEEPER-1660 Documentation for Dynamic Reconfiguration (Reed

[shralex] ZOOKEEPER-2032. Cleaning up resources in ReconfigBackupTest (Hongchao

[michim] ZOOKEEPER-2030 dynamicConfigFile should have an absolute path, not a

[fpj] ZOOKEEPER-2039 Jute compareBytes incorrect comparison index (Ian

[rakeshr] ZOOKEEPER-2047 testTruncationNullLog fails on windows (flavio via

[rakeshr] ZOOKEEPER-2026 Startup order in ServerCnxnFactory-ies is wrong (Stevo

[michim] ZOOKEEPER-1917 Apache Zookeeper logs cleartext admin passwords (fpj via

[rakeshr] ZOOKEEPER-1948 Enable JMX remote monitoring (Biju Nair via rakeshr)

[rakeshr] ZOOKEEPER-2054 test-patch.sh: don't set ulimit -n (michim via rakeshr)

[rakeshr] ZOOKEEPER-1917 Apache Zookeeper logs cleartext admin passwords (michim

[rakeshr] ZOOKEEPER-2058 rat: exclude *.cer files  (michim via rakeshr)

[michim] ZOOKEEPER-2049 Yosemite build failure: htonll conflict (Till Toenshoff

[camille] ZOOKEEPER-2066 Updates to README.txt (Wendy Smoak via camille)

[rakeshr] ZOOKEEPER-2052 Unable to delete a node when the node has no children

[shralex] Committing zookeeperReconfig.html and pdf to trunk

[michim] ZOOKEEPER-2079 Stop daemon with "kill" rather than "kill -9" (Guillaume

[fpj] ZOOKEEPER-2060 Trace bug in NettyServerCnxnFactory (Ian via fpj)

[fpj] ZOOKEEPER-2064 Prevent resource leak in various classes (Ted Yu via fpj)

[fpj] ZOOKEEPER-2060 Trace bug in NettyServerCnxnFactory (Ian via fpj) This

[fpj] ZOOKEEPER-1963 Make JDK 7 the minimum requirement for Zookeeper

[fpj] ZOOKEEPER-2069 Netty Support for ClientCnxnSocket (Hongchao via fpj)

[fpj] ZOOKEEPER-2069 Netty Support for ClientCnxnSocket (Hongchao via fpj)

[shralex] ZOOKEEPER-1784 wrong check for COMMITANDACTIVATE in observer code,

[rakeshr] ZOOKEEPER-2110 Typo fixes in the ZK documentation. (Jeffrey Schroeder

[rakeshr] ZOOKEEPER-2072 Netty Server Should Configure Child Channel Pipeline By

[rakeshr] ZOOKEEPER-2111 Not isAlive states should be synchronized in ClientCnxn

[michim] ZOOKEEPER-1366 Zookeeper should be tolerant of clock adjustments

[michim] ZOOKEEPER-2074 Incorrect exit codes for "./zkCli.sh cmd arg" (surendra

[michim] ZOOKEEPER-1949 recipes jar not included in the distribution package

[michim] ZOOKEEPER-2114 jute generated allocate_* functions are not externally

[michim] ZOOKEEPER-2073 Memory leak on zookeeper_close (Dave Gosselin via michim)

[rakeshr] ZOOKEEPER-2119 Netty client docs (Hongchao via rakeshr)

[rakeshr] ZOOKEEPER-1952 Default log directory and file name can be changed(nijel,

[michim] ZOOKEEPER-1907 Improve Thread handling (Rakesh R via michim)

[rakeshr] ZOOKEEPER-2134 AsyncHammerTest.testHammer fails intermittently(Michi

[michim] Revert ZOOKEEPER-2074.

[michim] ZOOKEEPER-2137 Make testPortChange() less flaky (Hongchao Deng via

[camille] ZOOKEEPER-1893. automake: use serial-tests option (michim via camille)

[michim] ZOOKEEPER-1865 Fix retry logic in Learner.connectToLeader() (Edward

[rakeshr] ZOOKEEPER-2109 Typo in src/c/src/load_gen.c (surendra singh lilhore via

[rakeshr] ZOOKEEPER-2107 zookeeper client should support custom

[rakeshr] ZOOKEEPER-2125 SSL on Netty client-server communication (Hongchao, Ian

[michim] ZOOKEEPER-2146 BinaryInputArchive readString should check length before

[michim] ZOOKEEPER-2149 Logging of client address when socket connection

[rakeshr] ZOOKEEPER-2123 Provide implementation of X509 AuthenticationProvider(Ian

[rgs] ZOOKEEPER-2056 Zookeeper 3.4.x and 3.5.0-alpha is not OSGi compliant

[hdeng] ZOOKEEPER-2157 Upgrade option should be removed from zkServer.sh usage

[rakeshr] ZOOKEEPER-1506 Re-try DNS hostname -> IP resolution if node connection

[hdeng] ZOOKEEPER-2029 Leader.LearnerCnxAcceptor should handle exceptions in

[michim] ZOOKEEPER-1626 Zookeeper C client should be tolerant of clock

[camille] ZOOKEEPER-2173. ZK startup failure should be handled with proper error

[rgs] ZOOKEEPER-2174 JUnit4ZKTestRunner logs test failure for all exceptions

[rgs] ZOOKEEPER-2124 Allow Zookeeper version string to have underscore '_'

[rakeshr] ZOOKEEPER-2062 RemoveWatchesTest takes forever to run (Chris Nauroth via

[hdeng] ZOOKEEPER-2176 Unclear error message should be info not error (rgs via

[hdeng] ZOOKEEPER-2153 X509 Authentication Documentation (Ian Dimayuga via

[hdeng] ZOOKEEPER-2153 X509 Authentication Documentation (Ian Dimayuga via

[michim] ZOOKEEPER-2171 avoid reverse lookups in QuorumCnxManager (rgs via

[hdeng] ZOOKEEPER-2182 Several test suites are not running during pre-commit,

[michim] ZOOKEEPER-2186 QuorumCnxManager#receiveConnection may crash with random

[hdeng] ZOOKEEPER-2183 Concurrent Testing Processes and Port Assignments (Chris

[rgs] ZOOKEEPER-2190 fix StandaloneDisabledTest#testReconfig

[rakeshr] ZOOKEEPER-2126 Improve exit log messsage of EventThread and SendThread

[rgs] ZOOKEEPER-1077: C client lib doesn't build on Solaris (Chris Nauroth via

[rakeshr] ZOOKEEPER-2156: If JAVA_HOME is not set zk startup and fetching status

[rakeshr] ZOOKEEPER-2191: Continue supporting prior Ant versions that don't

[hdeng] ZOOKEEPER-2187: remove duplicated code between CreateRequest{,2} (Raul

[rgs] ZOOKEEPER-2179: Typo in Watcher.java (Archana T via rgs)

[hdeng] ZOOKEEPER-2189: QuorumCnxManager: use BufferedOutputStream for initial

[hdeng] ZOOKEEPER-2189: QuorumCnxManager: use BufferedOutputStream for initial

[michim] ZOOKEEPER-2198 Set default test.junit.threads to 1 (Chris Nauroth via

[michim] ZOOKEEPER-2178 Native client fails compilation on Windows. (Chris

[rgs] ZOOKEEPER-2197 non-ascii character in FinalRequestProcessor.java

[rgs] ZOOKEEPER-2096: C client builds with incorrect error codes in

[rgs] ZOOKEEPER-2194: Let DataNode.getChildren() return an unmodifiable view

[rgs] ZOOKEEPER-2204:

[rgs] ZOOKEEPER-2163: Introduce new ZNode type: container (Jordan Zimmerman

[rgs] ZOOKEEPER-2205: Log type of unexpected quorum packet in learner handler

[rgs] ZOOKEEPER-2206: Add missing packet types to

[rgs] ZOOKEEPER-2207: Enhance error logs with LearnerHandler.packetToString()

[rgs] ZOOKEEPER-2208: Log type of unexpected quorum packet in observer loop

[rgs] ZOOKEEPER-2208: Log type of unexpected quorum packet in observer loop

[rgs] ZOOKEEPER-2201: Network issues can cause cluster to hang due to

[rgs] ZOOKEEPER-2213: Empty path in Set crashes server and prevents restart

[rgs] ZOOKEEPER-2214: Findbugs warning: LearnerHandler.packetToString Dead

[rgs] ZOOKEEPER-706: Large numbers of watches can cause session

[rgs] ZOOKEEPER-2212: distributed race condition related to QV version

[rgs] ZOOKEEPER-2185: Run server with -XX:+HeapDumpOnOutOfMemoryError and

[rgs] ZOOKEEPER-2210: clock_gettime is not available in OS X (Michi Mutsuzaki

[rgs] ZOOKEEPER-2193: reconfig command completes even if parameter is wrong

[rgs] ZOOKEEPER-2140: NettyServerCnxn and NIOServerCnxn code should be

[rgs] ZOOKEEPER-2221: Zookeeper JettyAdminServer server should start on

[rakeshr] ZOOKEEPER-2224: Four letter command hangs when network is slow (Arshad

[rgs] ZOOKEEPER-2223: support method-level JUnit testcase (Akihiro Suda via

[rgs] ZOOKEEPER-1423: 4lw and jmx should expose the size of the

[michim] ZOOKEEPER-2235 License update (fpj via michim)

[rgs] ZOOKEEPER-2239: JMX State from LocalPeerBean incorrect (Kevin Lee via

[rgs] ZOOKEEPER-2245: SimpleSysTest test cases fails (Arshad Mohammad via rgs)

[rgs] ZOOKEEPER-1927: zkServer.sh fails to read dataDir (and others) from

[rakeshr] ZOOKEEPER-2256: Zookeeper is not using specified JMX port in

[rakeshr] ZOOKEEPER-2264: Wrong error message when secureClientPortAddress is

[rgs] ZOOKEEPER-2270: Allow MBeanRegistry to be overridden for better unit

[rgs] ZOOKEEPER-2269: NullPointerException in RemotePeerBean (Arshad Mohammad

[cnauroth] ZOOKEEPER-2040: Server to log underlying cause of SASL connection

[rakeshr] ZOOKEEPER-2279: QuorumPeer loadDataBase() error message is

[rakeshr] ZOOKEEPER-1803: Add description for pzxid in programmer's guide(Arshad

[rgs] ZOOKEEPER-2253: C asserts ordering of ping requests, while Java client

[rakeshr] ZOOKEEPER-2244: On Windows zookeeper fails to restart (Arshad Mohammad

[cnauroth] ZOOKEEPER-2268: Zookeeper doc creation fails on windows (Arshad Mohammad

[cnauroth] ZOOKEEPER-2281: ZK Server startup fails if there are spaces in the

[cnauroth] ZOOKEEPER-1460: IPv6 literal address not supported for quorum members

[fpj] ZOOKEEPER-2302: Some test cases are not running because wrongly named

[michim] ZOOKEEPER-2142: JMX ObjectName is incorrect for observers (Edward

[rgs] ZOOKEEPER-1872: QuorumPeer is not shutdown in few cases (Rakesh R. via

[rgs] ZOOKEEPER-2211: PurgeTxnLog does not correctly purge when snapshots and

[rgs] ZOOKEEPER-2227: stmk four-letter word fails execution at server while

[rgs] ZOOKEEPER-1853: zkCli.sh can't issue a CREATE command containing spaces

[rgs] ZOOKEEPER-2315: Change client connect zk service timeout log level from

[rgs] ZOOKEEPER-2240: Make the three-node minimum more explicit in

[rgs] ZOOKEEPER-2229: Several four-letter words are undocumented (Chris

[rgs] ZOOKEEPER-1929: std::length_error on update children (Charles Strahan

[rgs] ZOOKEEPER-1371: Remove dependency on log4j in the source code (Arshad

[rgs] ZOOKEEPER-2329: Clear javac and javadoc warning from zookeeper (Arshad

[rgs] ZOOKEEPER-2330: ZooKeeper close API does not close Login thread (Arshad

[rgs] ZOOKEEPER-2326: Include connected server address:port in log (Arshad

[rgs] ZOOKEEPER-2335: Java Compilation Error in ClientCnxn.java (Arshad

[rgs] ZOOKEEPER-2311: assert in setup_random (Marshall McMullen via rgs)

[rgs] ZOOKEEPER-2306: Remove file delete duplicate code from test code (Arshad

[rgs] ZOOKEEPER-2304: JMX ClientPort from ZooKeeperServerBean incorrect

[rgs] ZOOKEEPER-2301: QuorumPeer does not listen on passed client IP in the

[rgs] ZOOKEEPER-2299: NullPointerException in LocalPeerBean for ClientAddress

[rgs] ZOOKEEPER-2300: Expose SecureClientPort and SecureClientAddress JMX

[rgs] ZOOKEEPER-2336: Jenkins not working due to old SVN (Akihiro Suda via

[rgs] ZOOKEEPER-2295: TGT refresh time logic is wrong (Arshad Mohammad via

[rgs] ZOOKEEPER-2340: JMX is disabled even if JMXDISABLE is false (Arshad

[cnauroth] ZOOKEEPER-2252: Random test case failure in

[cnauroth] ZOOKEEPER-1029: C client bug in zookeeper_init (if bad hostname is

[cnauroth] ZOOKEEPER-412: checkstyle target fails trunk build (Akihiro Suda via

[rakeshr] ZOOKEEPER-2297: NPE is thrown while creating "key manager" and "trust

[rakeshr] Revert ZOOKEEPER-2297

[cnauroth] ZOOKEEPER-2360: Update commons collections version used by

[cnauroth] ZOOKEEPER-2243: Supported platforms is completely out of date (cnauroth)

[rakeshr] ZOOKEEPER-2375: Prevent multiple initialization of login object in each

[phunt] ZOOKEEPER-1991 zkServer.sh returns with a zero exit status when a

[phunt] ZOOKEEPER-1604 remove rpm/deb/... packaging (cnauroth via phunt)

[phunt] ZOOKEEPER-2294 Ant target generate-clover-reports is broken (charlie via

[phunt] ZOOKEEPER-2378 upgrade ivy to recent version (phunt)

[phunt] ZOOKEEPER-2373 Licenses section missing from pom file (phunt)

[phunt] ZOOKEEPER-2373 Licenses section missing from pom file - part 2 missed an

[cnauroth] ZOOKEEPER-2379: recent commit broke findbugs qabot check (rakeshr via

[phunt] ZOOKEEPER-2087 Few UX improvements in ZooInspector (Adam Dudczak via

[phunt] ZOOKEEPER-2133 zkperl: Segmentation fault if getting a node with null

[phunt] Added some CHANGES details that I missed in recent commits. (phunt)

[phunt] ZOOKEEPER-2283 traceFile property is not used in the ZooKeeper, it

[phunt] ZOOKEEPER-2385 Zookeeper trunk build is failing on windows (Arshad

[phunt] ZOOKEEPER-2388 Unit tests failing on Solaris (Arshad Mohammad via phunt)

[phunt] ZOOKEEPER-2392 Update netty to 3.7.1.Final (Hendy Irawan via phunt)

[cnauroth] ZOOKEEPER-2393: Revert run-time dependency on log4j and slf4j-log4j12

[phunt] ZOOKEEPER-2240 Make the three-node minimum more explicit in

[phunt] ZOOKEEPER-2195 fsync.warningthresholdms in zoo.cfg not working (Biju

[cnauroth] ZOOKEEPER-2364: "ant docs" fails on branch-3.5 due to missing

[camille] ZOOKEEPER-2141. ACL cache in DataTree never removes entries (Adam

[camille] ZOOKEEPER-2141 ACL cache in DataTree never removes entries (Adam

[fpj] ZOOKEEPER-2413: ContainerManager doesn't close the Timer it creates when

[fpj] ZOOKEEPER-2139: Support multiple ZooKeeper client with different

[phunt] ZOOKEEPER-2235 License update - fix servlet-api license (fpj via phunt)

[phunt] ZOOKEEPER-2423: Upgrade Netty version due to security vulnerability

[shralex] ZOOKEEPER-2024 Major throughput improvement with mixed workloads (Kfir

[fpj] ZOOKEEPER-2402: Document client side properties (Arshad Mohammad via

[phunt] ZOOKEEPER-2405: getTGT() in Login.java mishandles confidential

[phunt] ZOOKEEPER-2410: add time unit to 'ELECTION TOOK' log.info message

[rgs] ZOOKEEPER-2442: Socket leak in QuorumCnxManager connectOne (Michael Han

[phunt] ZOOKEEPER-2137: Make testPortChange() less flaky (Michael Han via phunt)

[phunt] ZOOKEEPER-2433: ZooKeeperSaslServer: allow user principals in subject

[fpj] ZOOKEEPER-2297: NPE is thrown while creating "key manager" and "trust

[cnauroth] ZOOKEEPER-2380: Deadlock between leader shutdown and forwarding ACK to

[cnauroth] ZOOKEEPER-2366: Reconfiguration of client port causes a socket leak.

[phunt] ZOOKEEPER-2458: Remove license file for servlet-api dependency (fpj via

[phunt] ZOOKEEPER-2459: Update NOTICE file with Netty notice (fpj via phunt)

[phunt] INFRA-12327 ZooKeeper pre-commit build failed due to build bot failed to

[phunt] ZOOKEEPER-1898: ZooKeeper Java cli shell always returns 0 as exit code

[phunt] ZOOKEEPER-2477: documentation should refer to Java cli shell and not C

[phunt] ZOOKEEPER-1256: ClientPortBindTest is failing on Mac OS X (Camille via

[rgs] ZOOKEEPER-2498: Potential resource leak in C client when processing

[phunt] ZOOKEEPER-2500: Fix compilation warnings for CliException classes

[phunt] ZOOKEEPER-2074: Incorrect exit codes for './zkCli.sh cmd arg' (Abraham

[fpj] Fix command handling in the C client shell (phunt via fpj)

[fpj] ZOOKEEPER-2247: Zookeeper service becomes unavailable when leader fails

[phunt] ZOOKEEPER-2505: Use shared library instead of static library in C client

[phunt] ZOOKEEPER-2508: Many ZooKeeper tests are flaky because they proceed with

[phunt] ZOOKEEPER-2152: Intermittent failure in TestReconfig.cc (Michael Han via

[phunt] ZOOKEEPER-2489: Upgrade Jetty dependency to a recent stable release

[phunt] ZOOKEEPER-2548: zooInspector does not start on Windows (Arshad Mohammad

[phunt] ZOOKEEPER-2558: Potential memory leak in recordio.c (Michael Han via

[phunt] ZOOKEEPER-2536: When provide path for 'dataDir' with trailing space, it

[phunt] ZOOKEEPER-2539: Throwing nullpointerException when run the command

[phunt] ZOOKEEPER-2507: C unit test improvement: line break between 'ZooKeeper

[phunt] ZOOKEEPER-1962: Add a CLI command to recursively list a znode and

[phunt] ZOOKEEPER-2172: Cluster crashes when reconfig a new node as a

[cnauroth] ZOOKEEPER-2557: Update gitignore to account for other file extensions.

[phunt] ZOOKEEPER-2484: Flaky Test:

[rgs] ZOOKEEPER-2576: After svn to git migration ZooKeeper Precommit jenkins

[rgs] ZOOKEEPER-2576: Missing changes (cleanup build.xml) (Patrick Hunt via

[phunt] ZOOKEEPER-2579: ZooKeeper server should verify that dataDir and snapDir

[phunt] ZOOKEEPER-2594: Use TLS for downloading artifacts during build (Olaf

[camille] ZOOKEEPER-2169. Enable creation of nodes with TTLs. (Jordan Zimmerman

[camille] ZOOKEEPER-2169. Enable creation of nodes with TTLs. (Jordan Zimmerman

[rgs] ZOOKEEPER-2611: zoo_remove_watchers - can remove the wrong watch (Eyal

[rakeshr] ZOOKEEPER-2467: NullPointerException when redo Command is passed

[fpj] ZOOKEEPER-2606: SaslServerCallbackHandler#handleAuthorizeCallback()

[breed] ZOOKEEPER-2597: Add script to merge PR from Apache git repo to Github

[shralex] ZOOKEEPER-2556: peerType not removed from static config file (Rakesh

[rgs] ZOOKEEPER-2624: Add test script for pull requests

[rgs] ZOOKEEPER-2631: Make issue extraction in the git pull request script

[fpj] ZOOKEEPER-2014: Only admin should be allowed to reconfig a cluster.

[fpj] ZOOKEEPER-1525: Plumb ZooKeeperServer object into auth plugins

[phunt] ZOOKEEPER-2632: Add option to inform JIRA_PASSWORD at CLI prompt (Edward

[fpj] ZOOKEEPER-2628: Fix findbug warnings.

[fpj] ZOOKEEPER-2636: Fix C client build break.

[rgs] ZOOKEEPER-2627: Remove ZRWSERVERFOUND from C client.

[fpj] ZOOKEEPER-2635: Regenerate documentation (fpj)

[fpj] ZOOKEEPER-761: Remove *synchronous* calls from the *single-threaded* C

[fpj] ZOOKEEPER-2647: Fix TestReconfigServer.cc

[fpj] ZOOKEEPER-2479: Add 'electionTimeTaken' value in LeaderMXBean and

[fpj] ZOOKEEPER-2383: Startup race in ZooKeeperServer

[hanm] ZOOKEEPER-2470: ServerConfig#parse(String[]) ignores tickTime

[hanm] ZOOKEEPER-2655: Improve NIOServerCnxn#isZKServerRunning to reflect the

[hanm] ZOOKEEPER-2656: Fix ServerConfigTest#testValidArguments test case fai…

[hanm] ZOOKEEPER-2517: jute.maxbuffer is ignored

[hanm] ZOOKEEPER-2465: Documentation copyright notice is out of date.

[hanm] ZOOKEEPER-2620: Add comments to testReadOnlySnapshotDir and

[rakeshr] ZOOKEEPER-2656: Fix ServerConfigTest#testValidArguments test case.

[hanm] ZOOKEEPER-2325: Data inconsistency if all snapshots empty or missing

[hanm] ZOOKEEPER-2511: Implement AutoCloseable in ZooKeeper.java

[hanm] ZOOKEEPER-2651: Missing src/pom.template in release

[breed] ZOOKEEPER-261: Reinitialized servers should not participate in leader

[hanm] ZOOKEEPER-2664: ClientPortBindTest#testBindByAddress may fail due to "No

[hanm] ZOOKEEPER-2633: contrib/zkfuse build fix with gcc 6.2.

[hanm] ZOOKEEPER-2574: PurgeTxnLog can inadvertently delete required txn log

[rakeshr] ZOOKEEPER-2573: Modify Info.REVISION to adapt git repo

[arshad] ZOOKEEPER-2622: ZooTrace.logQuorumPacket does nothing

[hanm] ZOOKEEPER-2680: Correct DataNode.getChildren() inconsistent behaviour.

[rakeshr] ZOOKEEPER-2682: Make it optional to fail build on test failure

[rakeshr] ZOOKEEPER-2080: Fix deadlock in dynamic reconfiguration

[rakeshr] ZOOKEEPER-2672: Remove CHANGE.txt

[hanm] ZOOKEEPER-2678: Discovery and Sync can take a very long time on large

[hanm] ZOOKEEPER-2642: rename ZooKeeper reconfig API to reconfigure API.

[hanm] ZOOKEEPER-2683: RaceConditionTest is flaky

[rakeshr] ZOOKEEPER-2617: correct a few spelling typos

[rakeshr] ZOOKEEPER-2687: Deadlock while shutting down the Leader server

[hanm] ZOOKEEPER-2692: Fix race condition in testWatchAutoResetWithPending

[hanm] ZOOKEEPER-2693: DOS attack on wchp/wchc four letter words (4lw)

[hanm] ZOOKEEPER-2709: Clarify documentation around the "auth" ACL scheme

[hanm] ZOOKEEPER-2718: fix flaky StandaloneDisabledTest

[rakeshr] ZOOKEEPER-2716: Flaky Test:

[arshad] ZOOKEEPER-2460 Remove javacc dependency from public Maven pom

[hanm] ZOOKEEPER-2726 ZOOKEEPER-2693: Patch for introduces potential race

[hanm] ZOOKEEPER-2725: Promote local session to global when ephemeral created

[hanm] ZOOKEEPER-2635: regenerate document for master / 3.6 branch.

[hanm] ZOOKEEPER-2735: fix typos in shell scripts

[hanm] This PR adds support for TTL nodes to the CLI

[hanm] ZOOKEEPER-2737: close netty connection when exceptions occur during w…

[hanm] ZOOKEEPER-2746: remove the check on the new leader after a dynamic re…

[hanm] ZOOKEEPER-2743: Netty connection leaks JMX connection bean.

[hanm] ZOOKEEPER-2722: fix flaky testSessionEstablishment test.

[hanm] ZOOKEEPER-2747: Fix ZooKeeperAdmin Compilation Warning

[hanm] ZOOKEEPER-2744: Typos in the comments of ZooKeeper class

[hanm] ZOOKEEPER-2638: ZooKeeper should log which serverCnxnFactory is used

[hanm] ZOOKEEPER-2758: Fix typo

[hanm] ZOOKEEPER-2316: comment does not match code logic

[hanm] ZOOKEEPER-2662: Export a metric for txn log sync times

[arshad] ZOOKEEPER-2742: Few test cases of org.apache.zookeeper.ZooKeeperTest

[hanm] ZOOKEEPER-2697: Handle graceful stop of ZookKeeper client

[arshad] ZOOKEEPER-1932: Remove deprecated LeaderElection class.

[hanm] ZOOKEEPER-2785: Server inappropriately throttles connections under loa…

[hanm] ZOOKEEPER-2757: Incorrect path crashes zkCli

[hanm] ZOOKEEPER-2767: Corrected keystore related messages to truststore mess…

[hanm] ZOOKEEPER-2796: Fix broken test testCreateNodeWithoutData caused by

[hanm] ZOOKEEPER-2788: remove unused MAX_CONNECTION_ATTEMPTS in

[hanm] ZOOKEEPER-2797: Defend against bad TTLs from misbehaving clients

[hanm] ZOOKEEPER-2359: ZooKeeper client has unnecessary logs for watcher

[hanm] ZOOKEEPER-2798: Fix flaky test:

[hanm] ZOOKEEPER-2775: ZK Client not able to connect with Xid out of order

[hanm] ZOOKEEPER-1748: add tcp keepalive option for branch 3.5

[hanm] Fix a typo in commit e47e6bb8791b2dce9b82ebe96a1c0d8a173726e0 that

[hanm] ZOOKEEPER-2786: Flaky test:

[hanm] ZOOKEEPER-2808: fix miss-referenced ACL count issue when upgrading the

[hanm] ZOOKEEPER-1782: Let a SASL super user be super

[hanm] ZOOKEEPER-2815: 1. Using try clause to close resource; 2. Others code

[hanm] ZOOKEEPER-2816: Code refactoring for `ZK_SERVER` module

[hanm] ZOOKEEPER-2786: Flaky test:

[hanm] ZOOKEEPER-2355: Ephemeral node is never deleted if follower fails while

[hanm] ZOOKEEPER-2818: Improve the ZooKeeper#setACL java doc

[hanm] ZOOKEEPER-2819: Changing membership configuration via rolling restart …

[hanm] ZOOKEEPER-2841: ZooKeeper public include files leak porting changes

[hanm] ZOOKEEPER-2856: ZooKeeperSaslClient#respondToServer should log exception

[hanm] ZOOKEEPER-2577: Fix flaky testDuringLeaderSync test.

[hanm] ZOOKEEPER-2829: Interface usability / compatibility improvements through

[hanm] ZOOKEEPER-2852: Read snapshotSizeFactor from system property

[hanm] ZOOKEEPER-2862: Incorrect javadoc syntax for web links in

[hanm] ZOOKEEPER-2853: Update lastZxidSeen in FileTxnLog

[hanm] ZOOKEEPER-2865: Reconfig Causes Inconsistent Configuration file among…

[hanm] ZOOKEEPER-169: Content needed: "Connecting to ZooKeeper"

[hanm] ZOOKEEPER-2786: Flaky test:

[hanm] ZOOKEEPER-2864: Add script to run a java api compatibility tool

[hanm] ZOOKEEPER-2870: Improve the efficiency of AtomicFileOutputStream

[hanm] ZOOKEEPER-2859: Fix CMake build on OS X.

[hanm] Fix typos in zookeeperAdmin.html

[hanm] ZOOKEEPER-2874: Windows Debug builds don't link with `/MTd`

[hanm] ZOOKEEPER-2872: Interrupted snapshot sync causes data loss

[hanm] ZOOKEEPER-2804: Node creation fails with NPE if ACLs are null

[hanm] ZOOKEEPER-2861: Main-Class JAR manifest attribute is incorrect

[hanm] Update README.txt. Create a section on How to Contribute to make new

[camille] ZOOKEEPER-2836: fix SocketTimeoutException

[hanm] ZOOKEEPER-2880: Rename README.txt to README.md

[hanm] ZOOKEEPER-2875: Add ant task for running OWASP dependency report

[hanm] ZOOKEEPER-2630: Use interface type instead of implementation type whe…

[hanm] ZOOKEEPER-2349: Update documentation for snapCount

[hanm] ZOOKEEPER-2581: Not handled NullPointerException while creating key

[hanm] ZOOKEEPER-2777: There is a typo in zk.py which prevents from

[phunt] ZOOKEEPER-2896: Remove unused imports from

[phunt] ZOOKEEPER-2905: Don't include `config.h` in `zookeeper.h`

[phunt] ZOOKEEPER-2887: define dependency versions in build.xml to be easily

[phunt] ZOOKEEPER-2906: The OWASP dependency check jar should not be included in

[phunt] ZOOKEEPER-2904: Remove unused imports from

[phunt] ZOOKEEPER-2914: compiler warning using java 9

[phunt] ZOOKEEPER-2909: Create ant task to generate ivy dependency reports

[phunt] ZOOKEEPER-2890: Local automatic variable is left uninitialized and then

[phunt] ZOOKEEPER-2915: Use "strict" conflict management in ivy

[phunt] ZOOKEEPER-1703: Added instructions on how to run the example code

[phunt] ZOOKEEPER-2880 Rename README.txt to README.md - fixed packaging

[ashraer] y

[phunt] ZOOKEEPER-2690: Update documentation source for ZOOKEEPER-2574

[phunt] ZOOKEEPER-2923: The comment of the variable matchSyncs in class

[phunt] ZOOKEEPER-2934: Updated usage of LOG_DEBUG in recipes to follow changes

[phunt] ZOOKEEPER-2931: WriteLock recipe: Fix bug in znode ordering when the

[phunt] ZOOKEEPER-2795: Change log level for "ZKShutdownHandler is not

[phunt] ZOOKEEPER-2944: Specify correct overflow value

[phunt] ZOOKEEPER-2806: Flaky test:

[phunt] ZOOKEEPER-2948: Failing c unit tests on apache jenkins

[phunt] ZOOKEEPER-2948: Failing c unit tests on apache jenkins - fix the config.

[phunt] ZOOKEEPER-2935: [QP MutualAuth]: Port ZOOKEEPER-1045 implementation from

[phunt] ZOOKEEPER-2924: Refactor tests of LoadFromLogTest.java

[phunt] ZOOKEEPER-2338: set SOCK_CLOEXEC on socket if defined

[phunt] ZOOKEEPER-2951: remove trailing \ from JAVA_HOME

[phunt] ZOOKEEPER-2950: Add keys for the Zxid from the stat command to

[phunt] ZOOKEEPER-2952: Upgrade third party libs: netty, slf4j

[phunt] ZOOKEEPER-2953: Flaky Test: testNoLogBeforeLeaderEstablishment

[phunt] ZOOKEEPER-2893: very poor choice of logging if client fails to connect

[phunt] ZOOKEEPER-2249: CRC check failed when preAllocSize smaller than node

[phunt] ZOOKEEPER-2961: Fix testElectionFraud Flakyness

[phunt] ZOOKEEPER-2964: Conf" command returns dataDir and dataLogDir opposingly

[afine] ZOOKEEPER-1580: QuorumPeer.setRunning is not used

[afine] ZOOKEEPER-2949: using hostname and port to create SSLEngine

[afine] ZOOKEEPER-2824: `FileChannel#size` info should be added to

[afine] ZOOKEEPER-2939: Added last/min/max proposal size JMX beans

[afine] ZOOKEEPER-2967: Add check to validate dataDir and dataLogDir parameters

[afine] ZOOKEEPER-2978: fix potential null pointer exception when deleting node

[afine] ZOOKEEPER-2845: Apply commit log when restarting server.

[afine] ZOOKEEPER-2936: Removed duplicate code

[hanm] ZOOKEEPER-2992: The eclipse build target fails due to protocol

[hanm] ZOOKEEPER-3001: Incorrect log message when try to delete container node

[hanm] ZOOKEEPER-2998: CMake declares incorrect ZooKeeper version

[hanm] ZOOKEEPER-2997: CMake should not force static CRT linking

[hanm] ZOOKEEPER-3006: Potential NPE in ZKDatabase#calculateTxnLogSizeLimit

[hanm] ZOOKEEPER-3017: Link libm in CMake on FreeBSD.

[hanm] ZOOKEEPER-2999: CMake build should use target-level commands

[hanm] ZOOKEEPER-3002: upgrade to jdk 8

[phunt] ZOOKEEPER-2994: Tool required to recover log and snapshot entries with

[phunt] ZOOKEEPER-3025: cmake broken on windows - make `hashtable` search

[phunt] ZOOKEEPER-2415: SessionTest is using Thread deprecated API

[phunt] ZOOKEEPER-2955: Enable Clover code coverage report

[phunt] ZOOKEEPER-3007: Potential NPE in ReferenceCountedACLCache#deserialize

[phunt] ZOOKEEPER-3027: Accidently removed public API of

[hanm] ZOOKEEPER-2988: NPE triggered if server receives a vote for a server …

[fpj] ZOOKEEPER-2982: Re-try DNS hostname -> IP resolution if node connection

[phunt] ZOOKEEPER-2901: TTL Nodes don't work with Server IDs > 127

[phunt] ZOOKEEPER-3012: Fix unit test: testDataDirAndDataLogDir should not use

[ashraer] ZOOKEEPER-2959: ignore accepted epoch and LEADERINFO ack from observers

[phunt] ZOOKEEPER-3038: Cleanup some nitpicks in TTL implementation

[phunt] ZOOKEEPER-3039: TxnLogToolkit uses Scanner badly

[phunt] ZOOKEEPER-3041: Typo in error message, affects log analysis; charater

[phunt] ZOOKEEPER-3046: added junit timeout to precede 'ant' timeout

[hanm] ZOOKEEPER-3050: update to the newest version of Jetty

[hanm] ZOOKEEPER-3051: Updated jackson to the latest version

[hanm] ZOOKEEPER-2993: Removed 'generated' line from .gitignore

[phunt] ZOOKEEPER-1919 Update the C implementation of removeWatches to have it

[phunt] ZOOKEEPER-3043: QuorumKerberosHostBasedAuthTest fails on Linux box:

[phunt] ZOOKEEPER-2317: Ensure that OSGi versions are valid

[hanm] ZOOKEEPER-2920: Upgrade OWASP Dependency Check to 3.2.1

[phunt] ZOOKEEPER-2968: Add C client code coverage tests

[andor] ZOOKEEPER-3019: add metric for slow fsyncs count

[hanm] ZOOKEEPER-3063: Track outstanding changes with ArrayDeque

[hanm] ZOOKEEPER-3009: Potential NPE in NIOServerCnxnFactory

[andor] [ZOOKEEPER-2368] Send a watch event is when a client is closed

[andor] ZOOKEEPER-3059: EventThread leak in case of Sasl AuthFailed

[andor] ZOOKEEPER-3066: Expose on JMX of Followers the id of the current leader

[andor] ZOOKEEPER-3022: MAVEN MIGRATION - Iteration 1 - docs, it

[andor] ZOOKEEPER-2873: abort startup on invalid ports

[breed] ZOOKEEPER-2886: Permanent session moved error in multi-op only conne…

[breed] ZOOKEEPER-3079: avoid unsafe use of sprintf(3)

[breed] ZOOKEEPER-3078: remove print_completion_queue

[breed] ZOOKEEPER-3073: fix couple of typos

[hanm] ZOOKEEPER-3084: Exit when ZooKeeper cannot bind to the leader election

[phunt] ZOOKEEPER-2940: Deal with maxbuffer as it relates to large requests from

[andor] ZOOKEEPER-3087: Fix findbug warning introduced by ZOOKEEPER-3084.

[andor] ZOOKEEPER-3033: MAVEN MIGRATION - Step 1.2 - create zk-recipes maven

[hanm] ZOOKEEPER-2184: Zookeeper Client should re-resolve hosts when connection

[andor] ZOOKEEPER-3042: testFailedTxnAsPartOfQuorumLoss is flaky

[andor] ZOOKEEPER-3074: Flaky

[hanm] ZOOKEEPER-3083: Remove some redundant and noisy log lines

[phunt] ZOOKEEPER-3046: increased test timeout

[phunt] ZOOKEEPER-3077: build outside of source directory

[phunt] ZOOKEEPER-3093: sync zerror with ZOO_ERRORS

[andor] ZOOKEEPER-3068: Improve C client logging of IPv6 hosts

[hanm] ZOOKEEPER-3097: Using Runnable instead of thread work items to improve

[hanm] ZOOKEEPER-2251: Add Client side packet response timeout to avoid

[hanm] ZOOKEEPER-3094: Make BufferSizeTest reliable

[andor] ZOOKEEPER-3057: Fix IPv6 literal usage

[andor] ZOOKEEPER-3067: Optionally disable client environment logging.

[breed] ZOOKEEPER-3061: add more details to 'Unhandled scenario for peer'

[breed] ZOOKEEPER-3072: Throttle race condition fix

[breed] ZOOKEEPER-3095: Connect string fix for non-existent hosts

[hanm] ZOOKEEPER-3082: Fix server snapshot behavior when out of disk space

[phunt] ZOOKEEPER-3062: mention fsync.warningthresholdms in FileTxnLog LOG.warn

[breed] ZOOKEEPER-3104: Fix data inconsistency due to NEWLEADER being sent too

[andor] ZOOKEEPER-3057: Fix build by adding missing licence header

[andor] ZOOKEEPER-3085: define exit codes in enum

[andor] ZOOKEEPER-3030: MAVEN MIGRATION - Step 1.3 - move contrib directories

[hanm] ZOOKEEPER-2926: Fix potential data consistency issue due to the session

[hanm] ZOOKEEPER-3110: Improve the closeSession throughput in

[andor] ZOOKEEPER-3103: Pluggable metrics system for ZooKeeper - MetricsProvider

[andor] ZOOKEEPER-3120: add NetBeans nbproject directory to .gitignore

[andor] ZOOKEEPER-3033: MAVEN MIGRATION - fix directory structure

[andor] ZOOKEEPER-3117: Correct the LeaderBean.followerInfo to only return the

[andor] ZOOKEEPER-3031: MAVEN MIGRATION - Step 1.4 - move client dir

[hanm] ZOOKEEPER-3109: Avoid long unavailable time due to voter changed mind

[andor] ZOOKEEPER-3080: MAVEN MIGRATION - Step 1.5 - move jute dir

[andor] ZOOKEEPER-3116: Make the DataTree.approximateDataSize more efficient

[andor] ZOOKEEPER-2913: testEphemeralNodeDeletion is flaky

[hanm] ZOOKEEPER-3127: Fixing potential data inconsistency due to update last

[hanm] ZOOKEEPER-3090: continue can be replaced with break

[hanm] ZOOKEEPER-3131: Remove watcher when session closed in NettyServerCnxn

[hanm] ZOOKEEPER-3136: Reduce log in ClientBase in case of ConnectException

[andor] ZOOKEEPER-1990: fix Random instances

[hanm] ZOOKEEPER-2261: When only secureClientPort is configured connections,

[andor] ZOOKEEPER-3123: MetricsProvider Lifecycle in ZooKeeper Server

[andor] ZOOKEEPER-3125: Fixing pzxid consistent issue when replaying a txn for a

[andor] ZOOKEEPER-1823: zkTxnLogToolkit -dump should support printing

[hanm] ZOOKEEPER-3137: add a utility to truncate logs to a zxid

[hanm] ZOOKEEPER-3144: Fix potential ephemeral nodes inconsistent due to global

[hanm] ZOOKEEPER-3142: Extend SnapshotFormatter to dump data in json format

[hanm] ZOOKEEPER-3098: Add additional server metrics

[hanm] ZOOKEEPER-2847: Cannot bind to client port when reconfig based on old

[hanm] ZOOKEEPER-3146: Limit the maximum client connections per IP in

[hanm] ZOOKEEPER-1177: Add the memory optimized watch manager for concentrate

[hanm] ZOOKEEPER-2847: Cannot bind to client port when reconfig based on old

[andor] ZOOKEEPER-1908: setAcl should be have a recursive function

[andor] ZOOKEEPER-3032: MAVEN MIGRATION - move java server, client

[andor] ZOOKEEPER-3153: Create MarkDown files and build process for them

[andor] ZOOKEEPER-3106: Zookeeper client supports IPv6 address and document the

[andor] ZOOKEEPER-3157: Improve FuzzySnapshotRelatedTest to avoid flaky due to

[andor] ZOOKEEPER-3161: Refactor QuorumPeerMainTest.java: move commonly used

[andor] ZOOKEEPER-3159: Flaky: ClientRequestTimeoutTest.testClientRequestTimeout

[andor] ZOOKEEPER-3154: Update release process to use the MarkDown solution

[andor] ZOOKEEPER-236: SSL Support for Atomic Broadcast protocol (master)

[andor] ZOOKEEPER-3113: EphemeralType.get() fails to verify ephemeralOwner when

[andor] ZOOKEEPER-3032: MAVEN MIGRATION - zookeeper-server

[hanm] ZOOKEEPER-3163: Use session map in the Netty to improve close session

[fangmin] ZOOKEEPER-2807: Fix flaky test

[andor] ZOOKEEPER-3156: Add in option to canonicalize host name

[andor] ZOOKEEPER-3155: Remove Forrest XMLs and their build process from the …

[andor] ZOOKEEPER-3173: Quorum TLS - support PEM trust/key stores

[andor] ZOOKEEPER-3162: Broken lock semantics in C client lock-recipe.

[andor] ZOOKEEPER-3071: Add a config parameter to control transaction log size

[hanm] ZOOKEEPER-3177: Refactor request throttle logic in NIO and Netty to keep

[hanm] ZOOKEEPER-3190: Spell check on the Zookeeper server files

[hanm] ZOOKEEPER-3177: Revert globalOutstandingLimit refactoring changes

[andor] ZOOKEEPER-3152: Port ZK netty stack to netty4

[andor] ZOOKEEPER-1441: JAVA 11 - Some test cases are failing because Port bind

[andor] ZOOKEEPER-3193: Flaky: org.apache.zookeeper.test.SaslAuthFailNotifyTest

[andor] ZOOKEEPER-2822: Wrong `ObjectName` about `MBeanServer` in JMX module

[andor] ZOOKEEPER-3172: Quorum TLS - fix port unification to allow rolling

[andor] ZOOKEEPER-3194: Quorum TLS - fix copy/paste bug in ZKTrustManager

[fangmin] ZOOKEEPER-3183: Interrupting the WatcherCleaner thread during shutdown

[andor] ZOOKEEPER-1818: Correctly handle potential inconsistent

[andor] ZOOKEEPER-2778: QuorumPeer: address potential reconfiguration deadlocks

[fangmin] ZOOKEEPER-3140: Allow Followers to host Observers

[andor] ZOOKEEPER-1636: cleanup completion list of a failed multi request

[andor] ZOOKEEPER-3207: Removing the unexpected WatchManager.java introduced by

[andor] ZOOKEEPER-3208 ZOOKEEPER-3032: Remove the SSLTest.java.orig introduced

[andor] ZOOKEEPER-3174: Quorum TLS - support reloading trust/key store

[andor] ZOOKEEPER-3029: add pom.xml for jute, client and server

[fangmin] ZOOKEEPER-3219: Fix flaky FileChangeWatcherTest

[fangmin] ZOOKEEPER-3216: Make init/sync limit tunable via JMX

[fangmin] ZOOKEEPER-3125: Only patching the pzxid when it's larger than the

[phunt] ZOOKEEPER-3230: Add Apache NetBeans Maven project files to .gitignore

[andor] ZOOKEEPER-3228: [TLS] Fix key usage extension in test certs

[fangmin] ZOOKEEPER-3205: Add test cases for jute

[andor] ZOOKEEPER-3226: MAVEN MIGRATION - - add profile for C build

[andor] ZOOKEEPER-3171: MAVEN MIGRATION - - Add recipes and contrib maven build

[andor] ZOOKEEPER-3233: Run github pre-commit hook tests on 4 threads

[andor] ZOOKEEPER-3222: Flaky: multiple intermittent segfaults in C++ tests

[andor] ZOOKEEPER-3217: owasp job flagging slf4j on trunk

[andor] ZOOKEEPER-3223: Configure Spotbugs

[andor] ZOOKEEPER-2641: AvgRequestLatency metric improves to be more accurate

[andor] ZOOKEEPER-3203: Tracking the number of non voting followers in ZK

[andor] ZOOKEEPER-3197: Improve documentation in ZooKeeperServer.superSecret

[andor] ZOOKEEPER-3210: typo in zookeeperInternals doc

[andor] ZOOKEEPER-3235: Enable secure processing and disallow DTDs in the

[andor] ZOOKEEPER-3202: Add timing margin to improve reliability of

[andor] ZOOKEEPER-3180: Add response cache to improve the throughput of read …

[andor] ZOOKEEPER-3195: TLS - disable client-initiated renegotiation

[andor] ZOOKEEPER-2284: LogFormatter and SnapshotFormatter does not handle

[andor] ZOOKEEPER-3122: MAVEN MIGRATION - - remove contrib build from default

[andor] ZOOKEEPER-3209: New `getEphemerals` api to get all the ephemeral nodes

[andor] ZOOKEEPER-3209: Fix compilation error

[fangmin] ZOOKEEPER-3218: Add min notification interval property for fast leader

[fangmin] ZOOKEEPER-3232: make the log of notification about LE more readable

[andor] ZOOKEEPER-3223: Configure spotbugs - part 2

[andor] ZOOKEEPER-3242: Add server side connecting throttling

[andor] ZOOKEEPER-3176: Quorum TLS - add SSL config options

[andor] ZOOKEEPER-3160: Custom User SSLContext

[andor] ZOOKEEPER-3229: [TLS] add AES-256 ciphers to default cipher list

[andor] ZOOKEEPER-3250: typo in doc - zookeeperInternals

[andor] ZOOKEEPER-3256: Enable OWASP checks to Maven build

[andor] Fix typos

[andor] ZOOKEEPER-3236: Upgrade BouncyCastle

[andor] ZOOKEEPER-3240: Close socket on Learner shutdown to avoid dangling so…

[andor] Revert "ZOOKEEPER-3240: Close socket on Learner shutdown to avoid

[andor] ZOOKEEPER-3249: Avoid reverting the cversion and pzxid during replaying

[andor] ZOOKEEPER-3251: Add new server metric types: percentile counter and c…

[andor] ZOOKEEPER-3257: Merge count and byte update of Stat

[andor] ZOOKEEPER-3251: Add new server metric types - fix Maven build

[andor] ZOOKEEPER-3238: Adding noreferrer to target blank link

[andor] ZOOKEEPER-2825: 1. Remove unnecessary import; 2. `contains` instead of

[andor] ZOOKEEPER-2826: Code refactoring for `CLI` module

[phunt] ZOOKEEPER-3262: Update dependencies flagged by OWASP report

[andor] ZOOKEEPER-3265: Fix fileset to match shell scripts and python files i…

[andor] ZOOKEEPER-3269: Add queueEvent to the Testable facade

[andor] ZOOKEEPER-1392: Request READ or ADMIN permission for getAcl()

[andor] ZOOKEEPER-3234: Add Travis-CI configuration file

[andor] Fix typos in zookeeperOver.md

[andor] ZOOKEEPER-3273: Sync BouncyCastle version in Maven build and Ant build

[andor] ZOOKEEPER-2892: Improve lazy initialize and close stream for

[andor] ZOOKEEPER-3167: add an API and the corresponding CLI to get total count

[andor] ZOOKEEPER-3028: MAVEN MIGRATION - - Create maven assembly

[andor] ZOOKEEPER-3272: Clean up netty4 code per Norman Maurer's review comments

[andor] Fix typos in javaExample.md

[andor] Fix typos in index.md

[andor] ZOOKEEPER-3276: Make X509UtilTest.testCreateSSLServerSocketWithPort less

[andor] ZOOKEEPER-3275: Fix release targets: package, tar, mvn-deploy

[andor] ZOOKEEPER-974: Allow a configurable ZooKeeper server socket listen ba…

[andor] ZOOKEEPER-3239: Adding EnsembleAuthProvider to verify the ensemble name

[andor] Fix ant package target: pom.template, zooinspector

[andor] ZOOKEEPER-3277: Add trace listener in NettyServerCnxnFactory only if

[andor] ZOOKEEPER-3274: Use CompositeByteBuf to queue data in NettyServerCnxn

[andor] ZOOKEEPER-3234: Add Travis-CI configuration file

[andor] ZOOKEEPER-3234: Add Travis-CI configuration file

[andor] ZOOKEEPER-3034: Facing issues while building from source

[andor] ZOOKEEPER-3285: Maven migration - add convenience tar, assembly module

[andor] Fix for lincense files and contrib folder during release

[phunt] Fix typo in error log message, added missing space

[fangmin] ZOOKEEPER-3255: Add a banner to make the startup of zk server more cool

[andor] ZOOKEEPER-3267: Add watcher metrics

[phunt] Add .ant-targets-build.xml to the ignore list - ant generates this

[phunt] ZOOKEEPER-3253: client should not send requests with cxid=-4, -2, or -1

[phunt] Exclude spotbugs annotations jar from the release

[andor] ZOOKEEPER-2750: Document SSL Support for Atomic Broadcast protocol

[andor] ZOOKEEPER-3046: wait for clients to reconnect after restarting server

[andor] ZOOKEEPER-2474: add a way for client to reattach to a session when using

[phunt] ZOOKEEPER-3312: Upgrade Jetty to 9.4.15.v20190215

[fangmin] ZOOKEEPER-3291: Improve error message when JAVA_HOME is set to the wrong

[phunt] ZOOKEEPER-2621: ZooKeeper doesn't start on MINGW32 (Windows)

[andor] ZOOKEEPER-2168: Add C APIs for new createContainer Methods

[fangmin] ZOOKEEPER-3327: Add unrecoverable error metric

[andor] fix: grammar fixes and link adds

[andor] ZOOKEEPER-3122: fix some maven release related issues

[andor] ZOOKEEPER-3122: Only deploy zk-server and zk-jute to maven repo

[andor] ZOOKEEPER-3122: Rename zookeeper-server to zookeeper

[andor] ZOOKEEPER-3122: add root dir inside tarballs

[andor] ZOOKEEPER-3302: ZooKeeper C client does not compile on Fedora 29

[andor] ZOOKEEPER-3122: fix files included in tarballs

[andor] ZOOKEEPER-3122: add missing pom to source tarball

[andor] ZOOKEEPER-2609: Add TTL Node APIs to C client

[andor] ZOOKEEPER-3314: Document the possibility of MultiCallback receiving a

[andor] ZOOKEEPER-3335: Improve the usage of Collections

[andor] ZOOKEEPER-3341: Remove Superfluous ByteBuffer Duplicate

[andor] ZOOKEEPER-3179: Add snapshot compression to reduce the disk IO

[andor] ZOOKEEPER-3324: Add read/write metrics for top level znodes

[andor] ZOOKEEPER-3143: Pluggable metrics system for ZooKeeper - Data Collection

[andor] ZOOKEEPER-3348: Make TxnLog and TxnLog Iterator Closable

[andor] ZOOKEEPER-3332: TxnLogToolkit should print multi transactions readably

[andor] ZOOKEEPER-3351: Fix findBugs and rat check, add filename to sha

[andor] ZOOKEEPER-3310: Add metrics for prep processor

[andor] Revert "ZOOKEEPER-3310: Add metrics for prep processor"

[andor] ZOOKEEPER-3310: Add metrics for prep processor

[andor] Revert "ZOOKEEPER-3310: Add metrics for prep processor"

[andor] ZOOKEEPER-3310: Add metrics for prep processor

[andor] ZOOKEEPER-3037: Add JVMPauseMonitor

[fangmin] ZOOKEEPER-3326: Add session/connection related metrics

[andor] ZOOKEEPER-3369: Maven release artifacts cleanup

[fangmin] ZOOKEEPER-3268: Add commit processor metrics

[andor] ZOOKEEPER-3372: Cleanup pom.xml in order to let Maven clients import as

[andor] ZOOKEEPER-3306: Fixing node not accessible issue due the inconsistent

[andor] ZOOKEEPER-3020: Review of SyncRequestProcessor

[fangmin] ZOOKEEPER-3319: Add metrics for follower and observer

[andor] ZOOKEEPER-3343: Add a new doc:zookeeperTools.md

[andor] ZOOKEEPER-3360: Misprint in javadoc

[andor] ZOOKEEPER-3350: Remove CommonNames

[fangmin] ZOOKEEPER-3305: Add Quorum Packet metrics

[fangmin] ZOOKEEPER-3331: Automatically add IP authorization for Netty connections

[andor] ZOOKEEPER-3362: Create a simple checkstyle file

[andor] ZOOKEEPER-3364: Compile with strict options in order to check code

[andor] ZOOKEEPER-3383: Improve prep processor metric accuracy and de-flaky u…

[andor] ZOOKEEPER-3244: Add option to snapshot based on log size

[andor] ZOOKEEPER-3353: Admin commands for showing initial settings

[andor] ZOOKEEPER-3237: Allow IPv6 wildcard address in peer config

[andor] ZOOKEEPER-3396: Flaky test in RestoreCommittedLogTest

[eolivelli] ZOOKEEPER-3263: JAVA9/11 Warnings: Illegal reflective access in

[eolivelli] ZOOKEEPER-1425: add version command to the zookeeper client shell

[eolivelli] ZOOKEEPER-3378: Set the quorum cnxn timeout independently from syncLimit

[fangmin] ZOOKEEPER-3323: Add TxnSnapLog metrics

[fangmin] 948

[eolivelli] ZOOKEEPER-3311: Allow a delay to the transaction log flush

[andor] ZOOKEEPER-2694: sync CLI command does not wait for result from server

[eolivelli] ZOOKEEPER-3399: Remove logging in getGlobalOutstandingLimit for optimal

[nkalmar] ZOOKEEPER-3392: Add admin command to display last snapshot information

[andor] ZOOKEEPER-3379: De-flaky test in Quorum Packet Metrics

[nkalmar] ZOOKEEPER-3401: Fix metric PROPOSAL_ACK_CREATION_LATENCY

[nkalmar] ZOOKEEPER-3404: Downgrade BouncyCastle to 1.60

[andor] ZOOKEEPER-3382: Update Documentation: If you only have one storage

[nkalmar] ZOOKEEPER-3405: Upgrade the version of Jackson-databind to address OWASP

[andor] ZOOKEEPER-1426: add version command to the zookeeper server

[eolivelli] ZOOKEEPER-3409: Compile Java code with -Xdoclint

[nkalmar] Fix typos and grammar in zookeeper docs

[nkalmar] ZOOKEEPER-3366: Pluggable metrics system for ZooKeeper - move remaining

[hanm] ZOOKEEPER-3388: Allow client port to support plaintext and encrypted …

[hanm] ZOOKEEPER-3385: Add admin command to display leader

[fangmin] ZOOKEEPER-3309: Add sync processor metrics

[nkalmar] ZOOKEEPER-3385: fix build break.

[fangmin] ZOOKEEPER-3321: Add metrics for Leader

[fangmin] ZOOKEEPER-3354: Improve efficiency of DeleteAllCommand

[eolivelli] ZOOKEEPER-3416: Remove redundant ServerCnxnFactoryAccessor.

[hanm] ZKUtil deleteRecursive check LOG Level before calculate the parameter

[nkalmar] ZOOKEEPER-3091: Prometheus.io Metrics Provider

[eolivelli] ZOOKEEPER-3296: Explicitly closing the sslsocket when it failed

[eolivelli] ZOOKEEPER-3413: add a serialVersionUID for ClientCnxnLimitException to

[andor] ZOOKEEPER-3288: add a new doc:ZookeeperCLI.md

[phunt] Add some python basics to gitignore

[phunt] ZOOKEEPER-3105: Character coding problem occur when create a node using

[andor] ZOOKEEPER-3391: Drop unused RecFormat(CSV/XML)

[nkalmar] ZOOKEEPER-3365: Use Concurrent HashMap with Counter in

[nkalmar] ZOOKEEPER-3433: zkpython build broken after maven migration

[andor] ZOOKEEPER-3407: Update POM file

[nkalmar] ZOOKEEPER-3423: use the maven-like way to ignore the generated version

[andor] ZOOKEEPER-3402: Add multiRead operation

[nkalmar] ZOOKEEPER-3355: Remove 'tbd' From Docs

[nkalmar] Move Travis to openjdk11, oraclejdk11 does not work anymore

[hanm] ZOOKEEPER-3421: Better insight into Observer connections

[hanm] ZOOKEEPER-3440: Fix Apache RAT check by excluding binary files (images)

[andor] ZOOKEEPER-3370: Remove SVN specific revision generation

[andor] ZOOKEEPER-3240: Close socket on Learner shutdown to avoid dangling so…

[hanm] ZOOKEEPER-3439: Observability improvements on client / server connection

[hanm] ZOOKEEPER-2418: txnlog diff sync can skip sending some transactions t…

[hanm] ZOOKEEPER-3243: Add server-side request throttling

[hanm] ZOOKEEPER-2894: Memory and completions leak on zookeeper_close

[andor] ZOOKEEPER-3410: zkTxnLogToolkit.sh will throw the NPE and stop the

[eolivelli] ZOOKEEPER-3441: OWASP is flagging jackson-databind-2.9.9.jar for CVE-…

[nkalmar] ZOOKEEPER-3453: zkcli.cmd: ZOO_LOG_FILE is missing set / second try

[andor] ZOOKEEPER-3398: Learner.connectToLeader() may take too long to time-out

[nkalmar] ZOOKEEPER-3459: Add admin command to display synced state of peer

[andor] ZOOKEEPER-3443: Add support of PKCS12 trust/key stores

[nkalmar] ZOOKEEPER-3462: Drop Java 9 support

[andor] ZOOKEEPER-2563: A revisit to setquota

[eolivelli] ZOOKEEPER-3463: Enable warning messages in maven compiler plugin

[eolivelli] ZOOKEEPER-3356: Implement advanced Netty flow control based on feedback

[eolivelli] ZOOKEEPER-1634: hardening security by teaching server to enforce client

[eolivelli] ZOOKEEPER-3437: Improve sync throttling on a learner master

[eolivelli] ZOOKEEPER-3386: Add admin command to display voting view

[andor] ZOOKEEPER-3457: Code optimization in QuorumCnxManager

[nkalmar] ZOOKEEPER-3320: Leader election port stop listen when hostname

[andor] ZOOKEEPER-3371: Port unification for Jetty admin server

[eolivelli] ZOOKEEPER-3468: Enable BookKeeper checkstyle configuration on

[hanm] ZOOKEEPER-3359: Batch commits in the CommitProcessor

[andor] Revert "ZOOKEEPER-3320: Leader election port stop listen when hostname

[hanm] ZOOKEEPER-3150: Add tree digest check and verify data integrity when

[eolivelli] ZOOKEEPER-3430: Observability improvement: provide top N read / write

[eolivelli] ZOOKEEPER-3418: Improve quorum throughput through eager ACL checks of

[hanm] Skip flaky test RequestPathMetricsCollectorTest.testCollectStats to

[andor] ZOOKEEPER-3455: fix UnifiedServerSocketTest on jdk 13

[andor] ZOOKEEPER-3447: add a doc: zookeeperMonitor.md

[hanm] ZOOKEEPER-3479: Logging false leader election times

[fangmin] ZOOKEEPER-3339: Improve Debug and Trace Log Statements

[enrico.olivelli] ZOOKEEPER-3474: Enable BookKeeper checkstyle configuration on

[hanm] ZOOKEEPER-3472: Treat check request as a write request which needs to

[hanm] ZOOKEEPER-3395: Document individual admin commands in markdown

[hanm] ZOOKEEPER-3480: Fix the flaky test in CommitProcessorMetricsTest

[hanm] ZOOKEEPER-3373: need change description for "Single System Image"

[hanm] ZOOKEEPER-3494: remove unnecessary broad netty-all dependency

[andor] ZOOKEEPER-3320: Leader election port stop listen when hostname

[andor] ZOOKEEPER-3344: write a new script:zkSnapShotToolkit.sh to encapsulate

[andor] ZOOKEEPER-3470: fix flaky LearnerMetricsTest

[andor] ZOOKEEPER-2891: Invalid processing of zookeeper_close for mutli-request

[andor] ZOOKEEPER-3498: Move jute generated sources to generated-source/java

[andor] ZOOKEEPER-3347: Improve PathTrie Consistency

[hanm] ZOOKEEPER-3475: Enable Checkstyle configuration on zookeeper-server

[hanm] Remove an invalid non ASCII encoded char from comment of

[nkalmar] ZOOKEEPER-3510: Make 'zkServer.sh stop' more reliable

[eolivelli] ZOOKEEPER-3448: Introduce MessageTracker to assist debug leader and

[eolivelli] ZOOKEEPER-3518: owasp check flagging jackson-databind 2.9.9.1

[nkalmar] ZOOKEEPER-3517: Turn on BookKeeper checkstyle configuration at project

[eolivelli] ZOOKEEPER-3519: upgrade dependency-check to 5.2.1

[hanm] ZOOKEEPER-3522: Consistency guarantees discussion.

[hanm] ZOOKEEPER-3525: Add project status badges to README

[enrico.olivelli] ZOOKEEPER-3056: Fails to load database with missing snapshot file but

[hanm] ZOOKEEPER-3528: Revisit AsyncCallback javadoc

[hanm] ZOOKEEPER-3492: Add weights to server side connection throttling

[hanm] ZOOKEEPER-3522: Reword Zookeeper consistency doc for clarity

[hanm] ZOOKEEPER-3491: Specify commitLogCount value using a system property

[hanm] ZOOKEEPER-3532: Provide a docker-based environment to work on a known OS

[hanm] ZOOKEEPER-3484: Improve the throughput by optimizing the synchronizat…

[nkalmar] ZOOKEEPER-3124: Add the correct comment to show why we need the special

[andor] ZOOKEEPER-3495: fix SnapshotDigestTest to work with JDK12+

[eolivelli] ZOOKEEPER-3540: Avoid client port unavailable by skip binding the same

[enrico.olivelli] ZOOKEEPER-3145: Fix potential watch missing issue due to stale pzxid

[nkalmar] ZOOKEEPER-3545: Fix LICENSE files for netty dependency

[hanm] ZOOKEEPER-3503: Add server side large request throttling

[nkalmar] ZOOKEEPER-3523: Replace dummy watcher with a unified singleton

[nkalmar] ZOOKEEPER-3542: X509UtilTest#testClientRenegotiationFails is flaky on

[andor] ZOOKEEPER-3357: Remove Dead Link from ZooKeeper Programmer Guide

[nkalmar] ZOOKEEPER-3506: correct the javaDoc of the

[nkalmar] ZOOKEEPER-3501: unify the method:op2String()

[hanm] ZOOKEEPER-3529: add a new doc: zookeeperUseCases.md

[nkalmar] ZOOKEEPER-3470: Fix flaky LearnerMetricsTest (again)

[enrico.olivelli] ZOOKEEPER-3496: Transaction larger than jute.maxbuffer makes ZooKeeper

[nkalmar] ZOOKEEPER-3548: Redundant zxid check in SnapStream.isValidSnapshot.

[nkalmar] ZOOKEEPER-3559: Update Jackson to 2.9.10

[andor] ZOOKEEPER-2282: C Client: chroot not stripped in asynchronous callbacks

[arshad] ZOOKEEPER-1467: Make server principal configurable at client side.

[hanm] ZOOKEEPER-3537: Leader election - Use of out of election messages

[nkalmar] ZOOKEEPER-3563: Update Netty to address CVE-2019-16869

[andor] ZOOKEEPER-3563: Update Netty to 4.1.42.Final - fix license files

[andor] ZOOKEEPER-3531: Synchronization on ACLCache cause cluster to hang whe…

[andor] ZOOKEEPER-3471: Fix potential lock unavailable due to dangling ephemeral

[andor] ZOOKEEPER-3400: Add documentation on local sessions

[andor] ZOOKEEPER-3509: Revisit log format

[andor] ZOOKEEPER-3436: Enhance Mavenized Make C client

[andor] ZOOKEEPER-3530: add new artifact for compiled c-client code

[nixon] ZOOKEEPER-3593: fix the default value of jute.maxbuffer in client side

[enrico.olivelli] ZOOKEEPER-3605: connThrottle needs to be assigned in alternate

[enrico.olivelli] ZOOKEEPER-1416 - Persistent, recursive watchers

[eolivelli] ZOOKEEPER-3598: Fix potential data inconsistency issue due to

[eolivelli] ZOOKEEPER-1260: Audit logging in ZooKeeper servers.

[andor] ZOOKEEPER-3340: Introduce CircularBlockingQueue in QuorumCnxManager.java

[ericlee123] ZOOKEEPER-3614: Limiting the number of ephemeral nodes per session

[ericlee123] ZOOKEEPER-3614: Limiting the number of ephemeral nodes per session


------------------------------------------
[...truncated 733.01 KB...]
[WARNING] <https://builds.apache.org/job/PreCommit-ZOOKEEPER-github-pr-build-maven/ws/zookeeper-server/src/main/java/org/apache/zookeeper/AsyncCallback.java>:121: warning - Tag @see: can't find getData(String, Watcher, DataCallback, Object) in org.apache.zookeeper.ZooKeeper
[WARNING] <https://builds.apache.org/job/PreCommit-ZOOKEEPER-github-pr-build-maven/ws/zookeeper-server/src/main/java/org/apache/zookeeper/AsyncCallback.java>:121: warning - Tag @see: can't find getConfig(boolean, DataCallback, Object) in org.apache.zookeeper.ZooKeeper
[WARNING] <https://builds.apache.org/job/PreCommit-ZOOKEEPER-github-pr-build-maven/ws/zookeeper-server/src/main/java/org/apache/zookeeper/AsyncCallback.java>:121: warning - Tag @see: can't find getConfig(Watcher, DataCallback, Object) in org.apache.zookeeper.ZooKeeper
[WARNING] <https://builds.apache.org/job/PreCommit-ZOOKEEPER-github-pr-build-maven/ws/zookeeper-server/src/main/java/org/apache/zookeeper/AsyncCallback.java>:328: warning - Tag @see: can't find multi(Iterable, MultiCallback, Object) in org.apache.zookeeper.ZooKeeper
[WARNING] <https://builds.apache.org/job/PreCommit-ZOOKEEPER-github-pr-build-maven/ws/zookeeper-server/src/main/java/org/apache/zookeeper/AsyncCallback.java>:70: warning - Tag @see: can't find exists(String, boolean, StatCallback, Object) in org.apache.zookeeper.ZooKeeper
[WARNING] <https://builds.apache.org/job/PreCommit-ZOOKEEPER-github-pr-build-maven/ws/zookeeper-server/src/main/java/org/apache/zookeeper/AsyncCallback.java>:70: warning - Tag @see: can't find exists(String, Watcher, StatCallback, Object) in org.apache.zookeeper.ZooKeeper
[WARNING] <https://builds.apache.org/job/PreCommit-ZOOKEEPER-github-pr-build-maven/ws/zookeeper-server/src/main/java/org/apache/zookeeper/AsyncCallback.java>:70: warning - Tag @see: can't find setData(String, byte[], int, StatCallback, Object) in org.apache.zookeeper.ZooKeeper
[WARNING] <https://builds.apache.org/job/PreCommit-ZOOKEEPER-github-pr-build-maven/ws/zookeeper-server/src/main/java/org/apache/zookeeper/AsyncCallback.java>:70: warning - Tag @see: can't find setACL(String, List, int, StatCallback, Object) in org.apache.zookeeper.ZooKeeper
[WARNING] <https://builds.apache.org/job/PreCommit-ZOOKEEPER-github-pr-build-maven/ws/zookeeper-server/src/main/java/org/apache/zookeeper/AsyncCallback.java>:262: warning - Tag @see: can't find create(String, byte[], List, CreateMode, StringCallback, Object) in org.apache.zookeeper.ZooKeeper
[WARNING] <https://builds.apache.org/job/PreCommit-ZOOKEEPER-github-pr-build-maven/ws/zookeeper-server/src/main/java/org/apache/zookeeper/AsyncCallback.java>:299: warning - Tag @see: can't find delete(String, int, VoidCallback, Object) in org.apache.zookeeper.ZooKeeper
[WARNING] <https://builds.apache.org/job/PreCommit-ZOOKEEPER-github-pr-build-maven/ws/zookeeper-server/src/main/java/org/apache/zookeeper/AsyncCallback.java>:299: warning - Tag @see: can't find removeAllWatches(String, Watcher.WatcherType, boolean, VoidCallback, Object) in org.apache.zookeeper.ZooKeeper
[WARNING] <https://builds.apache.org/job/PreCommit-ZOOKEEPER-github-pr-build-maven/ws/zookeeper-server/src/main/java/org/apache/zookeeper/AsyncCallback.java>:299: warning - Tag @see: can't find removeWatches(String, Watcher, Watcher.WatcherType, boolean, VoidCallback, Object) in org.apache.zookeeper.ZooKeeper
[WARNING] <https://builds.apache.org/job/PreCommit-ZOOKEEPER-github-pr-build-maven/ws/zookeeper-server/src/main/java/org/apache/zookeeper/AsyncCallback.java>:299: warning - Tag @see: can't find sync(String, VoidCallback, Object) in org.apache.zookeeper.ZooKeeper
[WARNING] <https://builds.apache.org/job/PreCommit-ZOOKEEPER-github-pr-build-maven/ws/zookeeper-server/src/main/java/org/apache/zookeeper/AsyncCallback.java>:299: warning - Tag @link: can't find delete(String, int, VoidCallback, Object) in org.apache.zookeeper.ZooKeeper
[WARNING] <https://builds.apache.org/job/PreCommit-ZOOKEEPER-github-pr-build-maven/ws/zookeeper-server/src/main/java/org/apache/zookeeper/server/ZKDatabase.java>:509: warning - @return tag has no arguments.
[WARNING] <https://builds.apache.org/job/PreCommit-ZOOKEEPER-github-pr-build-maven/ws/zookeeper-server/src/main/java/org/apache/zookeeper/server/persistence/FileTxnLog.java>:310: warning - @return tag has no arguments.
[WARNING] <https://builds.apache.org/job/PreCommit-ZOOKEEPER-github-pr-build-maven/ws/zookeeper-server/src/main/java/org/apache/zookeeper/server/persistence/FileTxnSnapLog.java>:535: warning - @return tag has no arguments.
[WARNING] <https://builds.apache.org/job/PreCommit-ZOOKEEPER-github-pr-build-maven/ws/zookeeper-server/src/main/java/org/apache/zookeeper/server/persistence/SnapStream.java>:213: warning - @return tag has no arguments.
[WARNING] <https://builds.apache.org/job/PreCommit-ZOOKEEPER-github-pr-build-maven/ws/zookeeper-server/src/main/java/org/apache/zookeeper/server/persistence/Util.java>:255: warning - @return tag has no arguments.
[WARNING] <https://builds.apache.org/job/PreCommit-ZOOKEEPER-github-pr-build-maven/ws/zookeeper-server/src/main/java/org/apache/zookeeper/server/persistence/Util.java>:265: warning - @return tag has no arguments.
[WARNING] <https://builds.apache.org/job/PreCommit-ZOOKEEPER-github-pr-build-maven/ws/zookeeper-server/src/main/java/org/apache/zookeeper/server/util/CircularBuffer.java>:70: warning - @return tag has no arguments.
[WARNING] <https://builds.apache.org/job/PreCommit-ZOOKEEPER-github-pr-build-maven/ws/zookeeper-server/src/main/java/org/apache/zookeeper/server/quorum/Learner.java>:84: warning - @return tag has no arguments.
[WARNING] <https://builds.apache.org/job/PreCommit-ZOOKEEPER-github-pr-build-maven/ws/zookeeper-server/src/main/java/org/apache/zookeeper/server/quorum/Leader.java>:1128: warning - @return tag has no arguments.
[WARNING] <https://builds.apache.org/job/PreCommit-ZOOKEEPER-github-pr-build-maven/ws/zookeeper-server/src/main/java/org/apache/zookeeper/server/quorum/LearnerMaster.java>:131: warning - @return tag has no arguments.
[WARNING] <https://builds.apache.org/job/PreCommit-ZOOKEEPER-github-pr-build-maven/ws/zookeeper-server/src/main/java/org/apache/zookeeper/server/quorum/Leader.java>:256: warning - @param argument "qv," is not a parameter name.
[WARNING] <https://builds.apache.org/job/PreCommit-ZOOKEEPER-github-pr-build-maven/ws/zookeeper-server/src/main/java/org/apache/zookeeper/server/quorum/Leader.java>:904: warning - @param argument "zxid," is not a parameter name.
[WARNING] <https://builds.apache.org/job/PreCommit-ZOOKEEPER-github-pr-build-maven/ws/zookeeper-server/src/main/java/org/apache/zookeeper/server/quorum/Leader.java>:904: warning - @param argument "sid," is not a parameter name.
[WARNING] <https://builds.apache.org/job/PreCommit-ZOOKEEPER-github-pr-build-maven/ws/zookeeper-server/src/main/java/org/apache/zookeeper/server/quorum/LearnerHandler.java>:1151: warning - @return tag has no arguments.
[WARNING] <https://builds.apache.org/job/PreCommit-ZOOKEEPER-github-pr-build-maven/ws/zookeeper-server/src/main/java/org/apache/zookeeper/server/quorum/QuorumPeer.java>:1889: warning - @return tag has no arguments.
[WARNING] <https://builds.apache.org/job/PreCommit-ZOOKEEPER-github-pr-build-maven/ws/zookeeper-server/src/main/java/org/apache/zookeeper/cli/AclParser.java>:37: warning - @return tag has no arguments.
[WARNING] <https://builds.apache.org/job/PreCommit-ZOOKEEPER-github-pr-build-maven/ws/zookeeper-server/src/main/java/org/apache/zookeeper/cli/CliCommand.java>:77: warning - @return tag has no arguments.
[WARNING] <https://builds.apache.org/job/PreCommit-ZOOKEEPER-github-pr-build-maven/ws/zookeeper-server/src/main/java/org/apache/zookeeper/cli/CliCommand.java>:85: warning - @return tag has no arguments.
[WARNING] <https://builds.apache.org/job/PreCommit-ZOOKEEPER-github-pr-build-maven/ws/zookeeper-server/src/main/java/org/apache/zookeeper/cli/CliCommand.java>:93: warning - @return tag has no arguments.
[WARNING] <https://builds.apache.org/job/PreCommit-ZOOKEEPER-github-pr-build-maven/ws/zookeeper-server/src/main/java/org/apache/zookeeper/cli/CliCommand.java>:118: warning - @return tag has no arguments.
[INFO] Building jar: <https://builds.apache.org/job/PreCommit-ZOOKEEPER-github-pr-build-maven/ws/zookeeper-server/target/zookeeper-3.6.0-SNAPSHOT-javadoc.jar>
[INFO] 
[INFO] --- maven-dependency-plugin:3.1.1:copy-dependencies (copy-dependencies) @ zookeeper ---
[INFO] Downloading from central: https://repo.maven.apache.org/maven2/org/apache/maven/shared/maven-dependency-analyzer/1.10/maven-dependency-analyzer-1.10.pom
[INFO] Downloaded from central: https://repo.maven.apache.org/maven2/org/apache/maven/shared/maven-dependency-analyzer/1.10/maven-dependency-analyzer-1.10.pom (6.7 kB at 59 kB/s)
[INFO] Downloading from central: https://repo.maven.apache.org/maven2/org/apache/maven/shared/maven-shared-components/31/maven-shared-components-31.pom
[INFO] Downloaded from central: https://repo.maven.apache.org/maven2/org/apache/maven/shared/maven-shared-components/31/maven-shared-components-31.pom (5.1 kB at 393 kB/s)
[INFO] Downloading from central: https://repo.maven.apache.org/maven2/org/codehaus/plexus/plexus-utils/1.5.1/plexus-utils-1.5.1.pom
[INFO] Downloaded from central: https://repo.maven.apache.org/maven2/org/codehaus/plexus/plexus-utils/1.5.1/plexus-utils-1.5.1.pom (2.3 kB at 177 kB/s)
[INFO] Downloading from central: https://repo.maven.apache.org/maven2/org/apache/maven/maven-model/2.0.5/maven-model-2.0.5.pom
[INFO] Downloaded from central: https://repo.maven.apache.org/maven2/org/apache/maven/maven-model/2.0.5/maven-model-2.0.5.pom (2.7 kB at 247 kB/s)
[INFO] Downloading from central: https://repo.maven.apache.org/maven2/org/apache/maven/maven/2.0.5/maven-2.0.5.pom
[INFO] Downloaded from central: https://repo.maven.apache.org/maven2/org/apache/maven/maven/2.0.5/maven-2.0.5.pom (5.7 kB at 475 kB/s)
[INFO] Downloading from central: https://repo.maven.apache.org/maven2/org/apache/maven/maven-artifact/2.0.5/maven-artifact-2.0.5.pom
[INFO] Downloaded from central: https://repo.maven.apache.org/maven2/org/apache/maven/maven-artifact/2.0.5/maven-artifact-2.0.5.pom (727 B at 66 kB/s)
[INFO] Downloading from central: https://repo.maven.apache.org/maven2/org/apache/maven/shared/maven-dependency-tree/3.0.1/maven-dependency-tree-3.0.1.pom
[INFO] Downloaded from central: https://repo.maven.apache.org/maven2/org/apache/maven/shared/maven-dependency-tree/3.0.1/maven-dependency-tree-3.0.1.pom (7.5 kB at 625 kB/s)
[INFO] Downloading from central: https://repo.maven.apache.org/maven2/org/codehaus/plexus/plexus-velocity/1.1.7/plexus-velocity-1.1.7.jar
[INFO] Downloading from central: https://repo.maven.apache.org/maven2/org/apache/maven/shared/maven-dependency-analyzer/1.10/maven-dependency-analyzer-1.10.jar
[INFO] Downloading from central: https://repo.maven.apache.org/maven2/org/apache/maven/shared/maven-dependency-tree/3.0.1/maven-dependency-tree-3.0.1.jar
[INFO] Downloading from central: https://repo.maven.apache.org/maven2/org/apache/maven/shared/maven-common-artifact-filters/3.0.1/maven-common-artifact-filters-3.0.1.jar
[INFO] Downloaded from central: https://repo.maven.apache.org/maven2/org/apache/maven/shared/maven-common-artifact-filters/3.0.1/maven-common-artifact-filters-3.0.1.jar (61 kB at 2.6 MB/s)
[INFO] Downloaded from central: https://repo.maven.apache.org/maven2/org/codehaus/plexus/plexus-velocity/1.1.7/plexus-velocity-1.1.7.jar (7.7 kB at 240 kB/s)
[INFO] Downloaded from central: https://repo.maven.apache.org/maven2/org/apache/maven/shared/maven-dependency-tree/3.0.1/maven-dependency-tree-3.0.1.jar (37 kB at 965 kB/s)
[INFO] Downloaded from central: https://repo.maven.apache.org/maven2/org/apache/maven/shared/maven-dependency-analyzer/1.10/maven-dependency-analyzer-1.10.jar (35 kB at 706 kB/s)
[INFO] Copying spotbugs-annotations-3.1.9.jar to <https://builds.apache.org/job/PreCommit-ZOOKEEPER-github-pr-build-maven/ws/zookeeper-server/target/lib/spotbugs-annotations-3.1.9.jar>
[INFO] Copying jsr305-3.0.2.jar to <https://builds.apache.org/job/PreCommit-ZOOKEEPER-github-pr-build-maven/ws/zookeeper-server/target/lib/jsr305-3.0.2.jar>
[INFO] Copying hamcrest-all-1.3.jar to <https://builds.apache.org/job/PreCommit-ZOOKEEPER-github-pr-build-maven/ws/zookeeper-server/target/lib/hamcrest-all-1.3.jar>
[INFO] Copying commons-collections-3.2.2.jar to <https://builds.apache.org/job/PreCommit-ZOOKEEPER-github-pr-build-maven/ws/zookeeper-server/target/lib/commons-collections-3.2.2.jar>
[INFO] Copying commons-lang-2.6.jar to <https://builds.apache.org/job/PreCommit-ZOOKEEPER-github-pr-build-maven/ws/zookeeper-server/target/lib/commons-lang-2.6.jar>
[INFO] Copying zookeeper-jute-3.6.0-SNAPSHOT.jar to <https://builds.apache.org/job/PreCommit-ZOOKEEPER-github-pr-build-maven/ws/zookeeper-server/target/lib/zookeeper-jute-3.6.0-SNAPSHOT.jar>
[INFO] Copying commons-cli-1.2.jar to <https://builds.apache.org/job/PreCommit-ZOOKEEPER-github-pr-build-maven/ws/zookeeper-server/target/lib/commons-cli-1.2.jar>
[INFO] Copying audience-annotations-0.5.0.jar to <https://builds.apache.org/job/PreCommit-ZOOKEEPER-github-pr-build-maven/ws/zookeeper-server/target/lib/audience-annotations-0.5.0.jar>
[INFO] Copying netty-handler-4.1.42.Final.jar to <https://builds.apache.org/job/PreCommit-ZOOKEEPER-github-pr-build-maven/ws/zookeeper-server/target/lib/netty-handler-4.1.42.Final.jar>
[INFO] Copying netty-common-4.1.42.Final.jar to <https://builds.apache.org/job/PreCommit-ZOOKEEPER-github-pr-build-maven/ws/zookeeper-server/target/lib/netty-common-4.1.42.Final.jar>
[INFO] Copying netty-buffer-4.1.42.Final.jar to <https://builds.apache.org/job/PreCommit-ZOOKEEPER-github-pr-build-maven/ws/zookeeper-server/target/lib/netty-buffer-4.1.42.Final.jar>
[INFO] Copying netty-transport-4.1.42.Final.jar to <https://builds.apache.org/job/PreCommit-ZOOKEEPER-github-pr-build-maven/ws/zookeeper-server/target/lib/netty-transport-4.1.42.Final.jar>
[INFO] Copying netty-resolver-4.1.42.Final.jar to <https://builds.apache.org/job/PreCommit-ZOOKEEPER-github-pr-build-maven/ws/zookeeper-server/target/lib/netty-resolver-4.1.42.Final.jar>
[INFO] Copying netty-codec-4.1.42.Final.jar to <https://builds.apache.org/job/PreCommit-ZOOKEEPER-github-pr-build-maven/ws/zookeeper-server/target/lib/netty-codec-4.1.42.Final.jar>
[INFO] Copying netty-transport-native-epoll-4.1.42.Final.jar to <https://builds.apache.org/job/PreCommit-ZOOKEEPER-github-pr-build-maven/ws/zookeeper-server/target/lib/netty-transport-native-epoll-4.1.42.Final.jar>
[INFO] Copying netty-transport-native-unix-common-4.1.42.Final.jar to <https://builds.apache.org/job/PreCommit-ZOOKEEPER-github-pr-build-maven/ws/zookeeper-server/target/lib/netty-transport-native-unix-common-4.1.42.Final.jar>
[INFO] Copying slf4j-api-1.7.25.jar to <https://builds.apache.org/job/PreCommit-ZOOKEEPER-github-pr-build-maven/ws/zookeeper-server/target/lib/slf4j-api-1.7.25.jar>
[INFO] Copying slf4j-log4j12-1.7.25.jar to <https://builds.apache.org/job/PreCommit-ZOOKEEPER-github-pr-build-maven/ws/zookeeper-server/target/lib/slf4j-log4j12-1.7.25.jar>
[INFO] Copying jetty-server-9.4.18.v20190429.jar to <https://builds.apache.org/job/PreCommit-ZOOKEEPER-github-pr-build-maven/ws/zookeeper-server/target/lib/jetty-server-9.4.18.v20190429.jar>
[INFO] Copying javax.servlet-api-3.1.0.jar to <https://builds.apache.org/job/PreCommit-ZOOKEEPER-github-pr-build-maven/ws/zookeeper-server/target/lib/javax.servlet-api-3.1.0.jar>
[INFO] Copying jetty-http-9.4.18.v20190429.jar to <https://builds.apache.org/job/PreCommit-ZOOKEEPER-github-pr-build-maven/ws/zookeeper-server/target/lib/jetty-http-9.4.18.v20190429.jar>
[INFO] Copying jetty-util-9.4.18.v20190429.jar to <https://builds.apache.org/job/PreCommit-ZOOKEEPER-github-pr-build-maven/ws/zookeeper-server/target/lib/jetty-util-9.4.18.v20190429.jar>
[INFO] Copying jetty-io-9.4.18.v20190429.jar to <https://builds.apache.org/job/PreCommit-ZOOKEEPER-github-pr-build-maven/ws/zookeeper-server/target/lib/jetty-io-9.4.18.v20190429.jar>
[INFO] Copying jetty-servlet-9.4.18.v20190429.jar to <https://builds.apache.org/job/PreCommit-ZOOKEEPER-github-pr-build-maven/ws/zookeeper-server/target/lib/jetty-servlet-9.4.18.v20190429.jar>
[INFO] Copying jetty-security-9.4.18.v20190429.jar to <https://builds.apache.org/job/PreCommit-ZOOKEEPER-github-pr-build-maven/ws/zookeeper-server/target/lib/jetty-security-9.4.18.v20190429.jar>
[INFO] Copying jackson-databind-2.9.10.jar to <https://builds.apache.org/job/PreCommit-ZOOKEEPER-github-pr-build-maven/ws/zookeeper-server/target/lib/jackson-databind-2.9.10.jar>
[INFO] Copying jackson-annotations-2.9.10.jar to <https://builds.apache.org/job/PreCommit-ZOOKEEPER-github-pr-build-maven/ws/zookeeper-server/target/lib/jackson-annotations-2.9.10.jar>
[INFO] Copying jackson-core-2.9.10.jar to <https://builds.apache.org/job/PreCommit-ZOOKEEPER-github-pr-build-maven/ws/zookeeper-server/target/lib/jackson-core-2.9.10.jar>
[INFO] Copying json-simple-1.1.1.jar to <https://builds.apache.org/job/PreCommit-ZOOKEEPER-github-pr-build-maven/ws/zookeeper-server/target/lib/json-simple-1.1.1.jar>
[INFO] Copying bcprov-jdk15on-1.60.jar to <https://builds.apache.org/job/PreCommit-ZOOKEEPER-github-pr-build-maven/ws/zookeeper-server/target/lib/bcprov-jdk15on-1.60.jar>
[INFO] Copying bcpkix-jdk15on-1.60.jar to <https://builds.apache.org/job/PreCommit-ZOOKEEPER-github-pr-build-maven/ws/zookeeper-server/target/lib/bcpkix-jdk15on-1.60.jar>
[INFO] Copying jline-2.11.jar to <https://builds.apache.org/job/PreCommit-ZOOKEEPER-github-pr-build-maven/ws/zookeeper-server/target/lib/jline-2.11.jar>
[INFO] Copying metrics-core-3.2.5.jar to <https://builds.apache.org/job/PreCommit-ZOOKEEPER-github-pr-build-maven/ws/zookeeper-server/target/lib/metrics-core-3.2.5.jar>
[INFO] Copying log4j-1.2.17.jar to <https://builds.apache.org/job/PreCommit-ZOOKEEPER-github-pr-build-maven/ws/zookeeper-server/target/lib/log4j-1.2.17.jar>
[INFO] Copying kerb-core-1.1.0.jar to <https://builds.apache.org/job/PreCommit-ZOOKEEPER-github-pr-build-maven/ws/zookeeper-server/target/lib/kerb-core-1.1.0.jar>
[INFO] Copying kerby-pkix-1.1.0.jar to <https://builds.apache.org/job/PreCommit-ZOOKEEPER-github-pr-build-maven/ws/zookeeper-server/target/lib/kerby-pkix-1.1.0.jar>
[INFO] Copying kerby-asn1-1.1.0.jar to <https://builds.apache.org/job/PreCommit-ZOOKEEPER-github-pr-build-maven/ws/zookeeper-server/target/lib/kerby-asn1-1.1.0.jar>
[INFO] Copying kerby-util-1.1.0.jar to <https://builds.apache.org/job/PreCommit-ZOOKEEPER-github-pr-build-maven/ws/zookeeper-server/target/lib/kerby-util-1.1.0.jar>
[INFO] Copying kerb-simplekdc-1.1.0.jar to <https://builds.apache.org/job/PreCommit-ZOOKEEPER-github-pr-build-maven/ws/zookeeper-server/target/lib/kerb-simplekdc-1.1.0.jar>
[INFO] Copying kerb-client-1.1.0.jar to <https://builds.apache.org/job/PreCommit-ZOOKEEPER-github-pr-build-maven/ws/zookeeper-server/target/lib/kerb-client-1.1.0.jar>
[INFO] Copying kerb-common-1.1.0.jar to <https://builds.apache.org/job/PreCommit-ZOOKEEPER-github-pr-build-maven/ws/zookeeper-server/target/lib/kerb-common-1.1.0.jar>
[INFO] Copying kerb-crypto-1.1.0.jar to <https://builds.apache.org/job/PreCommit-ZOOKEEPER-github-pr-build-maven/ws/zookeeper-server/target/lib/kerb-crypto-1.1.0.jar>
[INFO] Copying commons-io-2.6.jar to <https://builds.apache.org/job/PreCommit-ZOOKEEPER-github-pr-build-maven/ws/zookeeper-server/target/lib/commons-io-2.6.jar>
[INFO] Copying kerb-util-1.1.0.jar to <https://builds.apache.org/job/PreCommit-ZOOKEEPER-github-pr-build-maven/ws/zookeeper-server/target/lib/kerb-util-1.1.0.jar>
[INFO] Copying token-provider-1.1.0.jar to <https://builds.apache.org/job/PreCommit-ZOOKEEPER-github-pr-build-maven/ws/zookeeper-server/target/lib/token-provider-1.1.0.jar>
[INFO] Copying nimbus-jose-jwt-4.41.2.jar to <https://builds.apache.org/job/PreCommit-ZOOKEEPER-github-pr-build-maven/ws/zookeeper-server/target/lib/nimbus-jose-jwt-4.41.2.jar>
[INFO] Copying jcip-annotations-1.0-1.jar to <https://builds.apache.org/job/PreCommit-ZOOKEEPER-github-pr-build-maven/ws/zookeeper-server/target/lib/jcip-annotations-1.0-1.jar>
[INFO] Copying json-smart-2.3.jar to <https://builds.apache.org/job/PreCommit-ZOOKEEPER-github-pr-build-maven/ws/zookeeper-server/target/lib/json-smart-2.3.jar>
[INFO] Copying accessors-smart-1.2.jar to <https://builds.apache.org/job/PreCommit-ZOOKEEPER-github-pr-build-maven/ws/zookeeper-server/target/lib/accessors-smart-1.2.jar>
[INFO] Copying asm-5.0.4.jar to <https://builds.apache.org/job/PreCommit-ZOOKEEPER-github-pr-build-maven/ws/zookeeper-server/target/lib/asm-5.0.4.jar>
[INFO] Copying kerb-admin-1.1.0.jar to <https://builds.apache.org/job/PreCommit-ZOOKEEPER-github-pr-build-maven/ws/zookeeper-server/target/lib/kerb-admin-1.1.0.jar>
[INFO] Copying kerb-server-1.1.0.jar to <https://builds.apache.org/job/PreCommit-ZOOKEEPER-github-pr-build-maven/ws/zookeeper-server/target/lib/kerb-server-1.1.0.jar>
[INFO] Copying kerb-identity-1.1.0.jar to <https://builds.apache.org/job/PreCommit-ZOOKEEPER-github-pr-build-maven/ws/zookeeper-server/target/lib/kerb-identity-1.1.0.jar>
[INFO] Copying kerby-xdr-1.1.0.jar to <https://builds.apache.org/job/PreCommit-ZOOKEEPER-github-pr-build-maven/ws/zookeeper-server/target/lib/kerby-xdr-1.1.0.jar>
[INFO] Copying kerby-config-1.1.0.jar to <https://builds.apache.org/job/PreCommit-ZOOKEEPER-github-pr-build-maven/ws/zookeeper-server/target/lib/kerby-config-1.1.0.jar>
[INFO] Copying mockito-core-2.27.0.jar to <https://builds.apache.org/job/PreCommit-ZOOKEEPER-github-pr-build-maven/ws/zookeeper-server/target/lib/mockito-core-2.27.0.jar>
[INFO] Copying byte-buddy-1.9.10.jar to <https://builds.apache.org/job/PreCommit-ZOOKEEPER-github-pr-build-maven/ws/zookeeper-server/target/lib/byte-buddy-1.9.10.jar>
[INFO] Copying byte-buddy-agent-1.9.10.jar to <https://builds.apache.org/job/PreCommit-ZOOKEEPER-github-pr-build-maven/ws/zookeeper-server/target/lib/byte-buddy-agent-1.9.10.jar>
[INFO] Copying objenesis-2.6.jar to <https://builds.apache.org/job/PreCommit-ZOOKEEPER-github-pr-build-maven/ws/zookeeper-server/target/lib/objenesis-2.6.jar>
[INFO] Copying junit-4.12.jar to <https://builds.apache.org/job/PreCommit-ZOOKEEPER-github-pr-build-maven/ws/zookeeper-server/target/lib/junit-4.12.jar>
[INFO] Copying hamcrest-core-1.3.jar to <https://builds.apache.org/job/PreCommit-ZOOKEEPER-github-pr-build-maven/ws/zookeeper-server/target/lib/hamcrest-core-1.3.jar>
[INFO] Copying snappy-java-1.1.7.jar to <https://builds.apache.org/job/PreCommit-ZOOKEEPER-github-pr-build-maven/ws/zookeeper-server/target/lib/snappy-java-1.1.7.jar>
[INFO] 
[INFO] --- checksum-maven-plugin:1.8:artifacts (default) @ zookeeper ---
[INFO] zookeeper-3.6.0-SNAPSHOT.jar - SHA-512 : 4c4fcf0c7c5f485bd012c57090250344698d5ba3dcef83c42cdda3b017277e3ee224fe40b077377380225bbf202ee68498b74735e1b658bfe7c7caed10f2df48
[INFO] zookeeper-3.6.0-SNAPSHOT-tests.jar - SHA-512 : 22470b5973251dec9cb59b999521b07e2b7fb1742a9a5260dad3a5c56dba64874cd98f75ec8e1974b0cfc4708919ef09853021bec2205f86aa5ec977a4ed2ae1
[INFO] zookeeper-3.6.0-SNAPSHOT-sources.jar - SHA-512 : 33358ce734ed06bd3ae686327e7040783aa45257d522d4449003b9f9e63106b19618211b5960aaf7074fa52f799ad3277e52a1dde3ee9f502967baf47af19af2
[INFO] zookeeper-3.6.0-SNAPSHOT-javadoc.jar - SHA-512 : aba3c4e343eccd8779ffd748bd4760932eba8f47c43f432f31ab6ba040fce30b129e8666fcb3793637d15606e82cdc7251f14435c0f30c275f8a1b3d0ea9b43d
[INFO] 
[INFO] >>> spotbugs-maven-plugin:3.1.9:check (default-cli) > :spotbugs @ zookeeper >>>
[INFO] 
[INFO] --- spotbugs-maven-plugin:3.1.9:spotbugs (spotbugs) @ zookeeper ---
[INFO] Fork Value is true
     [java] SLF4J: No SLF4J providers were found.
     [java] SLF4J: Defaulting to no-operation (NOP) logger implementation
     [java] SLF4J: See http://www.slf4j.org/codes.html#noProviders for further details.
[INFO] Done SpotBugs Analysis....
[INFO] 
[INFO] <<< spotbugs-maven-plugin:3.1.9:check (default-cli) < :spotbugs @ zookeeper <<<
[INFO] 
[INFO] 
[INFO] --- spotbugs-maven-plugin:3.1.9:check (default-cli) @ zookeeper ---
[INFO] BugInstance size is 0
[INFO] Error size is 0
[INFO] No errors/warnings found
[INFO] 
[INFO] --- maven-checkstyle-plugin:3.1.0:check (default-cli) @ zookeeper ---
[INFO] Starting audit...
[ERROR] <https://builds.apache.org/job/PreCommit-ZOOKEEPER-github-pr-build-maven/ws/zookeeper-server/src/main/java/org/apache/zookeeper/KeeperException.java>:954:39: '{' at column 39 should have line break after. [LeftCurly]
[ERROR] <https://builds.apache.org/job/PreCommit-ZOOKEEPER-github-pr-build-maven/ws/zookeeper-server/src/test/java/org/apache/zookeeper/server/quorum/EphemeralThrottleTest.java>:6: Extra separation in import group before 'java.io.File' [ImportOrder]
[ERROR] <https://builds.apache.org/job/PreCommit-ZOOKEEPER-github-pr-build-maven/ws/zookeeper-server/src/test/java/org/apache/zookeeper/server/quorum/EphemeralThrottleTest.java>:30:11: 'static' modifier out of order with the JLS suggestions. [ModifierOrder]
[ERROR] <https://builds.apache.org/job/PreCommit-ZOOKEEPER-github-pr-build-maven/ws/zookeeper-server/src/test/java/org/apache/zookeeper/server/quorum/EphemeralThrottleTest.java>:31:11: 'static' modifier out of order with the JLS suggestions. [ModifierOrder]
[ERROR] <https://builds.apache.org/job/PreCommit-ZOOKEEPER-github-pr-build-maven/ws/zookeeper-server/src/test/java/org/apache/zookeeper/server/quorum/EphemeralThrottleTest.java>:32:11: 'static' modifier out of order with the JLS suggestions. [ModifierOrder]
[ERROR] <https://builds.apache.org/job/PreCommit-ZOOKEEPER-github-pr-build-maven/ws/zookeeper-server/src/test/java/org/apache/zookeeper/server/quorum/EphemeralThrottleTest.java>:38:48: '+' is not followed by whitespace. [WhitespaceAround]
[ERROR] <https://builds.apache.org/job/PreCommit-ZOOKEEPER-github-pr-build-maven/ws/zookeeper-server/src/test/java/org/apache/zookeeper/server/quorum/EphemeralThrottleTest.java>:38:48: '+' is not preceded with whitespace. [WhitespaceAround]
[ERROR] <https://builds.apache.org/job/PreCommit-ZOOKEEPER-github-pr-build-maven/ws/zookeeper-server/src/test/java/org/apache/zookeeper/server/quorum/EphemeralThrottleTest.java>:47:48: '+' is not followed by whitespace. [WhitespaceAround]
[ERROR] <https://builds.apache.org/job/PreCommit-ZOOKEEPER-github-pr-build-maven/ws/zookeeper-server/src/test/java/org/apache/zookeeper/server/quorum/EphemeralThrottleTest.java>:47:48: '+' is not preceded with whitespace. [WhitespaceAround]
[ERROR] <https://builds.apache.org/job/PreCommit-ZOOKEEPER-github-pr-build-maven/ws/zookeeper-server/src/test/java/org/apache/zookeeper/server/quorum/EphemeralThrottleTest.java>:60:48: '/' is not followed by whitespace. [WhitespaceAround]
[ERROR] <https://builds.apache.org/job/PreCommit-ZOOKEEPER-github-pr-build-maven/ws/zookeeper-server/src/test/java/org/apache/zookeeper/server/quorum/EphemeralThrottleTest.java>:60:48: '/' is not preceded with whitespace. [WhitespaceAround]
[ERROR] <https://builds.apache.org/job/PreCommit-ZOOKEEPER-github-pr-build-maven/ws/zookeeper-server/src/test/java/org/apache/zookeeper/server/quorum/EphemeralThrottleTest.java>:66:49: '/' is not followed by whitespace. [WhitespaceAround]
[ERROR] <https://builds.apache.org/job/PreCommit-ZOOKEEPER-github-pr-build-maven/ws/zookeeper-server/src/test/java/org/apache/zookeeper/server/quorum/EphemeralThrottleTest.java>:66:49: '/' is not preceded with whitespace. [WhitespaceAround]
Audit done.
[INFO] There are 13 errors reported by Checkstyle 8.17 with checkstyle-strict.xml ruleset.
[ERROR] src/main/java/org/apache/zookeeper/KeeperException.java:[954,39] (blocks) LeftCurly: '{' at column 39 should have line break after.
[ERROR] src/test/java/org/apache/zookeeper/server/quorum/EphemeralThrottleTest.java:[6] (imports) ImportOrder: Extra separation in import group before 'java.io.File'
[ERROR] src/test/java/org/apache/zookeeper/server/quorum/EphemeralThrottleTest.java:[30,11] (modifier) ModifierOrder: 'static' modifier out of order with the JLS suggestions.
[ERROR] src/test/java/org/apache/zookeeper/server/quorum/EphemeralThrottleTest.java:[31,11] (modifier) ModifierOrder: 'static' modifier out of order with the JLS suggestions.
[ERROR] src/test/java/org/apache/zookeeper/server/quorum/EphemeralThrottleTest.java:[32,11] (modifier) ModifierOrder: 'static' modifier out of order with the JLS suggestions.
[ERROR] src/test/java/org/apache/zookeeper/server/quorum/EphemeralThrottleTest.java:[38,48] (whitespace) WhitespaceAround: '+' is not followed by whitespace.
[ERROR] src/test/java/org/apache/zookeeper/server/quorum/EphemeralThrottleTest.java:[38,48] (whitespace) WhitespaceAround: '+' is not preceded with whitespace.
[ERROR] src/test/java/org/apache/zookeeper/server/quorum/EphemeralThrottleTest.java:[47,48] (whitespace) WhitespaceAround: '+' is not followed by whitespace.
[ERROR] src/test/java/org/apache/zookeeper/server/quorum/EphemeralThrottleTest.java:[47,48] (whitespace) WhitespaceAround: '+' is not preceded with whitespace.
[ERROR] src/test/java/org/apache/zookeeper/server/quorum/EphemeralThrottleTest.java:[60,48] (whitespace) WhitespaceAround: '/' is not followed by whitespace.
[ERROR] src/test/java/org/apache/zookeeper/server/quorum/EphemeralThrottleTest.java:[60,48] (whitespace) WhitespaceAround: '/' is not preceded with whitespace.
[ERROR] src/test/java/org/apache/zookeeper/server/quorum/EphemeralThrottleTest.java:[66,49] (whitespace) WhitespaceAround: '/' is not followed by whitespace.
[ERROR] src/test/java/org/apache/zookeeper/server/quorum/EphemeralThrottleTest.java:[66,49] (whitespace) WhitespaceAround: '/' is not preceded with whitespace.
[INFO] ------------------------------------------------------------------------
[INFO] Reactor Summary for Apache ZooKeeper 3.6.0-SNAPSHOT:
[INFO] 
[INFO] Apache ZooKeeper ................................... SUCCESS [ 23.970 s]
[INFO] Apache ZooKeeper - Documentation ................... SUCCESS [  9.288 s]
[INFO] Apache ZooKeeper - Jute ............................ SUCCESS [01:38 min]
[INFO] Apache ZooKeeper - Server .......................... FAILURE [17:26 min]
[INFO] Apache ZooKeeper - Metrics Providers ............... SKIPPED
[INFO] Apache ZooKeeper - Prometheus.io Metrics Provider .. SKIPPED
[INFO] Apache ZooKeeper - Client .......................... SKIPPED
[INFO] Apache ZooKeeper - Client - C ...................... SKIPPED
[INFO] Apache ZooKeeper - Recipes ......................... SKIPPED
[INFO] Apache ZooKeeper - Recipes - Election .............. SKIPPED
[INFO] Apache ZooKeeper - Recipes - Lock .................. SKIPPED
[INFO] Apache ZooKeeper - Recipes - Queue ................. SKIPPED
[INFO] Apache ZooKeeper - Assembly ........................ SKIPPED
[INFO] Apache ZooKeeper - Contrib ......................... SKIPPED
[INFO] Apache ZooKeeper - Contrib - Loggraph .............. SKIPPED
[INFO] Apache ZooKeeper - Contrib - Rest .................. SKIPPED
[INFO] Apache ZooKeeper - Contrib - ZooInspector .......... SKIPPED
[INFO] ------------------------------------------------------------------------
[INFO] BUILD FAILURE
[INFO] ------------------------------------------------------------------------
[INFO] Total time:  20:15 min
[INFO] Finished at: 2019-11-24T22:58:57Z
[INFO] ------------------------------------------------------------------------
Waiting for Jenkins to finish collecting data
[ERROR] Failed to execute goal org.apache.maven.plugins:maven-checkstyle-plugin:3.1.0:check (default-cli) on project zookeeper: You have 13 Checkstyle violations. -> [Help 1]
[ERROR] 
[ERROR] To see the full stack trace of the errors, re-run Maven with the -e switch.
[ERROR] Re-run Maven using the -X switch to enable full debug logging.
[ERROR] 
[ERROR] For more information about the errors and possible solutions, please read the following articles:
[ERROR] [Help 1] http://cwiki.apache.org/confluence/display/MAVEN/MojoFailureException
[ERROR] 
[ERROR] After correcting the problems, you can resume the build with the command
[ERROR]   mvn <goals> -rf :zookeeper
[JENKINS] Archiving <https://builds.apache.org/job/PreCommit-ZOOKEEPER-github-pr-build-maven/ws/zookeeper-server/pom.xml> to org.apache.zookeeper/zookeeper/3.6.0-SNAPSHOT/zookeeper-3.6.0-SNAPSHOT.pom
[JENKINS] Archiving <https://builds.apache.org/job/PreCommit-ZOOKEEPER-github-pr-build-maven/ws/zookeeper-server/target/zookeeper-3.6.0-SNAPSHOT.jar> to org.apache.zookeeper/zookeeper/3.6.0-SNAPSHOT/zookeeper-3.6.0-SNAPSHOT.jar
[JENKINS] Archiving <https://builds.apache.org/job/PreCommit-ZOOKEEPER-github-pr-build-maven/ws/zookeeper-server/target/zookeeper-3.6.0-SNAPSHOT-tests.jar> to org.apache.zookeeper/zookeeper/3.6.0-SNAPSHOT/zookeeper-3.6.0-SNAPSHOT-tests.jar
[JENKINS] Archiving <https://builds.apache.org/job/PreCommit-ZOOKEEPER-github-pr-build-maven/ws/zookeeper-server/target/zookeeper-3.6.0-SNAPSHOT-sources.jar> to org.apache.zookeeper/zookeeper/3.6.0-SNAPSHOT/zookeeper-3.6.0-SNAPSHOT-sources.jar
[JENKINS] Archiving <https://builds.apache.org/job/PreCommit-ZOOKEEPER-github-pr-build-maven/ws/zookeeper-server/target/zookeeper-3.6.0-SNAPSHOT-javadoc.jar> to org.apache.zookeeper/zookeeper/3.6.0-SNAPSHOT/zookeeper-3.6.0-SNAPSHOT-javadoc.jar
[JENKINS] Archiving <https://builds.apache.org/job/PreCommit-ZOOKEEPER-github-pr-build-maven/ws/zookeeper-contrib/zookeeper-contrib-loggraph/pom.xml> to org.apache.zookeeper/zookeeper-contrib-loggraph/3.6.0-SNAPSHOT/zookeeper-contrib-loggraph-3.6.0-SNAPSHOT.pom
[JENKINS] Archiving <https://builds.apache.org/job/PreCommit-ZOOKEEPER-github-pr-build-maven/ws/zookeeper-metrics-providers/pom.xml> to org.apache.zookeeper/zookeeper-metrics-providers/3.6.0-SNAPSHOT/zookeeper-metrics-providers-3.6.0-SNAPSHOT.pom
[JENKINS] Archiving <https://builds.apache.org/job/PreCommit-ZOOKEEPER-github-pr-build-maven/ws/zookeeper-metrics-providers/zookeeper-prometheus-metrics/pom.xml> to org.apache.zookeeper/zookeeper-prometheus-metrics/3.6.0-SNAPSHOT/zookeeper-prometheus-metrics-3.6.0-SNAPSHOT.pom
[JENKINS] Archiving <https://builds.apache.org/job/PreCommit-ZOOKEEPER-github-pr-build-maven/ws/zookeeper-recipes/zookeeper-recipes-election/pom.xml> to org.apache.zookeeper/zookeeper-recipes-election/3.6.0-SNAPSHOT/zookeeper-recipes-election-3.6.0-SNAPSHOT.pom
[JENKINS] Archiving <https://builds.apache.org/job/PreCommit-ZOOKEEPER-github-pr-build-maven/ws/pom.xml> to org.apache.zookeeper/parent/3.6.0-SNAPSHOT/parent-3.6.0-SNAPSHOT.pom
[JENKINS] Archiving <https://builds.apache.org/job/PreCommit-ZOOKEEPER-github-pr-build-maven/ws/zookeeper-recipes/zookeeper-recipes-lock/pom.xml> to org.apache.zookeeper/zookeeper-recipes-lock/3.6.0-SNAPSHOT/zookeeper-recipes-lock-3.6.0-SNAPSHOT.pom
[JENKINS] Archiving <https://builds.apache.org/job/PreCommit-ZOOKEEPER-github-pr-build-maven/ws/zookeeper-contrib/pom.xml> to org.apache.zookeeper/zookeeper-contrib/3.6.0-SNAPSHOT/zookeeper-contrib-3.6.0-SNAPSHOT.pom
[JENKINS] Archiving <https://builds.apache.org/job/PreCommit-ZOOKEEPER-github-pr-build-maven/ws/zookeeper-client/pom.xml> to org.apache.zookeeper/zookeeper-client/3.6.0-SNAPSHOT/zookeeper-client-3.6.0-SNAPSHOT.pom
[JENKINS] Archiving <https://builds.apache.org/job/PreCommit-ZOOKEEPER-github-pr-build-maven/ws/zookeeper-jute/pom.xml> to org.apache.zookeeper/zookeeper-jute/3.6.0-SNAPSHOT/zookeeper-jute-3.6.0-SNAPSHOT.pom
[JENKINS] Archiving <https://builds.apache.org/job/PreCommit-ZOOKEEPER-github-pr-build-maven/ws/zookeeper-jute/target/zookeeper-jute-3.6.0-SNAPSHOT.jar> to org.apache.zookeeper/zookeeper-jute/3.6.0-SNAPSHOT/zookeeper-jute-3.6.0-SNAPSHOT.jar
[JENKINS] Archiving <https://builds.apache.org/job/PreCommit-ZOOKEEPER-github-pr-build-maven/ws/zookeeper-jute/target/zookeeper-jute-3.6.0-SNAPSHOT-tests.jar> to org.apache.zookeeper/zookeeper-jute/3.6.0-SNAPSHOT/zookeeper-jute-3.6.0-SNAPSHOT-tests.jar
[JENKINS] Archiving <https://builds.apache.org/job/PreCommit-ZOOKEEPER-github-pr-build-maven/ws/zookeeper-jute/target/zookeeper-jute-3.6.0-SNAPSHOT-sources.jar> to org.apache.zookeeper/zookeeper-jute/3.6.0-SNAPSHOT/zookeeper-jute-3.6.0-SNAPSHOT-sources.jar
[JENKINS] Archiving <https://builds.apache.org/job/PreCommit-ZOOKEEPER-github-pr-build-maven/ws/zookeeper-jute/target/zookeeper-jute-3.6.0-SNAPSHOT-javadoc.jar> to org.apache.zookeeper/zookeeper-jute/3.6.0-SNAPSHOT/zookeeper-jute-3.6.0-SNAPSHOT-javadoc.jar
[JENKINS] Archiving <https://builds.apache.org/job/PreCommit-ZOOKEEPER-github-pr-build-maven/ws/zookeeper-recipes/zookeeper-recipes-queue/pom.xml> to org.apache.zookeeper/zookeeper-recipes-queue/3.6.0-SNAPSHOT/zookeeper-recipes-queue-3.6.0-SNAPSHOT.pom
[JENKINS] Archiving <https://builds.apache.org/job/PreCommit-ZOOKEEPER-github-pr-build-maven/ws/zookeeper-docs/pom.xml> to org.apache.zookeeper/zookeeper-docs/3.6.0-SNAPSHOT/zookeeper-docs-3.6.0-SNAPSHOT.pom
[JENKINS] Archiving <https://builds.apache.org/job/PreCommit-ZOOKEEPER-github-pr-build-maven/ws/zookeeper-docs/target/zookeeper-docs-3.6.0-SNAPSHOT.jar> to org.apache.zookeeper/zookeeper-docs/3.6.0-SNAPSHOT/zookeeper-docs-3.6.0-SNAPSHOT.jar
[JENKINS] Archiving <https://builds.apache.org/job/PreCommit-ZOOKEEPER-github-pr-build-maven/ws/zookeeper-docs/target/zookeeper-docs-3.6.0-SNAPSHOT-tests.jar> to org.apache.zookeeper/zookeeper-docs/3.6.0-SNAPSHOT/zookeeper-docs-3.6.0-SNAPSHOT-tests.jar
[JENKINS] Archiving <https://builds.apache.org/job/PreCommit-ZOOKEEPER-github-pr-build-maven/ws/zookeeper-docs/target/zookeeper-docs-3.6.0-SNAPSHOT-sources.jar> to org.apache.zookeeper/zookeeper-docs/3.6.0-SNAPSHOT/zookeeper-docs-3.6.0-SNAPSHOT-sources.jar
[JENKINS] Archiving <https://builds.apache.org/job/PreCommit-ZOOKEEPER-github-pr-build-maven/ws/zookeeper-recipes/pom.xml> to org.apache.zookeeper/zookeeper-recipes/3.6.0-SNAPSHOT/zookeeper-recipes-3.6.0-SNAPSHOT.pom
[JENKINS] Archiving <https://builds.apache.org/job/PreCommit-ZOOKEEPER-github-pr-build-maven/ws/zookeeper-client/zookeeper-client-c/pom.xml> to org.apache.zookeeper/zookeeper-client-c/3.6.0-SNAPSHOT/zookeeper-client-c-3.6.0-SNAPSHOT.pom
[JENKINS] Archiving <https://builds.apache.org/job/PreCommit-ZOOKEEPER-github-pr-build-maven/ws/zookeeper-contrib/zookeeper-contrib-rest/pom.xml> to org.apache.zookeeper/zookeeper-contrib-rest/3.6.0-SNAPSHOT/zookeeper-contrib-rest-3.6.0-SNAPSHOT.pom
[JENKINS] Archiving <https://builds.apache.org/job/PreCommit-ZOOKEEPER-github-pr-build-maven/ws/zookeeper-assembly/pom.xml> to org.apache.zookeeper/zookeeper-assembly/3.6.0-SNAPSHOT/zookeeper-assembly-3.6.0-SNAPSHOT.pom
[JENKINS] Archiving <https://builds.apache.org/job/PreCommit-ZOOKEEPER-github-pr-build-maven/ws/zookeeper-contrib/zookeeper-contrib-zooinspector/pom.xml> to org.apache.zookeeper/zookeeper-contrib-zooinspector/3.6.0-SNAPSHOT/zookeeper-contrib-zooinspector-3.6.0-SNAPSHOT.pom
channel stopped
[SpotBugs] Skipping execution of recorder since overall result is 'FAILURE'
Setting status of d8b4fc446cc9b8c08e52f48975ada95e9edeea41 to FAILURE with url https://builds.apache.org/job/PreCommit-ZOOKEEPER-github-pr-build-maven/1650/ and message: 'FAILURE
 '
Using context: JenkinsMaven

Refer to this link for build results (access rights to CI server needed): 
https://builds.apache.org/job/PreCommit-ZOOKEEPER-github-pr-build-maven/1650/<h2>Build result: FAILURE</span></h2>[...truncated 781.42 KB...][JENKINS] Archiving <https://builds.apache.org/job/PreCommit-ZOOKEEPER-github-pr-build-maven/ws/pom.xml> to org.apache.zookeeper/parent/3.6.0-SNAPSHOT/parent-3.6.0-SNAPSHOT.pom[JENKINS] Archiving <https://builds.apache.org/job/PreCommit-ZOOKEEPER-github-pr-build-maven/ws/zookeeper-recipes/zookeeper-recipes-lock/pom.xml> to org.apache.zookeeper/zookeeper-recipes-lock/3.6.0-SNAPSHOT/zookeeper-recipes-lock-3.6.0-SNAPSHOT.pom[JENKINS] Archiving <https://builds.apache.org/job/PreCommit-ZOOKEEPER-github-pr-build-maven/ws/zookeeper-contrib/pom.xml> to org.apache.zookeeper/zookeeper-contrib/3.6.0-SNAPSHOT/zookeeper-contrib-3.6.0-SNAPSHOT.pom[JENKINS] Archiving <https://builds.apache.org/job/PreCommit-ZOOKEEPER-github-pr-build-maven/ws/zookeeper-client/pom.xml> to org.apache.zookeeper/zookeeper-client/3.6.0-SNAPSHOT/zookeeper-client-3.6.0-SNAPSHOT.pom[JENKINS] Archiving <https://builds.apache.org/job/PreCommit-ZOOKEEPER-github-pr-build-maven/ws/zookeeper-jute/pom.xml> to org.apache.zookeeper/zookeeper-jute/3.6.0-SNAPSHOT/zookeeper-jute-3.6.0-SNAPSHOT.pom[JENKINS] Archiving <https://builds.apache.org/job/PreCommit-ZOOKEEPER-github-pr-build-maven/ws/zookeeper-jute/target/zookeeper-jute-3.6.0-SNAPSHOT.jar> to org.apache.zookeeper/zookeeper-jute/3.6.0-SNAPSHOT/zookeeper-jute-3.6.0-SNAPSHOT.jar[JENKINS] Archiving <https://builds.apache.org/job/PreCommit-ZOOKEEPER-github-pr-build-maven/ws/zookeeper-jute/target/zookeeper-jute-3.6.0-SNAPSHOT-tests.jar> to org.apache.zookeeper/zookeeper-jute/3.6.0-SNAPSHOT/zookeeper-jute-3.6.0-SNAPSHOT-tests.jar[JENKINS] Archiving <https://builds.apache.org/job/PreCommit-ZOOKEEPER-github-pr-build-maven/ws/zookeeper-jute/target/zookeeper-jute-3.6.0-SNAPSHOT-sources.jar> to org.apache.zookeeper/zookeeper-jute/3.6.0-SNAPSHOT/zookeeper-jute-3.6.0-SNAPSHOT-sources.jar[JENKINS] Archiving <https://builds.apache.org/job/PreCommit-ZOOKEEPER-github-pr-build-maven/ws/zookeeper-jute/target/zookeeper-jute-3.6.0-SNAPSHOT-javadoc.jar> to org.apache.zookeeper/zookeeper-jute/3.6.0-SNAPSHOT/zookeeper-jute-3.6.0-SNAPSHOT-javadoc.jar[JENKINS] Archiving <https://builds.apache.org/job/PreCommit-ZOOKEEPER-github-pr-build-maven/ws/zookeeper-recipes/zookeeper-recipes-queue/pom.xml> to org.apache.zookeeper/zookeeper-recipes-queue/3.6.0-SNAPSHOT/zookeeper-recipes-queue-3.6.0-SNAPSHOT.pom[JENKINS] Archiving <https://builds.apache.org/job/PreCommit-ZOOKEEPER-github-pr-build-maven/ws/zookeeper-docs/pom.xml> to org.apache.zookeeper/zookeeper-docs/3.6.0-SNAPSHOT/zookeeper-docs-3.6.0-SNAPSHOT.pom[JENKINS] Archiving <https://builds.apache.org/job/PreCommit-ZOOKEEPER-github-pr-build-maven/ws/zookeeper-docs/target/zookeeper-docs-3.6.0-SNAPSHOT.jar> to org.apache.zookeeper/zookeeper-docs/3.6.0-SNAPSHOT/zookeeper-docs-3.6.0-SNAPSHOT.jar[JENKINS] Archiving <https://builds.apache.org/job/PreCommit-ZOOKEEPER-github-pr-build-maven/ws/zookeeper-docs/target/zookeeper-docs-3.6.0-SNAPSHOT-tests.jar> to org.apache.zookeeper/zookeeper-docs/3.6.0-SNAPSHOT/zookeeper-docs-3.6.0-SNAPSHOT-tests.jar[JENKINS] Archiving <https://builds.apache.org/job/PreCommit-ZOOKEEPER-github-pr-build-maven/ws/zookeeper-docs/target/zookeeper-docs-3.6.0-SNAPSHOT-sources.jar> to org.apache.zookeeper/zookeeper-docs/3.6.0-SNAPSHOT/zookeeper-docs-3.6.0-SNAPSHOT-sources.jar[JENKINS] Archiving <https://builds.apache.org/job/PreCommit-ZOOKEEPER-github-pr-build-maven/ws/zookeeper-recipes/pom.xml> to org.apache.zookeeper/zookeeper-recipes/3.6.0-SNAPSHOT/zookeeper-recipes-3.6.0-SNAPSHOT.pom[JENKINS] Archiving <https://builds.apache.org/job/PreCommit-ZOOKEEPER-github-pr-build-maven/ws/zookeeper-client/zookeeper-client-c/pom.xml> to org.apache.zookeeper/zookeeper-client-c/3.6.0-SNAPSHOT/zookeeper-client-c-3.6.0-SNAPSHOT.pom[JENKINS] Archiving <https://builds.apache.org/job/PreCommit-ZOOKEEPER-github-pr-build-maven/ws/zookeeper-contrib/zookeeper-contrib-rest/pom.xml> to org.apache.zookeeper/zookeeper-contrib-rest/3.6.0-SNAPSHOT/zookeeper-contrib-rest-3.6.0-SNAPSHOT.pom[JENKINS] Archiving <https://builds.apache.org/job/PreCommit-ZOOKEEPER-github-pr-build-maven/ws/zookeeper-assembly/pom.xml> to org.apache.zookeeper/zookeeper-assembly/3.6.0-SNAPSHOT/zookeeper-assembly-3.6.0-SNAPSHOT.pom[JENKINS] Archiving <https://builds.apache.org/job/PreCommit-ZOOKEEPER-github-pr-build-maven/ws/zookeeper-contrib/zookeeper-contrib-zooinspector/pom.xml> to org.apache.zookeeper/zookeeper-contrib-zooinspector/3.6.0-SNAPSHOT/zookeeper-contrib-zooinspector-3.6.0-SNAPSHOT.pomchannel stopped[SpotBugs] Skipping execution of recorder since overall result is 'FAILURE'Setting status of d8b4fc446cc9b8c08e52f48975ada95e9edeea41 to FAILURE with url https://builds.apache.org/job/PreCommit-ZOOKEEPER-github-pr-build-maven/1650/ and message: 'FAILURE 'Using context: JenkinsMaven


Mime
View raw message