zookeeper-dev mailing list archives

Site index · List index
Message view « Date » · « Thread »
Top « Date » · « Thread »
From Apache Jenkins Server <jenk...@builds.apache.org>
Subject Build failed in Jenkins: PreCommit-ZOOKEEPER-github-pr-build-maven #1373
Date Tue, 01 Oct 2019 21:52:02 GMT
See <https://builds.apache.org/job/PreCommit-ZOOKEEPER-github-pr-build-maven/1373/display/redirect>

Changes:


------------------------------------------
[...truncated 938.14 KB...]
     [exec] Using config: <https://builds.apache.org/job/PreCommit-ZOOKEEPER-github-pr-build-maven/ws/zookeeper-client/zookeeper-client-c/../../build/test/test-cppunit/conf/1.conf>
     [exec] Stopping zookeeper ... STOPPED
     [exec] ZooKeeper JMX enabled by default
     [exec] Using config: <https://builds.apache.org/job/PreCommit-ZOOKEEPER-github-pr-build-maven/ws/zookeeper-client/zookeeper-client-c/../../build/test/test-cppunit/conf/2.conf>
     [exec] Stopping zookeeper ... STOPPED
     [exec] Stopping zookeeper ... STOPPED
     [exec]  : elapsed 18605 : OK
     [exec] Zookeeper_clientretry::testRetry ZooKeeper server started ZooKeeper server started
: elapsed 8444 : OK
     [exec] Zookeeper_operations::testAsyncWatcher1 : elapsed 5 : OK
     [exec] Zookeeper_operations::testAsyncGetOperation : elapsed 5 : OK
     [exec] Zookeeper_operations::testOperationsAndDisconnectConcurrently1 : elapsed 400 :
OK
     [exec] Zookeeper_operations::testOperationsAndDisconnectConcurrently2 : elapsed 0 : OK
     [exec] Zookeeper_operations::testConcurrentOperations1 : elapsed 11567 : OK
     [exec] Zookeeper_multi::testCreate : elapsed 1032 : OK
     [exec] Zookeeper_multi::testCreateDelete : elapsed 1010 : OK
     [exec] Zookeeper_multi::testInvalidVersion : elapsed 1007 : OK
     [exec] Zookeeper_multi::testNestedCreate : elapsed 1016 : OK
     [exec] Zookeeper_multi::testSetData : elapsed 6022 : OK
     [exec] Zookeeper_multi::testUpdateConflict : elapsed 1011 : OK
     [exec] Zookeeper_multi::testDeleteUpdateConflict : elapsed 1006 : OK
     [exec] Zookeeper_multi::testAsyncMulti : elapsed 2001 : OK
     [exec] Zookeeper_multi::testMultiFail : elapsed 1004 : OK
     [exec] Zookeeper_multi::testCheck : elapsed 1015 : OK
     [exec] Zookeeper_multi::testWatch : elapsed 2011 : OK
     [exec] Zookeeper_multi::testSequentialNodeCreateInAsyncMulti : elapsed 2001 : OK
     [exec] Zookeeper_multi::testBigAsyncMulti : elapsed 3004 : OK
     [exec] Zookeeper_watchers::testDefaultSessionWatcher1 : elapsed 53 : OK
     [exec] Zookeeper_watchers::testDefaultSessionWatcher2 : elapsed 4 : OK
     [exec] Zookeeper_watchers::testObjectSessionWatcher1 : elapsed 55 : OK
     [exec] Zookeeper_watchers::testObjectSessionWatcher2 : elapsed 57 : OK
     [exec] Zookeeper_watchers::testNodeWatcher1 : elapsed 57 : OK
     [exec] Zookeeper_watchers::testChildWatcher1 : elapsed 53 : OK
     [exec] Zookeeper_watchers::testChildWatcher2 : elapsed 53 : OK
     [exec] Zookeeper_simpleSystem::testLogCallbackSetLog Message Received: [2019-10-01 21:47:47,940:21083(0x7ff47f68f740):ZOO_INFO@testLogCallbackSet@1020:
testLogCallbackSet #0]
     [exec] Log Message Received: [2019-10-01 21:47:47,940:21083(0x7ff47f68f740):ZOO_INFO@testLogCallbackSet@1020:
testLogCallbackSet #1]
     [exec] Log Message Received: [2019-10-01 21:47:47,940:21083(0x7ff47f68f740):ZOO_INFO@testLogCallbackSet@1020:
testLogCallbackSet #2]
     [exec] Log Message Received: [2019-10-01 21:47:47,941:21083(0x7ff47f68f740):ZOO_INFO@testLogCallbackSet@1020:
testLogCallbackSet #3]
     [exec] Log Message Received: [2019-10-01 21:47:47,941:21083(0x7ff47f68f740):ZOO_INFO@testLogCallbackSet@1020:
testLogCallbackSet #4]
     [exec] Log Message Received: [2019-10-01 21:47:47,941:21083(0x7ff47f68f740):ZOO_INFO@testLogCallbackSet@1020:
testLogCallbackSet #5]
     [exec] Log Message Received: [2019-10-01 21:47:47,941:21083(0x7ff47f68f740):ZOO_INFO@testLogCallbackSet@1020:
testLogCallbackSet #6]
     [exec] Log Message Received: [2019-10-01 21:47:47,941:21083(0x7ff47f68f740):ZOO_INFO@testLogCallbackSet@1020:
testLogCallbackSet #7]
     [exec] Log Message Received: [2019-10-01 21:47:47,941:21083(0x7ff47f68f740):ZOO_INFO@testLogCallbackSet@1020:
testLogCallbackSet #8]
     [exec] Log Message Received: [2019-10-01 21:47:47,941:21083(0x7ff47f68f740):ZOO_INFO@testLogCallbackSet@1020:
testLogCallbackSet #9]
     [exec] Log Message Received: [2019-10-01 21:47:47,941:21083(0x7ff47f68f740):ZOO_INFO@zookeeper_close@3264:
Closing zookeeper sessionId=0x100bf74399f000e to 127.0.0.1:22181
     [exec] ]
     [exec]  : elapsed 1001 : OK
     [exec] Zookeeper_simpleSystem::testLogCallbackInitLog Message Received: [2019-10-01 21:47:47,941:21083(0x7ff47f68f740):ZOO_INFO@log_env@1101:
Client environment:zookeeper.version=zookeeper C client 3.6.0]
     [exec] Log Message Received: [2019-10-01 21:47:47,941:21083(0x7ff47f68f740):ZOO_INFO@log_env@1105:
Client environment:host.name=asf916.gq1.ygridcore.net]
     [exec] Log Message Received: [2019-10-01 21:47:47,941:21083(0x7ff47f68f740):ZOO_INFO@log_env@1112:
Client environment:os.name=Linux]
     [exec] Log Message Received: [2019-10-01 21:47:47,941:21083(0x7ff47f68f740):ZOO_INFO@log_env@1113:
Client environment:os.arch=4.15.0-58-generic]
     [exec] Log Message Received: [2019-10-01 21:47:47,941:21083(0x7ff47f68f740):ZOO_INFO@log_env@1114:
Client environment:os.version=#64-Ubuntu SMP Tue Aug 6 11:12:41 UTC 2019]
     [exec] Log Message Received: [2019-10-01 21:47:47,941:21083(0x7ff47f68f740):ZOO_INFO@log_env@1122:
Client environment:user.name=jenkins]
     [exec] Log Message Received: [2019-10-01 21:47:47,941:21083(0x7ff47f68f740):ZOO_INFO@log_env@1130:
Client environment:user.home=/home/jenkins]
     [exec] Log Message Received: [2019-10-01 21:47:47,941:21083(0x7ff47f68f740):ZOO_INFO@log_env@1142:
Client environment:user.dir=<https://builds.apache.org/job/PreCommit-ZOOKEEPER-github-pr-build-maven/ws/zookeeper-client/zookeeper-client-c/target/c]>
     [exec] Log Message Received: [2019-10-01 21:47:47,941:21083(0x7ff47f68f740):ZOO_INFO@zookeeper_init_internal@1188:
Initiating client connection, host=127.0.0.1:22181 sessionTimeout=10000 watcher=0x5649a333ac20
sessionId=0 sessionPasswd=<null> context=0x7ffd78d7e110 flags=0]
     [exec] Log Message Received: [2019-10-01 21:47:47,942:21083(0x7ff47d0ec700):ZOO_INFO@check_events@2475:
initiated connection to server 127.0.0.1:22181]
     [exec] Log Message Received: [2019-10-01 21:47:47,945:21083(0x7ff47d0ec700):ZOO_INFO@check_events@2527:
session establishment complete on server 127.0.0.1:22181, sessionId=0x100bf74399f000f, negotiated
timeout=10000 ]
     [exec] Log Message Received: [2019-10-01 21:47:48,942:21083(0x7ff47f68f740):ZOO_INFO@testLogCallbackInit@1042:
testLogCallbackInit #0]
     [exec] Log Message Received: [2019-10-01 21:47:48,942:21083(0x7ff47f68f740):ZOO_INFO@testLogCallbackInit@1042:
testLogCallbackInit #1]
     [exec] Log Message Received: [2019-10-01 21:47:48,942:21083(0x7ff47f68f740):ZOO_INFO@testLogCallbackInit@1042:
testLogCallbackInit #2]
     [exec] Log Message Received: [2019-10-01 21:47:48,942:21083(0x7ff47f68f740):ZOO_INFO@testLogCallbackInit@1042:
testLogCallbackInit #3]
     [exec] Log Message Received: [2019-10-01 21:47:48,942:21083(0x7ff47f68f740):ZOO_INFO@testLogCallbackInit@1042:
testLogCallbackInit #4]
     [exec] Log Message Received: [2019-10-01 21:47:48,942:21083(0x7ff47f68f740):ZOO_INFO@testLogCallbackInit@1042:
testLogCallbackInit #5]
     [exec] Log Message Received: [2019-10-01 21:47:48,942:21083(0x7ff47f68f740):ZOO_INFO@testLogCallbackInit@1042:
testLogCallbackInit #6]
     [exec] Log Message Received: [2019-10-01 21:47:48,942:21083(0x7ff47f68f740):ZOO_INFO@testLogCallbackInit@1042:
testLogCallbackInit #7]
     [exec] Log Message Received: [2019-10-01 21:47:48,942:21083(0x7ff47f68f740):ZOO_INFO@testLogCallbackInit@1042:
testLogCallbackInit #8]
     [exec] Log Message Received: [2019-10-01 21:47:48,942:21083(0x7ff47f68f740):ZOO_INFO@testLogCallbackInit@1042:
testLogCallbackInit #9]
     [exec] Log Message Received: [2019-10-01 21:47:48,942:21083(0x7ff47f68f740):ZOO_INFO@zookeeper_close@3264:
Closing zookeeper sessionId=0x100bf74399f000f to 127.0.0.1:22181
     [exec] ]
     [exec]  : elapsed 1001 : OK
     [exec] Zookeeper_simpleSystem::testLogCallbackClearLog Message Received: [2019-10-01
21:47:48,942:21083(0x7ff47f68f740):ZOO_INFO@log_env@1101: Client environment:zookeeper.version=zookeeper
C client 3.6.0]
     [exec] Log Message Received: [2019-10-01 21:47:48,942:21083(0x7ff47f68f740):ZOO_INFO@log_env@1105:
Client environment:host.name=asf916.gq1.ygridcore.net]
     [exec] Log Message Received: [2019-10-01 21:47:48,942:21083(0x7ff47f68f740):ZOO_INFO@log_env@1112:
Client environment:os.name=Linux]
     [exec] Log Message Received: [2019-10-01 21:47:48,942:21083(0x7ff47f68f740):ZOO_INFO@log_env@1113:
Client environment:os.arch=4.15.0-58-generic]
     [exec] Log Message Received: [2019-10-01 21:47:48,942:21083(0x7ff47f68f740):ZOO_INFO@log_env@1114:
Client environment:os.version=#64-Ubuntu SMP Tue Aug 6 11:12:41 UTC 2019]
     [exec] Log Message Received: [2019-10-01 21:47:48,942:21083(0x7ff47f68f740):ZOO_INFO@log_env@1122:
Client environment:user.name=jenkins]
     [exec] Log Message Received: [2019-10-01 21:47:48,942:21083(0x7ff47f68f740):ZOO_INFO@log_env@1130:
Client environment:user.home=/home/jenkins]
     [exec] Log Message Received: [2019-10-01 21:47:48,942:21083(0x7ff47f68f740):ZOO_INFO@log_env@1142:
Client environment:user.dir=<https://builds.apache.org/job/PreCommit-ZOOKEEPER-github-pr-build-maven/ws/zookeeper-client/zookeeper-client-c/target/c]>
     [exec] Log Message Received: [2019-10-01 21:47:48,942:21083(0x7ff47f68f740):ZOO_INFO@zookeeper_init_internal@1188:
Initiating client connection, host=127.0.0.1:22181 sessionTimeout=10000 watcher=0x5649a333ac20
sessionId=0 sessionPasswd=<null> context=0x7ffd78d7e110 flags=0]
     [exec] Log Message Received: [2019-10-01 21:47:48,943:21083(0x7ff47c8eb700):ZOO_INFO@check_events@2475:
initiated connection to server 127.0.0.1:22181]
     [exec] Log Message Received: [2019-10-01 21:47:48,947:21083(0x7ff47c8eb700):ZOO_INFO@check_events@2527:
session establishment complete on server 127.0.0.1:22181, sessionId=0x100bf74399f0010, negotiated
timeout=10000 ]
     [exec]  : elapsed 1001 : OK
     [exec] Zookeeper_simpleSystem::testAsyncWatcherAutoReset ZooKeeper server started : elapsed
16751 : OK
     [exec] Zookeeper_simpleSystem::testDeserializeString : elapsed 0 : OK
     [exec] Zookeeper_simpleSystem::testFirstServerDown : elapsed 1001 : OK
     [exec] Zookeeper_simpleSystem::testNonexistentHost : elapsed 1254 : OK
     [exec] Zookeeper_simpleSystem::testNullData : elapsed 1029 : OK
     [exec] Zookeeper_simpleSystem::testIPV6 : elapsed 1005 : OK
     [exec] Zookeeper_simpleSystem::testCreate : elapsed 1009 : OK
     [exec] Zookeeper_simpleSystem::testCreateContainer : elapsed 1006 : OK
     [exec] Zookeeper_simpleSystem::testCreateTtl : elapsed 2010 : OK
     [exec] Zookeeper_simpleSystem::testPath : elapsed 1015 : OK
     [exec] Zookeeper_simpleSystem::testPathValidation : elapsed 1042 : OK
     [exec] Zookeeper_simpleSystem::testPing : elapsed 17213 : OK
     [exec] Zookeeper_simpleSystem::testAcl : elapsed 1013 : OK
     [exec] Zookeeper_simpleSystem::testChroot : elapsed 4036 : OK
     [exec] Zookeeper_simpleSystem::testAuth ZooKeeper server started ZooKeeper server started
: elapsed 30535 : OK
     [exec] Zookeeper_simpleSystem::testHangingClient : elapsed 1038 : OK
     [exec] Zookeeper_simpleSystem::testWatcherAutoResetWithGlobal ZooKeeper server started
ZooKeeper server started ZooKeeper server started : elapsed 22372 : OK
     [exec] Zookeeper_simpleSystem::testWatcherAutoResetWithLocal ZooKeeper server started
ZooKeeper server started ZooKeeper server started : elapsed 22342 : OK
     [exec] Zookeeper_simpleSystem::testGetChildren2 : elapsed 1035 : OK
     [exec] Zookeeper_simpleSystem::testLastZxid : elapsed 4518 : OK
     [exec] Zookeeper_simpleSystem::testRemoveWatchers ZooKeeper server started : elapsed
4959 : OK
     [exec] Zookeeper_readOnly::testReadOnly : elapsed 4259 : OK
     [exec] Zookeeper_logClientEnv::testLogClientEnv : elapsed 1 : OK
     [exec] Usage: java [-options] class [args...]
     [exec]            (to execute a class)
     [exec]    or  java [-options] -jar jarfile [args...]
     [exec]            (to execute a jar file)
     [exec] where options include:
     [exec]     -d32	  use a 32-bit data model if available
     [exec]     -d64	  use a 64-bit data model if available
     [exec]     -server	  to select the "server" VM
     [exec]                   The default VM is server,
     [exec]                   because you are running on a server-class machine.
     [exec] 
     [exec] 
     [exec]     -cp <class search path of directories and zip/jar files>
     [exec]     -classpath <class search path of directories and zip/jar files>
     [exec]                   A : separated list of directories, JAR archives,
     [exec]                   and ZIP archives to search for class files.
     [exec]     -D<name>=<value>
     [exec]                   set a system property
     [exec]     -verbose:[class|gc|jni]
     [exec]                   enable verbose output
     [exec]     -version      print product version and exit
     [exec]     -version:<value>
     [exec]                   Warning: this feature is deprecated and will be removed
     [exec]                   in a future release.
     [exec]                   require the specified version to run
     [exec]     -showversion  print product version and continue
     [exec]     -jre-restrict-search | -no-jre-restrict-search
     [exec]                   Warning: this feature is deprecated and will be removed
     [exec]                   in a future release.
     [exec]                   include/exclude user private JREs in the version search
     [exec]     -? -help      print this help message
     [exec]     -X            print help on non-standard options
     [exec]     -ea[:<packagename>...|:<classname>]
     [exec]     -enableassertions[:<packagename>...|:<classname>]
     [exec]                   enable assertions with specified granularity
     [exec]     -da[:<packagename>...|:<classname>]
     [exec]     -disableassertions[:<packagename>...|:<classname>]
     [exec]                   disable assertions with specified granularity
     [exec]     -esa | -enablesystemassertions
     [exec]                   enable system assertions
     [exec]     -dsa | -disablesystemassertions
     [exec]                   disable system assertions
     [exec]     -agentlib:<libname>[=<options>]
     [exec]                   load native agent library <libname>, e.g. -agentlib:hprof
     [exec]                   see also, -agentlib:jdwp=help and -agentlib:hprof=help
     [exec]     -agentpath:<pathname>[=<options>]
     [exec]                   load native agent library by full pathname
     [exec]     -javaagent:<jarpath>[=<options>]
     [exec]                   load Java programming language agent, see java.lang.instrument
     [exec]     -splash:<imagepath>
     [exec]                   show splash screen with specified image
     [exec] See http://www.oracle.com/technetwork/java/javase/documentation/index.html for
more details.
     [exec] <https://builds.apache.org/job/PreCommit-ZOOKEEPER-github-pr-build-maven/ws/zookeeper-client/zookeeper-client-c/../../zookeeper-client/zookeeper-client-c/tests/zkServer.sh>:
line 191: .scheme=sasl: command not found
     [exec] <https://builds.apache.org/job/PreCommit-ZOOKEEPER-github-pr-build-maven/ws/zookeeper-client/zookeeper-client-c/../../zookeeper-client/zookeeper-client-c/tests/zkServer.sh>:
line 62: kill: (450) - No such process
     [exec] Zookeeper_serverRequireClientSASL::testServerRequireClientSASL : assertion : elapsed
3278
     [exec] <https://builds.apache.org/job/PreCommit-ZOOKEEPER-github-pr-build-maven/ws/zookeeper-client/zookeeper-client-c/tests/TestServerRequireClientSASLAuth.cc>:101:
Assertion: equality assertion failed [Expected: -124, Actual  : -4]
     [exec] Failures !!!
     [exec] Run: 80   Failure total: 1   Failures: 1   Errors: 0
     [exec] FAIL: zktest-mt
     [exec] ==========================================
     [exec] 1 of 2 tests failed
     [exec] Please report to user@zookeeper.apache.org
     [exec] ==========================================
     [exec] Makefile:1817: recipe for target 'check-TESTS' failed
     [exec] make[1]: Leaving directory '<https://builds.apache.org/job/PreCommit-ZOOKEEPER-github-pr-build-maven/ws/zookeeper-client/zookeeper-client-c/target/c'>
     [exec] Makefile:2073: recipe for target 'check-am' failed
     [exec] make[1]: *** [check-TESTS] Error 1
     [exec] make: *** [check-am] Error 2
[INFO] ------------------------------------------------------------------------
[INFO] Reactor Summary for Apache ZooKeeper 3.6.0-SNAPSHOT:
[INFO] 
[INFO] Apache ZooKeeper ................................... SUCCESS [ 24.227 s]
[INFO] Apache ZooKeeper - Documentation ................... SUCCESS [  9.209 s]
[INFO] Apache ZooKeeper - Jute ............................ SUCCESS [01:30 min]
[INFO] Apache ZooKeeper - Server .......................... SUCCESS [17:42 min]
[INFO] Apache ZooKeeper - Metrics Providers ............... SUCCESS [  4.668 s]
[INFO] Apache ZooKeeper - Prometheus.io Metrics Provider .. SUCCESS [ 13.260 s]
[INFO] Apache ZooKeeper - Client .......................... SUCCESS [  3.243 s]
[INFO] Apache ZooKeeper - Client - C ...................... FAILURE [06:26 min]
[INFO] Apache ZooKeeper - Recipes ......................... SKIPPED
[INFO] Apache ZooKeeper - Recipes - Election .............. SKIPPED
[INFO] Apache ZooKeeper - Recipes - Lock .................. SKIPPED
[INFO] Apache ZooKeeper - Recipes - Queue ................. SKIPPED
[INFO] Apache ZooKeeper - Assembly ........................ SKIPPED
[INFO] Apache ZooKeeper - Contrib ......................... SKIPPED
[INFO] Apache ZooKeeper - Contrib - Loggraph .............. SKIPPED
[INFO] Apache ZooKeeper - Contrib - Rest .................. SKIPPED
[INFO] Apache ZooKeeper - Contrib - ZooInspector .......... SKIPPED
[INFO] ------------------------------------------------------------------------
[INFO] BUILD FAILURE
[INFO] ------------------------------------------------------------------------
[INFO] Total time:  27:30 min
[INFO] Finished at: 2019-10-01T21:50:34Z
[INFO] ------------------------------------------------------------------------
Waiting for Jenkins to finish collecting data
[ERROR] Failed to execute goal org.apache.maven.plugins:maven-antrun-plugin:1.8:run (test-cppunit)
on project zookeeper-client-c: An Ant BuildException has occured: exec returned: 2
[ERROR] around Ant part ...<exec failonerror="true" dir="<https://builds.apache.org/job/PreCommit-ZOOKEEPER-github-pr-build-maven/ws/zookeeper-client/zookeeper-client-c/target/c">
executable="make">... @ 4:177 in <https://builds.apache.org/job/PreCommit-ZOOKEEPER-github-pr-build-maven/ws/zookeeper-client/zookeeper-client-c/target/antrun/build-main.xml>
[ERROR] -> [Help 1]
[ERROR] 
[ERROR] To see the full stack trace of the errors, re-run Maven with the -e switch.
[ERROR] Re-run Maven using the -X switch to enable full debug logging.
[ERROR] 
[ERROR] For more information about the errors and possible solutions, please read the following
articles:
[ERROR] [Help 1] http://cwiki.apache.org/confluence/display/MAVEN/MojoExecutionException
[ERROR] 
[ERROR] After correcting the problems, you can resume the build with the command
[ERROR]   mvn <goals> -rf :zookeeper-client-c
[JENKINS] Archiving <https://builds.apache.org/job/PreCommit-ZOOKEEPER-github-pr-build-maven/ws/zookeeper-server/pom.xml>
to org.apache.zookeeper/zookeeper/3.6.0-SNAPSHOT/zookeeper-3.6.0-SNAPSHOT.pom
[JENKINS] Archiving <https://builds.apache.org/job/PreCommit-ZOOKEEPER-github-pr-build-maven/ws/zookeeper-server/target/zookeeper-3.6.0-SNAPSHOT.jar>
to org.apache.zookeeper/zookeeper/3.6.0-SNAPSHOT/zookeeper-3.6.0-SNAPSHOT.jar
[JENKINS] Archiving <https://builds.apache.org/job/PreCommit-ZOOKEEPER-github-pr-build-maven/ws/zookeeper-server/target/zookeeper-3.6.0-SNAPSHOT-tests.jar>
to org.apache.zookeeper/zookeeper/3.6.0-SNAPSHOT/zookeeper-3.6.0-SNAPSHOT-tests.jar
[JENKINS] Archiving <https://builds.apache.org/job/PreCommit-ZOOKEEPER-github-pr-build-maven/ws/zookeeper-server/target/zookeeper-3.6.0-SNAPSHOT-sources.jar>
to org.apache.zookeeper/zookeeper/3.6.0-SNAPSHOT/zookeeper-3.6.0-SNAPSHOT-sources.jar
[JENKINS] Archiving <https://builds.apache.org/job/PreCommit-ZOOKEEPER-github-pr-build-maven/ws/zookeeper-server/target/zookeeper-3.6.0-SNAPSHOT-javadoc.jar>
to org.apache.zookeeper/zookeeper/3.6.0-SNAPSHOT/zookeeper-3.6.0-SNAPSHOT-javadoc.jar
[JENKINS] Archiving <https://builds.apache.org/job/PreCommit-ZOOKEEPER-github-pr-build-maven/ws/zookeeper-contrib/zookeeper-contrib-loggraph/pom.xml>
to org.apache.zookeeper/zookeeper-contrib-loggraph/3.6.0-SNAPSHOT/zookeeper-contrib-loggraph-3.6.0-SNAPSHOT.pom
[JENKINS] Archiving <https://builds.apache.org/job/PreCommit-ZOOKEEPER-github-pr-build-maven/ws/zookeeper-metrics-providers/pom.xml>
to org.apache.zookeeper/zookeeper-metrics-providers/3.6.0-SNAPSHOT/zookeeper-metrics-providers-3.6.0-SNAPSHOT.pom
[JENKINS] Archiving <https://builds.apache.org/job/PreCommit-ZOOKEEPER-github-pr-build-maven/ws/zookeeper-metrics-providers/zookeeper-prometheus-metrics/pom.xml>
to org.apache.zookeeper/zookeeper-prometheus-metrics/3.6.0-SNAPSHOT/zookeeper-prometheus-metrics-3.6.0-SNAPSHOT.pom
[JENKINS] Archiving <https://builds.apache.org/job/PreCommit-ZOOKEEPER-github-pr-build-maven/ws/zookeeper-metrics-providers/zookeeper-prometheus-metrics/target/zookeeper-prometheus-metrics-3.6.0-SNAPSHOT.jar>
to org.apache.zookeeper/zookeeper-prometheus-metrics/3.6.0-SNAPSHOT/zookeeper-prometheus-metrics-3.6.0-SNAPSHOT.jar
[JENKINS] Archiving <https://builds.apache.org/job/PreCommit-ZOOKEEPER-github-pr-build-maven/ws/zookeeper-metrics-providers/zookeeper-prometheus-metrics/target/zookeeper-prometheus-metrics-3.6.0-SNAPSHOT-tests.jar>
to org.apache.zookeeper/zookeeper-prometheus-metrics/3.6.0-SNAPSHOT/zookeeper-prometheus-metrics-3.6.0-SNAPSHOT-tests.jar
[JENKINS] Archiving <https://builds.apache.org/job/PreCommit-ZOOKEEPER-github-pr-build-maven/ws/zookeeper-metrics-providers/zookeeper-prometheus-metrics/target/zookeeper-prometheus-metrics-3.6.0-SNAPSHOT-sources.jar>
to org.apache.zookeeper/zookeeper-prometheus-metrics/3.6.0-SNAPSHOT/zookeeper-prometheus-metrics-3.6.0-SNAPSHOT-sources.jar
[JENKINS] Archiving <https://builds.apache.org/job/PreCommit-ZOOKEEPER-github-pr-build-maven/ws/zookeeper-metrics-providers/zookeeper-prometheus-metrics/target/zookeeper-prometheus-metrics-3.6.0-SNAPSHOT-javadoc.jar>
to org.apache.zookeeper/zookeeper-prometheus-metrics/3.6.0-SNAPSHOT/zookeeper-prometheus-metrics-3.6.0-SNAPSHOT-javadoc.jar
[JENKINS] Archiving <https://builds.apache.org/job/PreCommit-ZOOKEEPER-github-pr-build-maven/ws/zookeeper-recipes/zookeeper-recipes-election/pom.xml>
to org.apache.zookeeper/zookeeper-recipes-election/3.6.0-SNAPSHOT/zookeeper-recipes-election-3.6.0-SNAPSHOT.pom
[JENKINS] Archiving <https://builds.apache.org/job/PreCommit-ZOOKEEPER-github-pr-build-maven/ws/pom.xml>
to org.apache.zookeeper/parent/3.6.0-SNAPSHOT/parent-3.6.0-SNAPSHOT.pom
[JENKINS] Archiving <https://builds.apache.org/job/PreCommit-ZOOKEEPER-github-pr-build-maven/ws/zookeeper-recipes/zookeeper-recipes-lock/pom.xml>
to org.apache.zookeeper/zookeeper-recipes-lock/3.6.0-SNAPSHOT/zookeeper-recipes-lock-3.6.0-SNAPSHOT.pom
[JENKINS] Archiving <https://builds.apache.org/job/PreCommit-ZOOKEEPER-github-pr-build-maven/ws/zookeeper-contrib/pom.xml>
to org.apache.zookeeper/zookeeper-contrib/3.6.0-SNAPSHOT/zookeeper-contrib-3.6.0-SNAPSHOT.pom
[JENKINS] Archiving <https://builds.apache.org/job/PreCommit-ZOOKEEPER-github-pr-build-maven/ws/zookeeper-client/pom.xml>
to org.apache.zookeeper/zookeeper-client/3.6.0-SNAPSHOT/zookeeper-client-3.6.0-SNAPSHOT.pom
[JENKINS] Archiving <https://builds.apache.org/job/PreCommit-ZOOKEEPER-github-pr-build-maven/ws/zookeeper-jute/pom.xml>
to org.apache.zookeeper/zookeeper-jute/3.6.0-SNAPSHOT/zookeeper-jute-3.6.0-SNAPSHOT.pom
[JENKINS] Archiving <https://builds.apache.org/job/PreCommit-ZOOKEEPER-github-pr-build-maven/ws/zookeeper-jute/target/zookeeper-jute-3.6.0-SNAPSHOT.jar>
to org.apache.zookeeper/zookeeper-jute/3.6.0-SNAPSHOT/zookeeper-jute-3.6.0-SNAPSHOT.jar
[JENKINS] Archiving <https://builds.apache.org/job/PreCommit-ZOOKEEPER-github-pr-build-maven/ws/zookeeper-jute/target/zookeeper-jute-3.6.0-SNAPSHOT-tests.jar>
to org.apache.zookeeper/zookeeper-jute/3.6.0-SNAPSHOT/zookeeper-jute-3.6.0-SNAPSHOT-tests.jar
[JENKINS] Archiving <https://builds.apache.org/job/PreCommit-ZOOKEEPER-github-pr-build-maven/ws/zookeeper-jute/target/zookeeper-jute-3.6.0-SNAPSHOT-sources.jar>
to org.apache.zookeeper/zookeeper-jute/3.6.0-SNAPSHOT/zookeeper-jute-3.6.0-SNAPSHOT-sources.jar
[JENKINS] Archiving <https://builds.apache.org/job/PreCommit-ZOOKEEPER-github-pr-build-maven/ws/zookeeper-jute/target/zookeeper-jute-3.6.0-SNAPSHOT-javadoc.jar>
to org.apache.zookeeper/zookeeper-jute/3.6.0-SNAPSHOT/zookeeper-jute-3.6.0-SNAPSHOT-javadoc.jar
[JENKINS] Archiving <https://builds.apache.org/job/PreCommit-ZOOKEEPER-github-pr-build-maven/ws/zookeeper-recipes/zookeeper-recipes-queue/pom.xml>
to org.apache.zookeeper/zookeeper-recipes-queue/3.6.0-SNAPSHOT/zookeeper-recipes-queue-3.6.0-SNAPSHOT.pom
[JENKINS] Archiving <https://builds.apache.org/job/PreCommit-ZOOKEEPER-github-pr-build-maven/ws/zookeeper-docs/pom.xml>
to org.apache.zookeeper/zookeeper-docs/3.6.0-SNAPSHOT/zookeeper-docs-3.6.0-SNAPSHOT.pom
[JENKINS] Archiving <https://builds.apache.org/job/PreCommit-ZOOKEEPER-github-pr-build-maven/ws/zookeeper-docs/target/zookeeper-docs-3.6.0-SNAPSHOT.jar>
to org.apache.zookeeper/zookeeper-docs/3.6.0-SNAPSHOT/zookeeper-docs-3.6.0-SNAPSHOT.jar
[JENKINS] Archiving <https://builds.apache.org/job/PreCommit-ZOOKEEPER-github-pr-build-maven/ws/zookeeper-docs/target/zookeeper-docs-3.6.0-SNAPSHOT-tests.jar>
to org.apache.zookeeper/zookeeper-docs/3.6.0-SNAPSHOT/zookeeper-docs-3.6.0-SNAPSHOT-tests.jar
[JENKINS] Archiving <https://builds.apache.org/job/PreCommit-ZOOKEEPER-github-pr-build-maven/ws/zookeeper-docs/target/zookeeper-docs-3.6.0-SNAPSHOT-sources.jar>
to org.apache.zookeeper/zookeeper-docs/3.6.0-SNAPSHOT/zookeeper-docs-3.6.0-SNAPSHOT-sources.jar
[JENKINS] Archiving <https://builds.apache.org/job/PreCommit-ZOOKEEPER-github-pr-build-maven/ws/zookeeper-recipes/pom.xml>
to org.apache.zookeeper/zookeeper-recipes/3.6.0-SNAPSHOT/zookeeper-recipes-3.6.0-SNAPSHOT.pom
[JENKINS] Archiving <https://builds.apache.org/job/PreCommit-ZOOKEEPER-github-pr-build-maven/ws/zookeeper-client/zookeeper-client-c/pom.xml>
to org.apache.zookeeper/zookeeper-client-c/3.6.0-SNAPSHOT/zookeeper-client-c-3.6.0-SNAPSHOT.pom
[JENKINS] Archiving <https://builds.apache.org/job/PreCommit-ZOOKEEPER-github-pr-build-maven/ws/zookeeper-contrib/zookeeper-contrib-rest/pom.xml>
to org.apache.zookeeper/zookeeper-contrib-rest/3.6.0-SNAPSHOT/zookeeper-contrib-rest-3.6.0-SNAPSHOT.pom
[JENKINS] Archiving <https://builds.apache.org/job/PreCommit-ZOOKEEPER-github-pr-build-maven/ws/zookeeper-assembly/pom.xml>
to org.apache.zookeeper/zookeeper-assembly/3.6.0-SNAPSHOT/zookeeper-assembly-3.6.0-SNAPSHOT.pom
[JENKINS] Archiving <https://builds.apache.org/job/PreCommit-ZOOKEEPER-github-pr-build-maven/ws/zookeeper-contrib/zookeeper-contrib-zooinspector/pom.xml>
to org.apache.zookeeper/zookeeper-contrib-zooinspector/3.6.0-SNAPSHOT/zookeeper-contrib-zooinspector-3.6.0-SNAPSHOT.pom
channel stopped
[SpotBugs] Skipping execution of recorder since overall result is 'FAILURE'
Setting status of d199b53182f061355d3e9d78d24c9ce9e2badccb to FAILURE with url https://builds.apache.org/job/PreCommit-ZOOKEEPER-github-pr-build-maven/1373/
and message: 'FAILURE
 '
Using context: JenkinsMaven

Mime
View raw message