zookeeper-dev mailing list archives

Site index · List index
Message view « Date » · « Thread »
Top « Date » · « Thread »
From Apache Jenkins Server <jenk...@builds.apache.org>
Subject Build failed in Jenkins: PreCommit-ZOOKEEPER-github-pr-build-maven #1396
Date Thu, 03 Oct 2019 19:31:18 GMT
See <https://builds.apache.org/job/PreCommit-ZOOKEEPER-github-pr-build-maven/1396/display/redirect>

Changes:


------------------------------------------
[...truncated 666.24 KB...]
Generating <https://builds.apache.org/job/PreCommit-ZOOKEEPER-github-pr-build-maven/ws/zookeeper-server/target/apidocs/org/apache/zookeeper/version/package-use.html...>
Generating <https://builds.apache.org/job/PreCommit-ZOOKEEPER-github-pr-build-maven/ws/zookeeper-server/target/apidocs/org/apache/zookeeper/version/util/package-use.html...>
Building index for all the packages and classes...
Generating <https://builds.apache.org/job/PreCommit-ZOOKEEPER-github-pr-build-maven/ws/zookeeper-server/target/apidocs/overview-tree.html...>
Generating <https://builds.apache.org/job/PreCommit-ZOOKEEPER-github-pr-build-maven/ws/zookeeper-server/target/apidocs/index-all.html...>
Generating <https://builds.apache.org/job/PreCommit-ZOOKEEPER-github-pr-build-maven/ws/zookeeper-server/target/apidocs/deprecated-list.html...>
Building index for all classes...
Generating <https://builds.apache.org/job/PreCommit-ZOOKEEPER-github-pr-build-maven/ws/zookeeper-server/target/apidocs/allclasses-frame.html...>
Generating <https://builds.apache.org/job/PreCommit-ZOOKEEPER-github-pr-build-maven/ws/zookeeper-server/target/apidocs/allclasses-noframe.html...>
Generating <https://builds.apache.org/job/PreCommit-ZOOKEEPER-github-pr-build-maven/ws/zookeeper-server/target/apidocs/index.html...>
Generating <https://builds.apache.org/job/PreCommit-ZOOKEEPER-github-pr-build-maven/ws/zookeeper-server/target/apidocs/overview-summary.html...>
Generating <https://builds.apache.org/job/PreCommit-ZOOKEEPER-github-pr-build-maven/ws/zookeeper-server/target/apidocs/help-doc.html...>
53 warnings
[WARNING] Javadoc Warnings
[WARNING] <https://builds.apache.org/job/PreCommit-ZOOKEEPER-github-pr-build-maven/ws/zookeeper-server/src/main/java/org/apache/zookeeper/ZKUtil.java>:51:
warning - Tag @link: can't find delete(String, int) in org.apache.zookeeper.ZKUtil
[WARNING] <https://builds.apache.org/job/PreCommit-ZOOKEEPER-github-pr-build-maven/ws/zookeeper-server/src/main/java/org/apache/zookeeper/jmx/ManagedUtil.java>:64:
warning - Tag @see:illegal character: "58" in "http://logging.apache.org/log4j/1.2/apidocs/index.html?org/apache/log4j/jmx/package-summary.html"
[WARNING] <https://builds.apache.org/job/PreCommit-ZOOKEEPER-github-pr-build-maven/ws/zookeeper-server/src/main/java/org/apache/zookeeper/jmx/ManagedUtil.java>:64:
warning - Tag @see:illegal character: "47" in "http://logging.apache.org/log4j/1.2/apidocs/index.html?org/apache/log4j/jmx/package-summary.html"
[WARNING] <https://builds.apache.org/job/PreCommit-ZOOKEEPER-github-pr-build-maven/ws/zookeeper-server/src/main/java/org/apache/zookeeper/jmx/ManagedUtil.java>:64:
warning - Tag @see:illegal character: "47" in "http://logging.apache.org/log4j/1.2/apidocs/index.html?org/apache/log4j/jmx/package-summary.html"
[WARNING] <https://builds.apache.org/job/PreCommit-ZOOKEEPER-github-pr-build-maven/ws/zookeeper-server/src/main/java/org/apache/zookeeper/jmx/ManagedUtil.java>:64:
warning - Tag @see:illegal character: "47" in "http://logging.apache.org/log4j/1.2/apidocs/index.html?org/apache/log4j/jmx/package-summary.html"
[WARNING] <https://builds.apache.org/job/PreCommit-ZOOKEEPER-github-pr-build-maven/ws/zookeeper-server/src/main/java/org/apache/zookeeper/jmx/ManagedUtil.java>:64:
warning - Tag @see:illegal character: "47" in "http://logging.apache.org/log4j/1.2/apidocs/index.html?org/apache/log4j/jmx/package-summary.html"
[WARNING] <https://builds.apache.org/job/PreCommit-ZOOKEEPER-github-pr-build-maven/ws/zookeeper-server/src/main/java/org/apache/zookeeper/jmx/ManagedUtil.java>:64:
warning - Tag @see:illegal character: "47" in "http://logging.apache.org/log4j/1.2/apidocs/index.html?org/apache/log4j/jmx/package-summary.html"
[WARNING] <https://builds.apache.org/job/PreCommit-ZOOKEEPER-github-pr-build-maven/ws/zookeeper-server/src/main/java/org/apache/zookeeper/jmx/ManagedUtil.java>:64:
warning - Tag @see:illegal character: "47" in "http://logging.apache.org/log4j/1.2/apidocs/index.html?org/apache/log4j/jmx/package-summary.html"
[WARNING] <https://builds.apache.org/job/PreCommit-ZOOKEEPER-github-pr-build-maven/ws/zookeeper-server/src/main/java/org/apache/zookeeper/jmx/ManagedUtil.java>:64:
warning - Tag @see:illegal character: "63" in "http://logging.apache.org/log4j/1.2/apidocs/index.html?org/apache/log4j/jmx/package-summary.html"
[WARNING] <https://builds.apache.org/job/PreCommit-ZOOKEEPER-github-pr-build-maven/ws/zookeeper-server/src/main/java/org/apache/zookeeper/jmx/ManagedUtil.java>:64:
warning - Tag @see:illegal character: "47" in "http://logging.apache.org/log4j/1.2/apidocs/index.html?org/apache/log4j/jmx/package-summary.html"
[WARNING] <https://builds.apache.org/job/PreCommit-ZOOKEEPER-github-pr-build-maven/ws/zookeeper-server/src/main/java/org/apache/zookeeper/jmx/ManagedUtil.java>:64:
warning - Tag @see:illegal character: "47" in "http://logging.apache.org/log4j/1.2/apidocs/index.html?org/apache/log4j/jmx/package-summary.html"
[WARNING] <https://builds.apache.org/job/PreCommit-ZOOKEEPER-github-pr-build-maven/ws/zookeeper-server/src/main/java/org/apache/zookeeper/jmx/ManagedUtil.java>:64:
warning - Tag @see:illegal character: "47" in "http://logging.apache.org/log4j/1.2/apidocs/index.html?org/apache/log4j/jmx/package-summary.html"
[WARNING] <https://builds.apache.org/job/PreCommit-ZOOKEEPER-github-pr-build-maven/ws/zookeeper-server/src/main/java/org/apache/zookeeper/jmx/ManagedUtil.java>:64:
warning - Tag @see:illegal character: "47" in "http://logging.apache.org/log4j/1.2/apidocs/index.html?org/apache/log4j/jmx/package-summary.html"
[WARNING] <https://builds.apache.org/job/PreCommit-ZOOKEEPER-github-pr-build-maven/ws/zookeeper-server/src/main/java/org/apache/zookeeper/jmx/ManagedUtil.java>:64:
warning - Tag @see:illegal character: "45" in "http://logging.apache.org/log4j/1.2/apidocs/index.html?org/apache/log4j/jmx/package-summary.html"
[WARNING] <https://builds.apache.org/job/PreCommit-ZOOKEEPER-github-pr-build-maven/ws/zookeeper-server/src/main/java/org/apache/zookeeper/jmx/ManagedUtil.java>:64:
warning - Tag @see: reference not found: http://logging.apache.org/log4j/1.2/apidocs/index.html?org/apache/log4j/jmx/package-summary.html
[WARNING] <https://builds.apache.org/job/PreCommit-ZOOKEEPER-github-pr-build-maven/ws/zookeeper-server/src/main/java/org/apache/zookeeper/server/DataNode.java>:83:
warning - @param argument "parent" is not a parameter name.
[WARNING] <https://builds.apache.org/job/PreCommit-ZOOKEEPER-github-pr-build-maven/ws/zookeeper-server/src/main/java/org/apache/zookeeper/server/ServerCnxn.java>:282:
warning - Tag @see: missing '#': "dumpConnectionInfo(PrintWriter, boolean) for brief stats"
[WARNING] <https://builds.apache.org/job/PreCommit-ZOOKEEPER-github-pr-build-maven/ws/zookeeper-server/src/main/java/org/apache/zookeeper/server/ServerCnxn.java>:303:
warning - @return tag cannot be used in method with void return type.
[WARNING] <https://builds.apache.org/job/PreCommit-ZOOKEEPER-github-pr-build-maven/ws/zookeeper-server/src/main/java/org/apache/zookeeper/server/ServerConfig.java>:58:
warning - @return tag cannot be used in method with void return type.
[WARNING] <https://builds.apache.org/job/PreCommit-ZOOKEEPER-github-pr-build-maven/ws/zookeeper-server/src/main/java/org/apache/zookeeper/server/ServerConfig.java>:80:
warning - @return tag cannot be used in method with void return type.
[WARNING] <https://builds.apache.org/job/PreCommit-ZOOKEEPER-github-pr-build-maven/ws/zookeeper-server/src/main/java/org/apache/zookeeper/server/ZKDatabase.java>:465:
warning - @return tag has no arguments.
[WARNING] <https://builds.apache.org/job/PreCommit-ZOOKEEPER-github-pr-build-maven/ws/zookeeper-server/src/main/java/org/apache/zookeeper/server/ZooKeeperServer.java>:156:
warning - @param argument "dataDir" is not a parameter name.
[WARNING] <https://builds.apache.org/job/PreCommit-ZOOKEEPER-github-pr-build-maven/ws/zookeeper-server/src/main/java/org/apache/zookeeper/server/persistence/FileTxnLog.java>:252:
warning - @return tag has no arguments.
[WARNING] <https://builds.apache.org/job/PreCommit-ZOOKEEPER-github-pr-build-maven/ws/zookeeper-server/src/main/java/org/apache/zookeeper/server/persistence/FileTxnLog.java>:652:
warning - @param argument "ia" is not a parameter name.
[WARNING] <https://builds.apache.org/job/PreCommit-ZOOKEEPER-github-pr-build-maven/ws/zookeeper-server/src/main/java/org/apache/zookeeper/server/persistence/FileTxnLog.java>:652:
warning - @param argument "is" is not a parameter name.
[WARNING] <https://builds.apache.org/job/PreCommit-ZOOKEEPER-github-pr-build-maven/ws/zookeeper-server/src/main/java/org/apache/zookeeper/server/persistence/FileTxnSnapLog.java>:449:
warning - @return tag has no arguments.
[WARNING] <https://builds.apache.org/job/PreCommit-ZOOKEEPER-github-pr-build-maven/ws/zookeeper-server/src/main/java/org/apache/zookeeper/server/persistence/Util.java>:304:
warning - @return tag has no arguments.
[WARNING] <https://builds.apache.org/job/PreCommit-ZOOKEEPER-github-pr-build-maven/ws/zookeeper-server/src/main/java/org/apache/zookeeper/server/persistence/Util.java>:314:
warning - @return tag has no arguments.
[WARNING] <https://builds.apache.org/job/PreCommit-ZOOKEEPER-github-pr-build-maven/ws/zookeeper-server/src/main/java/org/apache/zookeeper/server/auth/KerberosName.java>:357:
warning - @param argument "conf" is not a parameter name.
[WARNING] <https://builds.apache.org/job/PreCommit-ZOOKEEPER-github-pr-build-maven/ws/zookeeper-server/src/main/java/org/apache/zookeeper/server/quorum/FastLeaderElection.java>:698:
warning - @param argument "id" is not a parameter name.
[WARNING] <https://builds.apache.org/job/PreCommit-ZOOKEEPER-github-pr-build-maven/ws/zookeeper-server/src/main/java/org/apache/zookeeper/server/quorum/FastLeaderElection.java>:698:
warning - @param argument "zxid" is not a parameter name.
[WARNING] <https://builds.apache.org/job/PreCommit-ZOOKEEPER-github-pr-build-maven/ws/zookeeper-server/src/main/java/org/apache/zookeeper/server/quorum/Learner.java>:78:
warning - @return tag has no arguments.
[WARNING] <https://builds.apache.org/job/PreCommit-ZOOKEEPER-github-pr-build-maven/ws/zookeeper-server/src/main/java/org/apache/zookeeper/server/quorum/Leader.java>:1065:
warning - @return tag has no arguments.
[WARNING] <https://builds.apache.org/job/PreCommit-ZOOKEEPER-github-pr-build-maven/ws/zookeeper-server/src/main/java/org/apache/zookeeper/server/quorum/Leader.java>:218:
warning - @param argument "qv," is not a parameter name.
[WARNING] <https://builds.apache.org/job/PreCommit-ZOOKEEPER-github-pr-build-maven/ws/zookeeper-server/src/main/java/org/apache/zookeeper/server/quorum/Leader.java>:845:
warning - @param argument "zxid," is not a parameter name.
[WARNING] <https://builds.apache.org/job/PreCommit-ZOOKEEPER-github-pr-build-maven/ws/zookeeper-server/src/main/java/org/apache/zookeeper/server/quorum/Leader.java>:845:
warning - @param argument "sid," is not a parameter name.
[WARNING] <https://builds.apache.org/job/PreCommit-ZOOKEEPER-github-pr-build-maven/ws/zookeeper-server/src/main/java/org/apache/zookeeper/server/quorum/LearnerHandler.java>:990:
warning - @return tag has no arguments.
[WARNING] <https://builds.apache.org/job/PreCommit-ZOOKEEPER-github-pr-build-maven/ws/zookeeper-server/src/main/java/org/apache/zookeeper/server/quorum/QuorumPeer.java>:1729:
warning - @return tag has no arguments.
[WARNING] <https://builds.apache.org/job/PreCommit-ZOOKEEPER-github-pr-build-maven/ws/zookeeper-server/src/main/java/org/apache/zookeeper/server/quorum/QuorumPeer.java>:2104:
warning - Tag @see:illegal character: "58" in "https://issues.apache.org/jira/browse/ZOOKEEPER-1732"
[WARNING] <https://builds.apache.org/job/PreCommit-ZOOKEEPER-github-pr-build-maven/ws/zookeeper-server/src/main/java/org/apache/zookeeper/server/quorum/QuorumPeer.java>:2104:
warning - Tag @see:illegal character: "47" in "https://issues.apache.org/jira/browse/ZOOKEEPER-1732"
[WARNING] <https://builds.apache.org/job/PreCommit-ZOOKEEPER-github-pr-build-maven/ws/zookeeper-server/src/main/java/org/apache/zookeeper/server/quorum/QuorumPeer.java>:2104:
warning - Tag @see:illegal character: "47" in "https://issues.apache.org/jira/browse/ZOOKEEPER-1732"
[WARNING] <https://builds.apache.org/job/PreCommit-ZOOKEEPER-github-pr-build-maven/ws/zookeeper-server/src/main/java/org/apache/zookeeper/server/quorum/QuorumPeer.java>:2104:
warning - Tag @see:illegal character: "47" in "https://issues.apache.org/jira/browse/ZOOKEEPER-1732"
[WARNING] <https://builds.apache.org/job/PreCommit-ZOOKEEPER-github-pr-build-maven/ws/zookeeper-server/src/main/java/org/apache/zookeeper/server/quorum/QuorumPeer.java>:2104:
warning - Tag @see:illegal character: "47" in "https://issues.apache.org/jira/browse/ZOOKEEPER-1732"
[WARNING] <https://builds.apache.org/job/PreCommit-ZOOKEEPER-github-pr-build-maven/ws/zookeeper-server/src/main/java/org/apache/zookeeper/server/quorum/QuorumPeer.java>:2104:
warning - Tag @see:illegal character: "47" in "https://issues.apache.org/jira/browse/ZOOKEEPER-1732"
[WARNING] <https://builds.apache.org/job/PreCommit-ZOOKEEPER-github-pr-build-maven/ws/zookeeper-server/src/main/java/org/apache/zookeeper/server/quorum/QuorumPeer.java>:2104:
warning - Tag @see:illegal character: "45" in "https://issues.apache.org/jira/browse/ZOOKEEPER-1732"
[WARNING] <https://builds.apache.org/job/PreCommit-ZOOKEEPER-github-pr-build-maven/ws/zookeeper-server/src/main/java/org/apache/zookeeper/server/quorum/QuorumPeer.java>:2104:
warning - Tag @see cannot be used in inline documentation.  It can only be used in the following
types of documentation: overview, package, class/interface, constructor, field, method.
[WARNING] <https://builds.apache.org/job/PreCommit-ZOOKEEPER-github-pr-build-maven/ws/zookeeper-server/src/main/java/org/apache/zookeeper/server/quorum/QuorumPeer.java>:2104:
warning - Tag @see: reference not found: https://issues.apache.org/jira/browse/ZOOKEEPER-1732
[WARNING] <https://builds.apache.org/job/PreCommit-ZOOKEEPER-github-pr-build-maven/ws/zookeeper-server/src/main/java/org/apache/zookeeper/server/quorum/QuorumPeer.java>:2104:
warning - Tag @see cannot be used in inline documentation.  It can only be used in the following
types of documentation: overview, package, class/interface, constructor, field, method.
[WARNING] <https://builds.apache.org/job/PreCommit-ZOOKEEPER-github-pr-build-maven/ws/zookeeper-server/src/main/java/org/apache/zookeeper/cli/AclParser.java>:36:
warning - @return tag has no arguments.
[WARNING] <https://builds.apache.org/job/PreCommit-ZOOKEEPER-github-pr-build-maven/ws/zookeeper-server/src/main/java/org/apache/zookeeper/cli/CliCommand.java>:75:
warning - @return tag has no arguments.
[WARNING] <https://builds.apache.org/job/PreCommit-ZOOKEEPER-github-pr-build-maven/ws/zookeeper-server/src/main/java/org/apache/zookeeper/cli/CliCommand.java>:83:
warning - @return tag has no arguments.
[WARNING] <https://builds.apache.org/job/PreCommit-ZOOKEEPER-github-pr-build-maven/ws/zookeeper-server/src/main/java/org/apache/zookeeper/cli/CliCommand.java>:91:
warning - @return tag has no arguments.
[WARNING] <https://builds.apache.org/job/PreCommit-ZOOKEEPER-github-pr-build-maven/ws/zookeeper-server/src/main/java/org/apache/zookeeper/cli/CliCommand.java>:116:
warning - @return tag has no arguments.
[INFO] Building jar: <https://builds.apache.org/job/PreCommit-ZOOKEEPER-github-pr-build-maven/ws/zookeeper-server/target/zookeeper-3.5.7-SNAPSHOT-javadoc.jar>
[INFO] 
[INFO] --- maven-dependency-plugin:3.1.1:copy-dependencies (copy-dependencies) @ zookeeper
---
[INFO] Downloading from central: https://repo.maven.apache.org/maven2/org/apache/maven/shared/maven-dependency-analyzer/1.10/maven-dependency-analyzer-1.10.pom
[INFO] Downloaded from central: https://repo.maven.apache.org/maven2/org/apache/maven/shared/maven-dependency-analyzer/1.10/maven-dependency-analyzer-1.10.pom
(6.7 kB at 67 kB/s)
[INFO] Downloading from central: https://repo.maven.apache.org/maven2/org/apache/maven/shared/maven-shared-components/31/maven-shared-components-31.pom
[INFO] Downloaded from central: https://repo.maven.apache.org/maven2/org/apache/maven/shared/maven-shared-components/31/maven-shared-components-31.pom
(5.1 kB at 365 kB/s)
[INFO] Downloading from central: https://repo.maven.apache.org/maven2/org/codehaus/plexus/plexus-utils/1.5.1/plexus-utils-1.5.1.pom
[INFO] Downloaded from central: https://repo.maven.apache.org/maven2/org/codehaus/plexus/plexus-utils/1.5.1/plexus-utils-1.5.1.pom
(2.3 kB at 191 kB/s)
[INFO] Downloading from central: https://repo.maven.apache.org/maven2/org/apache/maven/maven-model/2.0.5/maven-model-2.0.5.pom
[INFO] Downloaded from central: https://repo.maven.apache.org/maven2/org/apache/maven/maven-model/2.0.5/maven-model-2.0.5.pom
(2.7 kB at 227 kB/s)
[INFO] Downloading from central: https://repo.maven.apache.org/maven2/org/apache/maven/maven/2.0.5/maven-2.0.5.pom
[INFO] Downloaded from central: https://repo.maven.apache.org/maven2/org/apache/maven/maven/2.0.5/maven-2.0.5.pom
(5.7 kB at 439 kB/s)
[INFO] Downloading from central: https://repo.maven.apache.org/maven2/org/apache/maven/maven-artifact/2.0.5/maven-artifact-2.0.5.pom
[INFO] Downloaded from central: https://repo.maven.apache.org/maven2/org/apache/maven/maven-artifact/2.0.5/maven-artifact-2.0.5.pom
(727 B at 66 kB/s)
[INFO] Downloading from central: https://repo.maven.apache.org/maven2/org/apache/maven/shared/maven-dependency-tree/3.0.1/maven-dependency-tree-3.0.1.pom
[INFO] Downloaded from central: https://repo.maven.apache.org/maven2/org/apache/maven/shared/maven-dependency-tree/3.0.1/maven-dependency-tree-3.0.1.pom
(7.5 kB at 577 kB/s)
[INFO] Downloading from central: https://repo.maven.apache.org/maven2/org/codehaus/plexus/plexus-velocity/1.1.7/plexus-velocity-1.1.7.jar
[INFO] Downloading from central: https://repo.maven.apache.org/maven2/org/apache/maven/shared/maven-dependency-analyzer/1.10/maven-dependency-analyzer-1.10.jar
[INFO] Downloading from central: https://repo.maven.apache.org/maven2/org/apache/maven/shared/maven-dependency-tree/3.0.1/maven-dependency-tree-3.0.1.jar
[INFO] Downloading from central: https://repo.maven.apache.org/maven2/org/apache/maven/shared/maven-common-artifact-filters/3.0.1/maven-common-artifact-filters-3.0.1.jar
[INFO] Downloaded from central: https://repo.maven.apache.org/maven2/org/apache/maven/shared/maven-dependency-tree/3.0.1/maven-dependency-tree-3.0.1.jar
(37 kB at 991 kB/s)
[INFO] Downloaded from central: https://repo.maven.apache.org/maven2/org/codehaus/plexus/plexus-velocity/1.1.7/plexus-velocity-1.1.7.jar
(7.7 kB at 62 kB/s)
[INFO] Downloaded from central: https://repo.maven.apache.org/maven2/org/apache/maven/shared/maven-common-artifact-filters/3.0.1/maven-common-artifact-filters-3.0.1.jar
(61 kB at 504 kB/s)
[INFO] Downloaded from central: https://repo.maven.apache.org/maven2/org/apache/maven/shared/maven-dependency-analyzer/1.10/maven-dependency-analyzer-1.10.jar
(35 kB at 289 kB/s)
[INFO] Copying spotbugs-annotations-3.1.9.jar to <https://builds.apache.org/job/PreCommit-ZOOKEEPER-github-pr-build-maven/ws/zookeeper-server/target/lib/spotbugs-annotations-3.1.9.jar>
[INFO] Copying jsr305-3.0.2.jar to <https://builds.apache.org/job/PreCommit-ZOOKEEPER-github-pr-build-maven/ws/zookeeper-server/target/lib/jsr305-3.0.2.jar>
[INFO] Copying hamcrest-all-1.3.jar to <https://builds.apache.org/job/PreCommit-ZOOKEEPER-github-pr-build-maven/ws/zookeeper-server/target/lib/hamcrest-all-1.3.jar>
[INFO] Copying commons-collections-3.2.2.jar to <https://builds.apache.org/job/PreCommit-ZOOKEEPER-github-pr-build-maven/ws/zookeeper-server/target/lib/commons-collections-3.2.2.jar>
[INFO] Copying zookeeper-jute-3.5.7-SNAPSHOT.jar to <https://builds.apache.org/job/PreCommit-ZOOKEEPER-github-pr-build-maven/ws/zookeeper-server/target/lib/zookeeper-jute-3.5.7-SNAPSHOT.jar>
[INFO] Copying commons-cli-1.2.jar to <https://builds.apache.org/job/PreCommit-ZOOKEEPER-github-pr-build-maven/ws/zookeeper-server/target/lib/commons-cli-1.2.jar>
[INFO] Copying audience-annotations-0.5.0.jar to <https://builds.apache.org/job/PreCommit-ZOOKEEPER-github-pr-build-maven/ws/zookeeper-server/target/lib/audience-annotations-0.5.0.jar>
[INFO] Copying netty-handler-4.1.42.Final.jar to <https://builds.apache.org/job/PreCommit-ZOOKEEPER-github-pr-build-maven/ws/zookeeper-server/target/lib/netty-handler-4.1.42.Final.jar>
[INFO] Copying netty-common-4.1.42.Final.jar to <https://builds.apache.org/job/PreCommit-ZOOKEEPER-github-pr-build-maven/ws/zookeeper-server/target/lib/netty-common-4.1.42.Final.jar>
[INFO] Copying netty-buffer-4.1.42.Final.jar to <https://builds.apache.org/job/PreCommit-ZOOKEEPER-github-pr-build-maven/ws/zookeeper-server/target/lib/netty-buffer-4.1.42.Final.jar>
[INFO] Copying netty-transport-4.1.42.Final.jar to <https://builds.apache.org/job/PreCommit-ZOOKEEPER-github-pr-build-maven/ws/zookeeper-server/target/lib/netty-transport-4.1.42.Final.jar>
[INFO] Copying netty-resolver-4.1.42.Final.jar to <https://builds.apache.org/job/PreCommit-ZOOKEEPER-github-pr-build-maven/ws/zookeeper-server/target/lib/netty-resolver-4.1.42.Final.jar>
[INFO] Copying netty-codec-4.1.42.Final.jar to <https://builds.apache.org/job/PreCommit-ZOOKEEPER-github-pr-build-maven/ws/zookeeper-server/target/lib/netty-codec-4.1.42.Final.jar>
[INFO] Copying netty-transport-native-epoll-4.1.42.Final.jar to <https://builds.apache.org/job/PreCommit-ZOOKEEPER-github-pr-build-maven/ws/zookeeper-server/target/lib/netty-transport-native-epoll-4.1.42.Final.jar>
[INFO] Copying netty-transport-native-unix-common-4.1.42.Final.jar to <https://builds.apache.org/job/PreCommit-ZOOKEEPER-github-pr-build-maven/ws/zookeeper-server/target/lib/netty-transport-native-unix-common-4.1.42.Final.jar>
[INFO] Copying slf4j-api-1.7.25.jar to <https://builds.apache.org/job/PreCommit-ZOOKEEPER-github-pr-build-maven/ws/zookeeper-server/target/lib/slf4j-api-1.7.25.jar>
[INFO] Copying slf4j-log4j12-1.7.25.jar to <https://builds.apache.org/job/PreCommit-ZOOKEEPER-github-pr-build-maven/ws/zookeeper-server/target/lib/slf4j-log4j12-1.7.25.jar>
[INFO] Copying jetty-server-9.4.17.v20190418.jar to <https://builds.apache.org/job/PreCommit-ZOOKEEPER-github-pr-build-maven/ws/zookeeper-server/target/lib/jetty-server-9.4.17.v20190418.jar>
[INFO] Copying javax.servlet-api-3.1.0.jar to <https://builds.apache.org/job/PreCommit-ZOOKEEPER-github-pr-build-maven/ws/zookeeper-server/target/lib/javax.servlet-api-3.1.0.jar>
[INFO] Copying jetty-http-9.4.17.v20190418.jar to <https://builds.apache.org/job/PreCommit-ZOOKEEPER-github-pr-build-maven/ws/zookeeper-server/target/lib/jetty-http-9.4.17.v20190418.jar>
[INFO] Copying jetty-util-9.4.17.v20190418.jar to <https://builds.apache.org/job/PreCommit-ZOOKEEPER-github-pr-build-maven/ws/zookeeper-server/target/lib/jetty-util-9.4.17.v20190418.jar>
[INFO] Copying jetty-io-9.4.17.v20190418.jar to <https://builds.apache.org/job/PreCommit-ZOOKEEPER-github-pr-build-maven/ws/zookeeper-server/target/lib/jetty-io-9.4.17.v20190418.jar>
[INFO] Copying jetty-servlet-9.4.17.v20190418.jar to <https://builds.apache.org/job/PreCommit-ZOOKEEPER-github-pr-build-maven/ws/zookeeper-server/target/lib/jetty-servlet-9.4.17.v20190418.jar>
[INFO] Copying jetty-security-9.4.17.v20190418.jar to <https://builds.apache.org/job/PreCommit-ZOOKEEPER-github-pr-build-maven/ws/zookeeper-server/target/lib/jetty-security-9.4.17.v20190418.jar>
[INFO] Copying jackson-databind-2.9.10.jar to <https://builds.apache.org/job/PreCommit-ZOOKEEPER-github-pr-build-maven/ws/zookeeper-server/target/lib/jackson-databind-2.9.10.jar>
[INFO] Copying jackson-annotations-2.9.10.jar to <https://builds.apache.org/job/PreCommit-ZOOKEEPER-github-pr-build-maven/ws/zookeeper-server/target/lib/jackson-annotations-2.9.10.jar>
[INFO] Copying jackson-core-2.9.10.jar to <https://builds.apache.org/job/PreCommit-ZOOKEEPER-github-pr-build-maven/ws/zookeeper-server/target/lib/jackson-core-2.9.10.jar>
[INFO] Copying json-simple-1.1.1.jar to <https://builds.apache.org/job/PreCommit-ZOOKEEPER-github-pr-build-maven/ws/zookeeper-server/target/lib/json-simple-1.1.1.jar>
[INFO] Copying bcprov-jdk15on-1.60.jar to <https://builds.apache.org/job/PreCommit-ZOOKEEPER-github-pr-build-maven/ws/zookeeper-server/target/lib/bcprov-jdk15on-1.60.jar>
[INFO] Copying bcpkix-jdk15on-1.60.jar to <https://builds.apache.org/job/PreCommit-ZOOKEEPER-github-pr-build-maven/ws/zookeeper-server/target/lib/bcpkix-jdk15on-1.60.jar>
[INFO] Copying jline-2.11.jar to <https://builds.apache.org/job/PreCommit-ZOOKEEPER-github-pr-build-maven/ws/zookeeper-server/target/lib/jline-2.11.jar>
[INFO] Copying log4j-1.2.17.jar to <https://builds.apache.org/job/PreCommit-ZOOKEEPER-github-pr-build-maven/ws/zookeeper-server/target/lib/log4j-1.2.17.jar>
[INFO] Copying kerb-core-1.1.0.jar to <https://builds.apache.org/job/PreCommit-ZOOKEEPER-github-pr-build-maven/ws/zookeeper-server/target/lib/kerb-core-1.1.0.jar>
[INFO] Copying kerby-pkix-1.1.0.jar to <https://builds.apache.org/job/PreCommit-ZOOKEEPER-github-pr-build-maven/ws/zookeeper-server/target/lib/kerby-pkix-1.1.0.jar>
[INFO] Copying kerby-asn1-1.1.0.jar to <https://builds.apache.org/job/PreCommit-ZOOKEEPER-github-pr-build-maven/ws/zookeeper-server/target/lib/kerby-asn1-1.1.0.jar>
[INFO] Copying kerby-util-1.1.0.jar to <https://builds.apache.org/job/PreCommit-ZOOKEEPER-github-pr-build-maven/ws/zookeeper-server/target/lib/kerby-util-1.1.0.jar>
[INFO] Copying kerb-simplekdc-1.1.0.jar to <https://builds.apache.org/job/PreCommit-ZOOKEEPER-github-pr-build-maven/ws/zookeeper-server/target/lib/kerb-simplekdc-1.1.0.jar>
[INFO] Copying kerb-client-1.1.0.jar to <https://builds.apache.org/job/PreCommit-ZOOKEEPER-github-pr-build-maven/ws/zookeeper-server/target/lib/kerb-client-1.1.0.jar>
[INFO] Copying kerb-common-1.1.0.jar to <https://builds.apache.org/job/PreCommit-ZOOKEEPER-github-pr-build-maven/ws/zookeeper-server/target/lib/kerb-common-1.1.0.jar>
[INFO] Copying kerb-crypto-1.1.0.jar to <https://builds.apache.org/job/PreCommit-ZOOKEEPER-github-pr-build-maven/ws/zookeeper-server/target/lib/kerb-crypto-1.1.0.jar>
[INFO] Copying commons-io-2.6.jar to <https://builds.apache.org/job/PreCommit-ZOOKEEPER-github-pr-build-maven/ws/zookeeper-server/target/lib/commons-io-2.6.jar>
[INFO] Copying kerb-util-1.1.0.jar to <https://builds.apache.org/job/PreCommit-ZOOKEEPER-github-pr-build-maven/ws/zookeeper-server/target/lib/kerb-util-1.1.0.jar>
[INFO] Copying token-provider-1.1.0.jar to <https://builds.apache.org/job/PreCommit-ZOOKEEPER-github-pr-build-maven/ws/zookeeper-server/target/lib/token-provider-1.1.0.jar>
[INFO] Copying nimbus-jose-jwt-4.41.2.jar to <https://builds.apache.org/job/PreCommit-ZOOKEEPER-github-pr-build-maven/ws/zookeeper-server/target/lib/nimbus-jose-jwt-4.41.2.jar>
[INFO] Copying jcip-annotations-1.0-1.jar to <https://builds.apache.org/job/PreCommit-ZOOKEEPER-github-pr-build-maven/ws/zookeeper-server/target/lib/jcip-annotations-1.0-1.jar>
[INFO] Copying json-smart-2.3.jar to <https://builds.apache.org/job/PreCommit-ZOOKEEPER-github-pr-build-maven/ws/zookeeper-server/target/lib/json-smart-2.3.jar>
[INFO] Copying accessors-smart-1.2.jar to <https://builds.apache.org/job/PreCommit-ZOOKEEPER-github-pr-build-maven/ws/zookeeper-server/target/lib/accessors-smart-1.2.jar>
[INFO] Copying asm-5.0.4.jar to <https://builds.apache.org/job/PreCommit-ZOOKEEPER-github-pr-build-maven/ws/zookeeper-server/target/lib/asm-5.0.4.jar>
[INFO] Copying kerb-admin-1.1.0.jar to <https://builds.apache.org/job/PreCommit-ZOOKEEPER-github-pr-build-maven/ws/zookeeper-server/target/lib/kerb-admin-1.1.0.jar>
[INFO] Copying kerb-server-1.1.0.jar to <https://builds.apache.org/job/PreCommit-ZOOKEEPER-github-pr-build-maven/ws/zookeeper-server/target/lib/kerb-server-1.1.0.jar>
[INFO] Copying kerb-identity-1.1.0.jar to <https://builds.apache.org/job/PreCommit-ZOOKEEPER-github-pr-build-maven/ws/zookeeper-server/target/lib/kerb-identity-1.1.0.jar>
[INFO] Copying kerby-xdr-1.1.0.jar to <https://builds.apache.org/job/PreCommit-ZOOKEEPER-github-pr-build-maven/ws/zookeeper-server/target/lib/kerby-xdr-1.1.0.jar>
[INFO] Copying kerby-config-1.1.0.jar to <https://builds.apache.org/job/PreCommit-ZOOKEEPER-github-pr-build-maven/ws/zookeeper-server/target/lib/kerby-config-1.1.0.jar>
[INFO] Copying mockito-core-2.27.0.jar to <https://builds.apache.org/job/PreCommit-ZOOKEEPER-github-pr-build-maven/ws/zookeeper-server/target/lib/mockito-core-2.27.0.jar>
[INFO] Copying byte-buddy-1.9.10.jar to <https://builds.apache.org/job/PreCommit-ZOOKEEPER-github-pr-build-maven/ws/zookeeper-server/target/lib/byte-buddy-1.9.10.jar>
[INFO] Copying byte-buddy-agent-1.9.10.jar to <https://builds.apache.org/job/PreCommit-ZOOKEEPER-github-pr-build-maven/ws/zookeeper-server/target/lib/byte-buddy-agent-1.9.10.jar>
[INFO] Copying objenesis-2.6.jar to <https://builds.apache.org/job/PreCommit-ZOOKEEPER-github-pr-build-maven/ws/zookeeper-server/target/lib/objenesis-2.6.jar>
[INFO] Copying junit-4.12.jar to <https://builds.apache.org/job/PreCommit-ZOOKEEPER-github-pr-build-maven/ws/zookeeper-server/target/lib/junit-4.12.jar>
[INFO] Copying hamcrest-core-1.3.jar to <https://builds.apache.org/job/PreCommit-ZOOKEEPER-github-pr-build-maven/ws/zookeeper-server/target/lib/hamcrest-core-1.3.jar>
[INFO] 
[INFO] --- checksum-maven-plugin:1.8:artifacts (default) @ zookeeper ---
[INFO] zookeeper-3.5.7-SNAPSHOT.jar - SHA-512 : 0fcb79db42b46fb41bd9cb75132606e12361cc7461fc4bda52dbe4bdce340037fd9bd795e161f7e56edc2f73a7fa1b6b3ccb0e39df01436782a5541a5435286a
[INFO] zookeeper-3.5.7-SNAPSHOT-tests.jar - SHA-512 : 5f29e27d54fa434a2a1306a155ffd8c152406dd18af841a0fcacfe55a9d3b5b5b060ee1d9e166f3d3ade1e40cdf9087076940784000ff2b5c5ea6a3427d82759
[INFO] zookeeper-3.5.7-SNAPSHOT-sources.jar - SHA-512 : 9929659d929b49caaf94b6e586f2a74783e531dcf96dcfa2598487c9a93eacaf1307026d6cc8194963096fded5379b9338af1f3788eb87f483f8e9102ee59c84
[INFO] zookeeper-3.5.7-SNAPSHOT-javadoc.jar - SHA-512 : 0c2b82c3409c27019334cf2697faf32549c4b14930162a176f77784b265f519d5721a69a8923c63f748e6ad4e31e69ab8d331d68721a7619b944bb8d5cf26a71
[INFO] 
[INFO] >>> spotbugs-maven-plugin:3.1.9:check (default-cli) > :spotbugs @ zookeeper
>>>
[INFO] 
[INFO] --- spotbugs-maven-plugin:3.1.9:spotbugs (spotbugs) @ zookeeper ---
[INFO] Fork Value is true
     [java] SLF4J: No SLF4J providers were found.
     [java] SLF4J: Defaulting to no-operation (NOP) logger implementation
     [java] SLF4J: See http://www.slf4j.org/codes.html#noProviders for further details.
     [java] Warnings generated: 1
[INFO] Done SpotBugs Analysis....
[INFO] 
[INFO] <<< spotbugs-maven-plugin:3.1.9:check (default-cli) < :spotbugs @ zookeeper
<<<
[INFO] 
[INFO] 
[INFO] --- spotbugs-maven-plugin:3.1.9:check (default-cli) @ zookeeper ---
[INFO] BugInstance size is 1
[INFO] Error size is 0
[INFO] Total bugs: 1
[ERROR] org.apache.zookeeper.Login.SYSTEM_USER isn't final but should be [org.apache.zookeeper.Login]
At Login.java:[line 52] MS_SHOULD_BE_FINAL
[INFO] 


To see bug detail using the Spotbugs GUI, use the following command "mvn spotbugs:gui"



[INFO] ------------------------------------------------------------------------
[INFO] Reactor Summary for Apache ZooKeeper 3.5.7-SNAPSHOT:
[INFO] 
[INFO] Apache ZooKeeper ................................... SUCCESS [ 25.538 s]
[INFO] Apache ZooKeeper - Documentation ................... SUCCESS [ 10.455 s]
[INFO] Apache ZooKeeper - Jute ............................ SUCCESS [01:17 min]
[INFO] Apache ZooKeeper - Server .......................... FAILURE [17:41 min]
[INFO] Apache ZooKeeper - Client .......................... SKIPPED
[INFO] Apache ZooKeeper - Client - C ...................... SKIPPED
[INFO] Apache ZooKeeper - Recipes ......................... SKIPPED
[INFO] Apache ZooKeeper - Recipes - Election .............. SKIPPED
[INFO] Apache ZooKeeper - Recipes - Lock .................. SKIPPED
[INFO] Apache ZooKeeper - Recipes - Queue ................. SKIPPED
[INFO] Apache ZooKeeper - Assembly ........................ SKIPPED
[INFO] Apache ZooKeeper - Contrib ......................... SKIPPED
[INFO] Apache ZooKeeper - Contrib - Loggraph .............. SKIPPED
[INFO] Apache ZooKeeper - Contrib - Rest .................. SKIPPED
[INFO] Apache ZooKeeper - Contrib - ZooInspector .......... SKIPPED
[INFO] ------------------------------------------------------------------------
[INFO] BUILD FAILURE
[INFO] ------------------------------------------------------------------------
[INFO] Total time:  20:14 min
[INFO] Finished at: 2019-10-03T19:31:13Z
[INFO] ------------------------------------------------------------------------
Waiting for Jenkins to finish collecting data[ERROR] Failed to execute goal com.github.spotbugs:spotbugs-maven-plugin:3.1.9:check
(default-cli) on project zookeeper: failed with 1 bugs and 0 errors -> [Help 1]
[ERROR] 
[ERROR] To see the full stack trace of the errors, re-run Maven with the -e switch.
[ERROR] Re-run Maven using the -X switch to enable full debug logging.
[ERROR] 
[ERROR] For more information about the errors and possible solutions, please read the following
articles:
[ERROR] [Help 1] http://cwiki.apache.org/confluence/display/MAVEN/MojoExecutionException
[ERROR] 
[ERROR] After correcting the problems, you can resume the build with the command
[ERROR]   mvn <goals> -rf :zookeeper

[JENKINS] Archiving <https://builds.apache.org/job/PreCommit-ZOOKEEPER-github-pr-build-maven/ws/zookeeper-server/pom.xml>
to org.apache.zookeeper/zookeeper/3.5.7-SNAPSHOT/zookeeper-3.5.7-SNAPSHOT.pom
[JENKINS] Archiving <https://builds.apache.org/job/PreCommit-ZOOKEEPER-github-pr-build-maven/ws/zookeeper-server/target/zookeeper-3.5.7-SNAPSHOT.jar>
to org.apache.zookeeper/zookeeper/3.5.7-SNAPSHOT/zookeeper-3.5.7-SNAPSHOT.jar
[JENKINS] Archiving <https://builds.apache.org/job/PreCommit-ZOOKEEPER-github-pr-build-maven/ws/zookeeper-server/target/zookeeper-3.5.7-SNAPSHOT-tests.jar>
to org.apache.zookeeper/zookeeper/3.5.7-SNAPSHOT/zookeeper-3.5.7-SNAPSHOT-tests.jar
[JENKINS] Archiving <https://builds.apache.org/job/PreCommit-ZOOKEEPER-github-pr-build-maven/ws/zookeeper-server/target/zookeeper-3.5.7-SNAPSHOT-sources.jar>
to org.apache.zookeeper/zookeeper/3.5.7-SNAPSHOT/zookeeper-3.5.7-SNAPSHOT-sources.jar
[JENKINS] Archiving <https://builds.apache.org/job/PreCommit-ZOOKEEPER-github-pr-build-maven/ws/zookeeper-server/target/zookeeper-3.5.7-SNAPSHOT-javadoc.jar>
to org.apache.zookeeper/zookeeper/3.5.7-SNAPSHOT/zookeeper-3.5.7-SNAPSHOT-javadoc.jar
[JENKINS] Archiving <https://builds.apache.org/job/PreCommit-ZOOKEEPER-github-pr-build-maven/ws/zookeeper-contrib/zookeeper-contrib-loggraph/pom.xml>
to org.apache.zookeeper/zookeeper-contrib-loggraph/3.5.7-SNAPSHOT/zookeeper-contrib-loggraph-3.5.7-SNAPSHOT.pom
[JENKINS] Archiving <https://builds.apache.org/job/PreCommit-ZOOKEEPER-github-pr-build-maven/ws/zookeeper-recipes/zookeeper-recipes-election/pom.xml>
to org.apache.zookeeper/zookeeper-recipes-election/3.5.7-SNAPSHOT/zookeeper-recipes-election-3.5.7-SNAPSHOT.pom
[JENKINS] Archiving <https://builds.apache.org/job/PreCommit-ZOOKEEPER-github-pr-build-maven/ws/pom.xml>
to org.apache.zookeeper/parent/3.5.7-SNAPSHOT/parent-3.5.7-SNAPSHOT.pom
[JENKINS] Archiving <https://builds.apache.org/job/PreCommit-ZOOKEEPER-github-pr-build-maven/ws/zookeeper-recipes/zookeeper-recipes-lock/pom.xml>
to org.apache.zookeeper/zookeeper-recipes-lock/3.5.7-SNAPSHOT/zookeeper-recipes-lock-3.5.7-SNAPSHOT.pom
[JENKINS] Archiving <https://builds.apache.org/job/PreCommit-ZOOKEEPER-github-pr-build-maven/ws/zookeeper-contrib/pom.xml>
to org.apache.zookeeper/zookeeper-contrib/3.5.7-SNAPSHOT/zookeeper-contrib-3.5.7-SNAPSHOT.pom
[JENKINS] Archiving <https://builds.apache.org/job/PreCommit-ZOOKEEPER-github-pr-build-maven/ws/zookeeper-client/pom.xml>
to org.apache.zookeeper/zookeeper-client/3.5.7-SNAPSHOT/zookeeper-client-3.5.7-SNAPSHOT.pom
[JENKINS] Archiving <https://builds.apache.org/job/PreCommit-ZOOKEEPER-github-pr-build-maven/ws/zookeeper-jute/pom.xml>
to org.apache.zookeeper/zookeeper-jute/3.5.7-SNAPSHOT/zookeeper-jute-3.5.7-SNAPSHOT.pom
[JENKINS] Archiving <https://builds.apache.org/job/PreCommit-ZOOKEEPER-github-pr-build-maven/ws/zookeeper-jute/target/zookeeper-jute-3.5.7-SNAPSHOT.jar>
to org.apache.zookeeper/zookeeper-jute/3.5.7-SNAPSHOT/zookeeper-jute-3.5.7-SNAPSHOT.jar
[JENKINS] Archiving <https://builds.apache.org/job/PreCommit-ZOOKEEPER-github-pr-build-maven/ws/zookeeper-jute/target/zookeeper-jute-3.5.7-SNAPSHOT-tests.jar>
to org.apache.zookeeper/zookeeper-jute/3.5.7-SNAPSHOT/zookeeper-jute-3.5.7-SNAPSHOT-tests.jar
[JENKINS] Archiving <https://builds.apache.org/job/PreCommit-ZOOKEEPER-github-pr-build-maven/ws/zookeeper-jute/target/zookeeper-jute-3.5.7-SNAPSHOT-sources.jar>
to org.apache.zookeeper/zookeeper-jute/3.5.7-SNAPSHOT/zookeeper-jute-3.5.7-SNAPSHOT-sources.jar
[JENKINS] Archiving <https://builds.apache.org/job/PreCommit-ZOOKEEPER-github-pr-build-maven/ws/zookeeper-jute/target/zookeeper-jute-3.5.7-SNAPSHOT-javadoc.jar>
to org.apache.zookeeper/zookeeper-jute/3.5.7-SNAPSHOT/zookeeper-jute-3.5.7-SNAPSHOT-javadoc.jar
[JENKINS] Archiving <https://builds.apache.org/job/PreCommit-ZOOKEEPER-github-pr-build-maven/ws/zookeeper-recipes/zookeeper-recipes-queue/pom.xml>
to org.apache.zookeeper/zookeeper-recipes-queue/3.5.7-SNAPSHOT/zookeeper-recipes-queue-3.5.7-SNAPSHOT.pom
[JENKINS] Archiving <https://builds.apache.org/job/PreCommit-ZOOKEEPER-github-pr-build-maven/ws/zookeeper-docs/pom.xml>
to org.apache.zookeeper/zookeeper-docs/3.5.7-SNAPSHOT/zookeeper-docs-3.5.7-SNAPSHOT.pom
[JENKINS] Archiving <https://builds.apache.org/job/PreCommit-ZOOKEEPER-github-pr-build-maven/ws/zookeeper-docs/target/zookeeper-docs-3.5.7-SNAPSHOT.jar>
to org.apache.zookeeper/zookeeper-docs/3.5.7-SNAPSHOT/zookeeper-docs-3.5.7-SNAPSHOT.jar
[JENKINS] Archiving <https://builds.apache.org/job/PreCommit-ZOOKEEPER-github-pr-build-maven/ws/zookeeper-docs/target/zookeeper-docs-3.5.7-SNAPSHOT-tests.jar>
to org.apache.zookeeper/zookeeper-docs/3.5.7-SNAPSHOT/zookeeper-docs-3.5.7-SNAPSHOT-tests.jar
[JENKINS] Archiving <https://builds.apache.org/job/PreCommit-ZOOKEEPER-github-pr-build-maven/ws/zookeeper-docs/target/zookeeper-docs-3.5.7-SNAPSHOT-sources.jar>
to org.apache.zookeeper/zookeeper-docs/3.5.7-SNAPSHOT/zookeeper-docs-3.5.7-SNAPSHOT-sources.jar
[JENKINS] Archiving <https://builds.apache.org/job/PreCommit-ZOOKEEPER-github-pr-build-maven/ws/zookeeper-recipes/pom.xml>
to org.apache.zookeeper/zookeeper-recipes/3.5.7-SNAPSHOT/zookeeper-recipes-3.5.7-SNAPSHOT.pom
[JENKINS] Archiving <https://builds.apache.org/job/PreCommit-ZOOKEEPER-github-pr-build-maven/ws/zookeeper-client/zookeeper-client-c/pom.xml>
to org.apache.zookeeper/zookeeper-client-c/3.5.7-SNAPSHOT/zookeeper-client-c-3.5.7-SNAPSHOT.pom
[JENKINS] Archiving <https://builds.apache.org/job/PreCommit-ZOOKEEPER-github-pr-build-maven/ws/zookeeper-contrib/zookeeper-contrib-rest/pom.xml>
to org.apache.zookeeper/zookeeper-contrib-rest/3.5.7-SNAPSHOT/zookeeper-contrib-rest-3.5.7-SNAPSHOT.pom
[JENKINS] Archiving <https://builds.apache.org/job/PreCommit-ZOOKEEPER-github-pr-build-maven/ws/zookeeper-assembly/pom.xml>
to org.apache.zookeeper/zookeeper-assembly/3.5.7-SNAPSHOT/zookeeper-assembly-3.5.7-SNAPSHOT.pom
[JENKINS] Archiving <https://builds.apache.org/job/PreCommit-ZOOKEEPER-github-pr-build-maven/ws/zookeeper-contrib/zookeeper-contrib-zooinspector/pom.xml>
to org.apache.zookeeper/zookeeper-contrib-zooinspector/3.5.7-SNAPSHOT/zookeeper-contrib-zooinspector-3.5.7-SNAPSHOT.pom
channel stopped
[SpotBugs] Skipping execution of recorder since overall result is 'FAILURE'
Setting status of ba3a447dd82855e76c5eb1cee11c9ef5dac46061 to FAILURE with url https://builds.apache.org/job/PreCommit-ZOOKEEPER-github-pr-build-maven/1396/
and message: 'FAILURE
 '
Using context: JenkinsMaven

Mime
View raw message