zookeeper-dev mailing list archives

Site index · List index
Message view « Date » · « Thread »
Top « Date » · « Thread »
From Apache Jenkins Server <jenk...@builds.apache.org>
Subject Build failed in Jenkins: zookeeper-master-maven-owasp #185
Date Sat, 12 Oct 2019 09:36:37 GMT
See <https://builds.apache.org/job/zookeeper-master-maven-owasp/185/display/redirect>

Changes:


------------------------------------------
[...truncated 252.44 KB...]
Generating <https://builds.apache.org/job/zookeeper-master-maven-owasp/ws/zookeeper-server/target/apidocs/org/apache/zookeeper/admin/package-use.html...>
Generating <https://builds.apache.org/job/zookeeper-master-maven-owasp/ws/zookeeper-server/target/apidocs/org/apache/zookeeper/cli/package-use.html...>
Generating <https://builds.apache.org/job/zookeeper-master-maven-owasp/ws/zookeeper-server/target/apidocs/org/apache/zookeeper/client/package-use.html...>
Generating <https://builds.apache.org/job/zookeeper-master-maven-owasp/ws/zookeeper-server/target/apidocs/org/apache/zookeeper/common/package-use.html...>
Generating <https://builds.apache.org/job/zookeeper-master-maven-owasp/ws/zookeeper-server/target/apidocs/org/apache/zookeeper/jmx/package-use.html...>
Generating <https://builds.apache.org/job/zookeeper-master-maven-owasp/ws/zookeeper-server/target/apidocs/org/apache/zookeeper/metrics/package-use.html...>
Generating <https://builds.apache.org/job/zookeeper-master-maven-owasp/ws/zookeeper-server/target/apidocs/org/apache/zookeeper/metrics/impl/package-use.html...>
Generating <https://builds.apache.org/job/zookeeper-master-maven-owasp/ws/zookeeper-server/target/apidocs/org/apache/zookeeper/server/package-use.html...>
Generating <https://builds.apache.org/job/zookeeper-master-maven-owasp/ws/zookeeper-server/target/apidocs/org/apache/zookeeper/server/admin/package-use.html...>
Generating <https://builds.apache.org/job/zookeeper-master-maven-owasp/ws/zookeeper-server/target/apidocs/org/apache/zookeeper/server/auth/package-use.html...>
Generating <https://builds.apache.org/job/zookeeper-master-maven-owasp/ws/zookeeper-server/target/apidocs/org/apache/zookeeper/server/command/package-use.html...>
Generating <https://builds.apache.org/job/zookeeper-master-maven-owasp/ws/zookeeper-server/target/apidocs/org/apache/zookeeper/server/metric/package-use.html...>
Generating <https://builds.apache.org/job/zookeeper-master-maven-owasp/ws/zookeeper-server/target/apidocs/org/apache/zookeeper/server/persistence/package-use.html...>
Generating <https://builds.apache.org/job/zookeeper-master-maven-owasp/ws/zookeeper-server/target/apidocs/org/apache/zookeeper/server/quorum/package-use.html...>
Generating <https://builds.apache.org/job/zookeeper-master-maven-owasp/ws/zookeeper-server/target/apidocs/org/apache/zookeeper/server/quorum/auth/package-use.html...>
Generating <https://builds.apache.org/job/zookeeper-master-maven-owasp/ws/zookeeper-server/target/apidocs/org/apache/zookeeper/server/quorum/flexible/package-use.html...>
Generating <https://builds.apache.org/job/zookeeper-master-maven-owasp/ws/zookeeper-server/target/apidocs/org/apache/zookeeper/server/util/package-use.html...>
Generating <https://builds.apache.org/job/zookeeper-master-maven-owasp/ws/zookeeper-server/target/apidocs/org/apache/zookeeper/server/watch/package-use.html...>
Generating <https://builds.apache.org/job/zookeeper-master-maven-owasp/ws/zookeeper-server/target/apidocs/org/apache/zookeeper/util/package-use.html...>
Generating <https://builds.apache.org/job/zookeeper-master-maven-owasp/ws/zookeeper-server/target/apidocs/org/apache/zookeeper/version/package-use.html...>
Generating <https://builds.apache.org/job/zookeeper-master-maven-owasp/ws/zookeeper-server/target/apidocs/org/apache/zookeeper/version/util/package-use.html...>
Building index for all the packages and classes...
Generating <https://builds.apache.org/job/zookeeper-master-maven-owasp/ws/zookeeper-server/target/apidocs/overview-tree.html...>
Generating <https://builds.apache.org/job/zookeeper-master-maven-owasp/ws/zookeeper-server/target/apidocs/index-all.html...>
Generating <https://builds.apache.org/job/zookeeper-master-maven-owasp/ws/zookeeper-server/target/apidocs/deprecated-list.html...>
Building index for all classes...
Generating <https://builds.apache.org/job/zookeeper-master-maven-owasp/ws/zookeeper-server/target/apidocs/allclasses-frame.html...>
Generating <https://builds.apache.org/job/zookeeper-master-maven-owasp/ws/zookeeper-server/target/apidocs/allclasses-noframe.html...>
Generating <https://builds.apache.org/job/zookeeper-master-maven-owasp/ws/zookeeper-server/target/apidocs/index.html...>
Generating <https://builds.apache.org/job/zookeeper-master-maven-owasp/ws/zookeeper-server/target/apidocs/overview-summary.html...>
Generating <https://builds.apache.org/job/zookeeper-master-maven-owasp/ws/zookeeper-server/target/apidocs/help-doc.html...>
46 warnings
[WARNING] Javadoc Warnings
[WARNING] <https://builds.apache.org/job/zookeeper-master-maven-owasp/ws/zookeeper-server/src/main/java/org/apache/zookeeper/server/ZKDatabase.java>:509:
warning - @return tag has no arguments.
[WARNING] <https://builds.apache.org/job/zookeeper-master-maven-owasp/ws/zookeeper-server/src/main/java/org/apache/zookeeper/server/persistence/FileTxnLog.java>:310:
warning - @return tag has no arguments.
[WARNING] <https://builds.apache.org/job/zookeeper-master-maven-owasp/ws/zookeeper-server/src/main/java/org/apache/zookeeper/server/persistence/FileTxnSnapLog.java>:535:
warning - @return tag has no arguments.
[WARNING] <https://builds.apache.org/job/zookeeper-master-maven-owasp/ws/zookeeper-server/src/main/java/org/apache/zookeeper/server/persistence/SnapStream.java>:213:
warning - @return tag has no arguments.
[WARNING] <https://builds.apache.org/job/zookeeper-master-maven-owasp/ws/zookeeper-server/src/main/java/org/apache/zookeeper/server/persistence/Util.java>:255:
warning - @return tag has no arguments.
[WARNING] <https://builds.apache.org/job/zookeeper-master-maven-owasp/ws/zookeeper-server/src/main/java/org/apache/zookeeper/server/persistence/Util.java>:265:
warning - @return tag has no arguments.
[WARNING] <https://builds.apache.org/job/zookeeper-master-maven-owasp/ws/zookeeper-server/src/main/java/org/apache/zookeeper/server/quorum/Learner.java>:84:
warning - @return tag has no arguments.
[WARNING] <https://builds.apache.org/job/zookeeper-master-maven-owasp/ws/zookeeper-server/src/main/java/org/apache/zookeeper/server/quorum/Leader.java>:1128:
warning - @return tag has no arguments.
[WARNING] <https://builds.apache.org/job/zookeeper-master-maven-owasp/ws/zookeeper-server/src/main/java/org/apache/zookeeper/server/quorum/LearnerMaster.java>:131:
warning - @return tag has no arguments.
[WARNING] <https://builds.apache.org/job/zookeeper-master-maven-owasp/ws/zookeeper-server/src/main/java/org/apache/zookeeper/server/quorum/Leader.java>:256:
warning - @param argument "qv," is not a parameter name.
[WARNING] <https://builds.apache.org/job/zookeeper-master-maven-owasp/ws/zookeeper-server/src/main/java/org/apache/zookeeper/server/quorum/Leader.java>:904:
warning - @param argument "zxid," is not a parameter name.
[WARNING] <https://builds.apache.org/job/zookeeper-master-maven-owasp/ws/zookeeper-server/src/main/java/org/apache/zookeeper/server/quorum/Leader.java>:904:
warning - @param argument "sid," is not a parameter name.
[WARNING] <https://builds.apache.org/job/zookeeper-master-maven-owasp/ws/zookeeper-server/src/main/java/org/apache/zookeeper/server/quorum/LearnerHandler.java>:1151:
warning - @return tag has no arguments.
[WARNING] <https://builds.apache.org/job/zookeeper-master-maven-owasp/ws/zookeeper-server/src/main/java/org/apache/zookeeper/server/quorum/QuorumPeer.java>:1889:
warning - @return tag has no arguments.
[WARNING] <https://builds.apache.org/job/zookeeper-master-maven-owasp/ws/zookeeper-server/src/main/java/org/apache/zookeeper/server/util/CircularBuffer.java>:70:
warning - @return tag has no arguments.
[WARNING] <https://builds.apache.org/job/zookeeper-master-maven-owasp/ws/zookeeper-server/src/main/java/org/apache/zookeeper/AsyncCallback.java>:340:
warning - Tag @see: can't find getEphemerals(EphemeralsCallback, Object) in org.apache.zookeeper.ZooKeeper
[WARNING] <https://builds.apache.org/job/zookeeper-master-maven-owasp/ws/zookeeper-server/src/main/java/org/apache/zookeeper/AsyncCallback.java>:340:
warning - Tag @see: can't find getEphemerals(String, EphemeralsCallback, Object) in org.apache.zookeeper.ZooKeeper
[WARNING] <https://builds.apache.org/job/zookeeper-master-maven-owasp/ws/zookeeper-server/src/main/java/org/apache/zookeeper/AsyncCallback.java>:271:
warning - Tag @link: can't find sync(String, VoidCallback, Object) in org.apache.zookeeper.ZooKeeper
[WARNING] <https://builds.apache.org/job/zookeeper-master-maven-owasp/ws/zookeeper-server/src/main/java/org/apache/zookeeper/AsyncCallback.java>:150:
warning - Tag @see: can't find getACL(String, Stat, ACLCallback, Object) in org.apache.zookeeper.ZooKeeper
[WARNING] <https://builds.apache.org/job/zookeeper-master-maven-owasp/ws/zookeeper-server/src/main/java/org/apache/zookeeper/AsyncCallback.java>:89:
warning - Tag @see: can't find getAllChildrenNumber(String, AllChildrenNumberCallback, Object)
in org.apache.zookeeper.ZooKeeper
[WARNING] <https://builds.apache.org/job/zookeeper-master-maven-owasp/ws/zookeeper-server/src/main/java/org/apache/zookeeper/AsyncCallback.java>:202:
warning - Tag @see: can't find getChildren(String, boolean, Children2Callback, Object) in
org.apache.zookeeper.ZooKeeper
[WARNING] <https://builds.apache.org/job/zookeeper-master-maven-owasp/ws/zookeeper-server/src/main/java/org/apache/zookeeper/AsyncCallback.java>:202:
warning - Tag @see: can't find getChildren(String, Watcher, Children2Callback, Object) in
org.apache.zookeeper.ZooKeeper
[WARNING] <https://builds.apache.org/job/zookeeper-master-maven-owasp/ws/zookeeper-server/src/main/java/org/apache/zookeeper/AsyncCallback.java>:179:
warning - Tag @see: can't find getChildren(String, boolean, ChildrenCallback, Object) in org.apache.zookeeper.ZooKeeper
[WARNING] <https://builds.apache.org/job/zookeeper-master-maven-owasp/ws/zookeeper-server/src/main/java/org/apache/zookeeper/AsyncCallback.java>:179:
warning - Tag @see: can't find getChildren(String, Watcher, ChildrenCallback, Object) in org.apache.zookeeper.ZooKeeper
[WARNING] <https://builds.apache.org/job/zookeeper-master-maven-owasp/ws/zookeeper-server/src/main/java/org/apache/zookeeper/AsyncCallback.java>:227:
warning - Tag @see: can't find create(String, byte[], List, CreateMode, Create2Callback, Object)
in org.apache.zookeeper.ZooKeeper
[WARNING] <https://builds.apache.org/job/zookeeper-master-maven-owasp/ws/zookeeper-server/src/main/java/org/apache/zookeeper/AsyncCallback.java>:227:
warning - Tag @see: can't find create(String, byte[], List, CreateMode, Create2Callback, Object,
long) in org.apache.zookeeper.ZooKeeper
[WARNING] <https://builds.apache.org/job/zookeeper-master-maven-owasp/ws/zookeeper-server/src/main/java/org/apache/zookeeper/AsyncCallback.java>:121:
warning - Tag @see: can't find getData(String, boolean, DataCallback, Object) in org.apache.zookeeper.ZooKeeper
[WARNING] <https://builds.apache.org/job/zookeeper-master-maven-owasp/ws/zookeeper-server/src/main/java/org/apache/zookeeper/AsyncCallback.java>:121:
warning - Tag @see: can't find getData(String, Watcher, DataCallback, Object) in org.apache.zookeeper.ZooKeeper
[WARNING] <https://builds.apache.org/job/zookeeper-master-maven-owasp/ws/zookeeper-server/src/main/java/org/apache/zookeeper/AsyncCallback.java>:121:
warning - Tag @see: can't find getConfig(boolean, DataCallback, Object) in org.apache.zookeeper.ZooKeeper
[WARNING] <https://builds.apache.org/job/zookeeper-master-maven-owasp/ws/zookeeper-server/src/main/java/org/apache/zookeeper/AsyncCallback.java>:121:
warning - Tag @see: can't find getConfig(Watcher, DataCallback, Object) in org.apache.zookeeper.ZooKeeper
[WARNING] <https://builds.apache.org/job/zookeeper-master-maven-owasp/ws/zookeeper-server/src/main/java/org/apache/zookeeper/AsyncCallback.java>:328:
warning - Tag @see: can't find multi(Iterable, MultiCallback, Object) in org.apache.zookeeper.ZooKeeper
[WARNING] <https://builds.apache.org/job/zookeeper-master-maven-owasp/ws/zookeeper-server/src/main/java/org/apache/zookeeper/AsyncCallback.java>:70:
warning - Tag @see: can't find exists(String, boolean, StatCallback, Object) in org.apache.zookeeper.ZooKeeper
[WARNING] <https://builds.apache.org/job/zookeeper-master-maven-owasp/ws/zookeeper-server/src/main/java/org/apache/zookeeper/AsyncCallback.java>:70:
warning - Tag @see: can't find exists(String, Watcher, StatCallback, Object) in org.apache.zookeeper.ZooKeeper
[WARNING] <https://builds.apache.org/job/zookeeper-master-maven-owasp/ws/zookeeper-server/src/main/java/org/apache/zookeeper/AsyncCallback.java>:70:
warning - Tag @see: can't find setData(String, byte[], int, StatCallback, Object) in org.apache.zookeeper.ZooKeeper
[WARNING] <https://builds.apache.org/job/zookeeper-master-maven-owasp/ws/zookeeper-server/src/main/java/org/apache/zookeeper/AsyncCallback.java>:70:
warning - Tag @see: can't find setACL(String, List, int, StatCallback, Object) in org.apache.zookeeper.ZooKeeper
[WARNING] <https://builds.apache.org/job/zookeeper-master-maven-owasp/ws/zookeeper-server/src/main/java/org/apache/zookeeper/AsyncCallback.java>:262:
warning - Tag @see: can't find create(String, byte[], List, CreateMode, StringCallback, Object)
in org.apache.zookeeper.ZooKeeper
[WARNING] <https://builds.apache.org/job/zookeeper-master-maven-owasp/ws/zookeeper-server/src/main/java/org/apache/zookeeper/AsyncCallback.java>:299:
warning - Tag @see: can't find delete(String, int, VoidCallback, Object) in org.apache.zookeeper.ZooKeeper
[WARNING] <https://builds.apache.org/job/zookeeper-master-maven-owasp/ws/zookeeper-server/src/main/java/org/apache/zookeeper/AsyncCallback.java>:299:
warning - Tag @see: can't find removeAllWatches(String, Watcher.WatcherType, boolean, VoidCallback,
Object) in org.apache.zookeeper.ZooKeeper
[WARNING] <https://builds.apache.org/job/zookeeper-master-maven-owasp/ws/zookeeper-server/src/main/java/org/apache/zookeeper/AsyncCallback.java>:299:
warning - Tag @see: can't find removeWatches(String, Watcher, Watcher.WatcherType, boolean,
VoidCallback, Object) in org.apache.zookeeper.ZooKeeper
[WARNING] <https://builds.apache.org/job/zookeeper-master-maven-owasp/ws/zookeeper-server/src/main/java/org/apache/zookeeper/AsyncCallback.java>:299:
warning - Tag @see: can't find sync(String, VoidCallback, Object) in org.apache.zookeeper.ZooKeeper
[WARNING] <https://builds.apache.org/job/zookeeper-master-maven-owasp/ws/zookeeper-server/src/main/java/org/apache/zookeeper/AsyncCallback.java>:299:
warning - Tag @link: can't find delete(String, int, VoidCallback, Object) in org.apache.zookeeper.ZooKeeper
[WARNING] <https://builds.apache.org/job/zookeeper-master-maven-owasp/ws/zookeeper-server/src/main/java/org/apache/zookeeper/cli/AclParser.java>:37:
warning - @return tag has no arguments.
[WARNING] <https://builds.apache.org/job/zookeeper-master-maven-owasp/ws/zookeeper-server/src/main/java/org/apache/zookeeper/cli/CliCommand.java>:77:
warning - @return tag has no arguments.
[WARNING] <https://builds.apache.org/job/zookeeper-master-maven-owasp/ws/zookeeper-server/src/main/java/org/apache/zookeeper/cli/CliCommand.java>:85:
warning - @return tag has no arguments.
[WARNING] <https://builds.apache.org/job/zookeeper-master-maven-owasp/ws/zookeeper-server/src/main/java/org/apache/zookeeper/cli/CliCommand.java>:93:
warning - @return tag has no arguments.
[WARNING] <https://builds.apache.org/job/zookeeper-master-maven-owasp/ws/zookeeper-server/src/main/java/org/apache/zookeeper/cli/CliCommand.java>:118:
warning - @return tag has no arguments.
[INFO] Building jar: <https://builds.apache.org/job/zookeeper-master-maven-owasp/ws/zookeeper-server/target/zookeeper-3.6.0-SNAPSHOT-javadoc.jar>
[INFO] 
[INFO] --- maven-dependency-plugin:3.1.1:copy-dependencies (copy-dependencies) @ zookeeper
---
[INFO] Copying spotbugs-annotations-3.1.9.jar to <https://builds.apache.org/job/zookeeper-master-maven-owasp/ws/zookeeper-server/target/lib/spotbugs-annotations-3.1.9.jar>
[INFO] Copying jsr305-3.0.2.jar to <https://builds.apache.org/job/zookeeper-master-maven-owasp/ws/zookeeper-server/target/lib/jsr305-3.0.2.jar>
[INFO] Copying hamcrest-all-1.3.jar to <https://builds.apache.org/job/zookeeper-master-maven-owasp/ws/zookeeper-server/target/lib/hamcrest-all-1.3.jar>
[INFO] Copying commons-collections-3.2.2.jar to <https://builds.apache.org/job/zookeeper-master-maven-owasp/ws/zookeeper-server/target/lib/commons-collections-3.2.2.jar>
[INFO] Copying commons-lang-2.6.jar to <https://builds.apache.org/job/zookeeper-master-maven-owasp/ws/zookeeper-server/target/lib/commons-lang-2.6.jar>
[INFO] Copying zookeeper-jute-3.6.0-SNAPSHOT.jar to <https://builds.apache.org/job/zookeeper-master-maven-owasp/ws/zookeeper-server/target/lib/zookeeper-jute-3.6.0-SNAPSHOT.jar>
[INFO] Copying commons-cli-1.2.jar to <https://builds.apache.org/job/zookeeper-master-maven-owasp/ws/zookeeper-server/target/lib/commons-cli-1.2.jar>
[INFO] Copying audience-annotations-0.5.0.jar to <https://builds.apache.org/job/zookeeper-master-maven-owasp/ws/zookeeper-server/target/lib/audience-annotations-0.5.0.jar>
[INFO] Copying netty-handler-4.1.42.Final.jar to <https://builds.apache.org/job/zookeeper-master-maven-owasp/ws/zookeeper-server/target/lib/netty-handler-4.1.42.Final.jar>
[INFO] Copying netty-common-4.1.42.Final.jar to <https://builds.apache.org/job/zookeeper-master-maven-owasp/ws/zookeeper-server/target/lib/netty-common-4.1.42.Final.jar>
[INFO] Copying netty-buffer-4.1.42.Final.jar to <https://builds.apache.org/job/zookeeper-master-maven-owasp/ws/zookeeper-server/target/lib/netty-buffer-4.1.42.Final.jar>
[INFO] Copying netty-transport-4.1.42.Final.jar to <https://builds.apache.org/job/zookeeper-master-maven-owasp/ws/zookeeper-server/target/lib/netty-transport-4.1.42.Final.jar>
[INFO] Copying netty-resolver-4.1.42.Final.jar to <https://builds.apache.org/job/zookeeper-master-maven-owasp/ws/zookeeper-server/target/lib/netty-resolver-4.1.42.Final.jar>
[INFO] Copying netty-codec-4.1.42.Final.jar to <https://builds.apache.org/job/zookeeper-master-maven-owasp/ws/zookeeper-server/target/lib/netty-codec-4.1.42.Final.jar>
[INFO] Copying netty-transport-native-epoll-4.1.42.Final.jar to <https://builds.apache.org/job/zookeeper-master-maven-owasp/ws/zookeeper-server/target/lib/netty-transport-native-epoll-4.1.42.Final.jar>
[INFO] Copying netty-transport-native-unix-common-4.1.42.Final.jar to <https://builds.apache.org/job/zookeeper-master-maven-owasp/ws/zookeeper-server/target/lib/netty-transport-native-unix-common-4.1.42.Final.jar>
[INFO] Copying slf4j-api-1.7.25.jar to <https://builds.apache.org/job/zookeeper-master-maven-owasp/ws/zookeeper-server/target/lib/slf4j-api-1.7.25.jar>
[INFO] Copying slf4j-log4j12-1.7.25.jar to <https://builds.apache.org/job/zookeeper-master-maven-owasp/ws/zookeeper-server/target/lib/slf4j-log4j12-1.7.25.jar>
[INFO] Copying jetty-server-9.4.18.v20190429.jar to <https://builds.apache.org/job/zookeeper-master-maven-owasp/ws/zookeeper-server/target/lib/jetty-server-9.4.18.v20190429.jar>
[INFO] Copying javax.servlet-api-3.1.0.jar to <https://builds.apache.org/job/zookeeper-master-maven-owasp/ws/zookeeper-server/target/lib/javax.servlet-api-3.1.0.jar>
[INFO] Copying jetty-http-9.4.18.v20190429.jar to <https://builds.apache.org/job/zookeeper-master-maven-owasp/ws/zookeeper-server/target/lib/jetty-http-9.4.18.v20190429.jar>
[INFO] Copying jetty-util-9.4.18.v20190429.jar to <https://builds.apache.org/job/zookeeper-master-maven-owasp/ws/zookeeper-server/target/lib/jetty-util-9.4.18.v20190429.jar>
[INFO] Copying jetty-io-9.4.18.v20190429.jar to <https://builds.apache.org/job/zookeeper-master-maven-owasp/ws/zookeeper-server/target/lib/jetty-io-9.4.18.v20190429.jar>
[INFO] Copying jetty-servlet-9.4.18.v20190429.jar to <https://builds.apache.org/job/zookeeper-master-maven-owasp/ws/zookeeper-server/target/lib/jetty-servlet-9.4.18.v20190429.jar>
[INFO] Copying jetty-security-9.4.18.v20190429.jar to <https://builds.apache.org/job/zookeeper-master-maven-owasp/ws/zookeeper-server/target/lib/jetty-security-9.4.18.v20190429.jar>
[INFO] Copying jackson-databind-2.9.10.jar to <https://builds.apache.org/job/zookeeper-master-maven-owasp/ws/zookeeper-server/target/lib/jackson-databind-2.9.10.jar>
[INFO] Copying jackson-annotations-2.9.10.jar to <https://builds.apache.org/job/zookeeper-master-maven-owasp/ws/zookeeper-server/target/lib/jackson-annotations-2.9.10.jar>
[INFO] Copying jackson-core-2.9.10.jar to <https://builds.apache.org/job/zookeeper-master-maven-owasp/ws/zookeeper-server/target/lib/jackson-core-2.9.10.jar>
[INFO] Copying json-simple-1.1.1.jar to <https://builds.apache.org/job/zookeeper-master-maven-owasp/ws/zookeeper-server/target/lib/json-simple-1.1.1.jar>
[INFO] Copying bcprov-jdk15on-1.60.jar to <https://builds.apache.org/job/zookeeper-master-maven-owasp/ws/zookeeper-server/target/lib/bcprov-jdk15on-1.60.jar>
[INFO] Copying bcpkix-jdk15on-1.60.jar to <https://builds.apache.org/job/zookeeper-master-maven-owasp/ws/zookeeper-server/target/lib/bcpkix-jdk15on-1.60.jar>
[INFO] Copying jline-2.11.jar to <https://builds.apache.org/job/zookeeper-master-maven-owasp/ws/zookeeper-server/target/lib/jline-2.11.jar>
[INFO] Copying metrics-core-3.2.5.jar to <https://builds.apache.org/job/zookeeper-master-maven-owasp/ws/zookeeper-server/target/lib/metrics-core-3.2.5.jar>
[INFO] Copying log4j-1.2.17.jar to <https://builds.apache.org/job/zookeeper-master-maven-owasp/ws/zookeeper-server/target/lib/log4j-1.2.17.jar>
[INFO] Copying kerb-core-1.1.0.jar to <https://builds.apache.org/job/zookeeper-master-maven-owasp/ws/zookeeper-server/target/lib/kerb-core-1.1.0.jar>
[INFO] Copying kerby-pkix-1.1.0.jar to <https://builds.apache.org/job/zookeeper-master-maven-owasp/ws/zookeeper-server/target/lib/kerby-pkix-1.1.0.jar>
[INFO] Copying kerby-asn1-1.1.0.jar to <https://builds.apache.org/job/zookeeper-master-maven-owasp/ws/zookeeper-server/target/lib/kerby-asn1-1.1.0.jar>
[INFO] Copying kerby-util-1.1.0.jar to <https://builds.apache.org/job/zookeeper-master-maven-owasp/ws/zookeeper-server/target/lib/kerby-util-1.1.0.jar>
[INFO] Copying kerb-simplekdc-1.1.0.jar to <https://builds.apache.org/job/zookeeper-master-maven-owasp/ws/zookeeper-server/target/lib/kerb-simplekdc-1.1.0.jar>
[INFO] Copying kerb-client-1.1.0.jar to <https://builds.apache.org/job/zookeeper-master-maven-owasp/ws/zookeeper-server/target/lib/kerb-client-1.1.0.jar>
[INFO] Copying kerb-common-1.1.0.jar to <https://builds.apache.org/job/zookeeper-master-maven-owasp/ws/zookeeper-server/target/lib/kerb-common-1.1.0.jar>
[INFO] Copying kerb-crypto-1.1.0.jar to <https://builds.apache.org/job/zookeeper-master-maven-owasp/ws/zookeeper-server/target/lib/kerb-crypto-1.1.0.jar>
[INFO] Copying commons-io-2.6.jar to <https://builds.apache.org/job/zookeeper-master-maven-owasp/ws/zookeeper-server/target/lib/commons-io-2.6.jar>
[INFO] Copying kerb-util-1.1.0.jar to <https://builds.apache.org/job/zookeeper-master-maven-owasp/ws/zookeeper-server/target/lib/kerb-util-1.1.0.jar>
[INFO] Copying token-provider-1.1.0.jar to <https://builds.apache.org/job/zookeeper-master-maven-owasp/ws/zookeeper-server/target/lib/token-provider-1.1.0.jar>
[INFO] Copying nimbus-jose-jwt-4.41.2.jar to <https://builds.apache.org/job/zookeeper-master-maven-owasp/ws/zookeeper-server/target/lib/nimbus-jose-jwt-4.41.2.jar>
[INFO] Copying jcip-annotations-1.0-1.jar to <https://builds.apache.org/job/zookeeper-master-maven-owasp/ws/zookeeper-server/target/lib/jcip-annotations-1.0-1.jar>
[INFO] Copying json-smart-2.3.jar to <https://builds.apache.org/job/zookeeper-master-maven-owasp/ws/zookeeper-server/target/lib/json-smart-2.3.jar>
[INFO] Copying accessors-smart-1.2.jar to <https://builds.apache.org/job/zookeeper-master-maven-owasp/ws/zookeeper-server/target/lib/accessors-smart-1.2.jar>
[INFO] Copying asm-5.0.4.jar to <https://builds.apache.org/job/zookeeper-master-maven-owasp/ws/zookeeper-server/target/lib/asm-5.0.4.jar>
[INFO] Copying kerb-admin-1.1.0.jar to <https://builds.apache.org/job/zookeeper-master-maven-owasp/ws/zookeeper-server/target/lib/kerb-admin-1.1.0.jar>
[INFO] Copying kerb-server-1.1.0.jar to <https://builds.apache.org/job/zookeeper-master-maven-owasp/ws/zookeeper-server/target/lib/kerb-server-1.1.0.jar>
[INFO] Copying kerb-identity-1.1.0.jar to <https://builds.apache.org/job/zookeeper-master-maven-owasp/ws/zookeeper-server/target/lib/kerb-identity-1.1.0.jar>
[INFO] Copying kerby-xdr-1.1.0.jar to <https://builds.apache.org/job/zookeeper-master-maven-owasp/ws/zookeeper-server/target/lib/kerby-xdr-1.1.0.jar>
[INFO] Copying kerby-config-1.1.0.jar to <https://builds.apache.org/job/zookeeper-master-maven-owasp/ws/zookeeper-server/target/lib/kerby-config-1.1.0.jar>
[INFO] Copying mockito-core-2.27.0.jar to <https://builds.apache.org/job/zookeeper-master-maven-owasp/ws/zookeeper-server/target/lib/mockito-core-2.27.0.jar>
[INFO] Copying byte-buddy-1.9.10.jar to <https://builds.apache.org/job/zookeeper-master-maven-owasp/ws/zookeeper-server/target/lib/byte-buddy-1.9.10.jar>
[INFO] Copying byte-buddy-agent-1.9.10.jar to <https://builds.apache.org/job/zookeeper-master-maven-owasp/ws/zookeeper-server/target/lib/byte-buddy-agent-1.9.10.jar>
[INFO] Copying objenesis-2.6.jar to <https://builds.apache.org/job/zookeeper-master-maven-owasp/ws/zookeeper-server/target/lib/objenesis-2.6.jar>
[INFO] Copying junit-4.12.jar to <https://builds.apache.org/job/zookeeper-master-maven-owasp/ws/zookeeper-server/target/lib/junit-4.12.jar>
[INFO] Copying hamcrest-core-1.3.jar to <https://builds.apache.org/job/zookeeper-master-maven-owasp/ws/zookeeper-server/target/lib/hamcrest-core-1.3.jar>
[INFO] Copying snappy-java-1.1.7.jar to <https://builds.apache.org/job/zookeeper-master-maven-owasp/ws/zookeeper-server/target/lib/snappy-java-1.1.7.jar>
[INFO] 
[INFO] --- dependency-check-maven:5.2.1:check (default-cli) @ zookeeper ---
[INFO] Checking for updates
[INFO] Skipping NVD check since last check was within 4 hours.
[INFO] Skipping RetireJS update since last update was within 24 hours.
[INFO] Check for updates complete (2 ms)
[INFO] 

Dependency-Check is an open source tool performing a best effort analysis of 3rd party dependencies;
false positives and false negatives may exist in the analysis performed by the tool. Use of
the tool and the reporting provided constitutes acceptance for use in an AS IS condition,
and there are NO warranties, implied or otherwise, with regard to the analysis or its use.
Any use of the tool and the reporting provided is at the user?s risk. In no event shall the
copyright holder or OWASP be held liable for any damages whatsoever arising out of or in connection
with the use of this tool, the analysis performed, or the resulting report.


[INFO] Analysis Started
[INFO] Finished Archive Analyzer (0 seconds)
[INFO] Finished File Name Analyzer (0 seconds)
[INFO] Finished Jar Analyzer (0 seconds)
[ERROR] ----------------------------------------------------
[ERROR] .NET Assembly Analyzer could not be initialized and at least one 'exe' or 'dll' was
scanned. The 'dotnet' executable could not be found on the path; either disable the Assembly
Analyzer or configure the path dotnet core.
[ERROR] ----------------------------------------------------
[INFO] Finished Dependency Merging Analyzer (0 seconds)
[INFO] Finished Version Filter Analyzer (0 seconds)
[INFO] Finished Hint Analyzer (0 seconds)
[INFO] Created CPE Index (3 seconds)
[INFO] Finished CPE Analyzer (4 seconds)
[INFO] Finished False Positive Analyzer (0 seconds)
[INFO] Finished NVD CVE Analyzer (0 seconds)
[INFO] Finished Sonatype OSS Index Analyzer (2 seconds)
[INFO] Finished Vulnerability Suppression Analyzer (0 seconds)
[INFO] Finished Dependency Bundling Analyzer (0 seconds)
[INFO] Analysis Complete (7 seconds)
[WARNING] 

One or more dependencies were identified with known vulnerabilities in Apache ZooKeeper -
Server:

jackson-databind-2.9.10.jar (pkg:maven/com.fasterxml.jackson.core/jackson-databind@2.9.10,
cpe:2.3:a:fasterxml:jackson:2.9.10:*:*:*:*:*:*:*, cpe:2.3:a:fasterxml:jackson-databind:2.9.10:*:*:*:*:*:*:*)
: CVE-2019-16942, CVE-2019-16943


See the dependency-check report for more details.


[INFO] ------------------------------------------------------------------------
[INFO] Reactor Summary for Apache ZooKeeper 3.6.0-SNAPSHOT:
[INFO] 
[INFO] Apache ZooKeeper ................................... SUCCESS [01:03 min]
[INFO] Apache ZooKeeper - Documentation ................... SUCCESS [ 11.447 s]
[INFO] Apache ZooKeeper - Jute ............................ SUCCESS [ 21.023 s]
[INFO] Apache ZooKeeper - Server .......................... FAILURE [ 43.246 s]
[INFO] Apache ZooKeeper - Metrics Providers ............... SKIPPED
[INFO] Apache ZooKeeper - Prometheus.io Metrics Provider .. SKIPPED
[INFO] Apache ZooKeeper - Client .......................... SKIPPED
[INFO] Apache ZooKeeper - Recipes ......................... SKIPPED
[INFO] Apache ZooKeeper - Recipes - Election .............. SKIPPED
[INFO] Apache ZooKeeper - Recipes - Lock .................. SKIPPED
[INFO] Apache ZooKeeper - Recipes - Queue ................. SKIPPED
[INFO] Apache ZooKeeper - Assembly ........................ SKIPPED
[INFO] ------------------------------------------------------------------------
[INFO] BUILD FAILURE
[INFO] ------------------------------------------------------------------------
[INFO] Total time:  02:51 min
[INFO] Finished at: 2019-10-12T09:36:07Z
[INFO] ------------------------------------------------------------------------
Waiting for Jenkins to finish collecting data[ERROR] Failed to execute goal org.owasp:dependency-check-maven:5.2.1:check
(default-cli) on project zookeeper:
[ERROR] 
[ERROR] One or more dependencies were identified with vulnerabilities that have a CVSS score
greater than or equal to '0.0':
[ERROR] 
[ERROR] jackson-databind-2.9.10.jar: CVE-2019-16942, CVE-2019-16943
[ERROR] 
[ERROR] See the dependency-check report for more details.
[ERROR] -> [Help 1]
[ERROR] 
[ERROR] To see the full stack trace of the errors, re-run Maven with the -e switch.
[ERROR] Re-run Maven using the -X switch to enable full debug logging.
[ERROR] 
[ERROR] For more information about the errors and possible solutions, please read the following
articles:
[ERROR] [Help 1] http://cwiki.apache.org/confluence/display/MAVEN/MojoFailureException
[ERROR] 
[ERROR] After correcting the problems, you can resume the build with the command
[ERROR]   mvn <goals> -rf :zookeeper

[JENKINS] Archiving <https://builds.apache.org/job/zookeeper-master-maven-owasp/ws/zookeeper-server/pom.xml>
to org.apache.zookeeper/zookeeper/3.6.0-SNAPSHOT/zookeeper-3.6.0-SNAPSHOT.pom
[JENKINS] Archiving <https://builds.apache.org/job/zookeeper-master-maven-owasp/ws/zookeeper-server/target/zookeeper-3.6.0-SNAPSHOT.jar>
to org.apache.zookeeper/zookeeper/3.6.0-SNAPSHOT/zookeeper-3.6.0-SNAPSHOT.jar
[JENKINS] Archiving <https://builds.apache.org/job/zookeeper-master-maven-owasp/ws/zookeeper-server/target/zookeeper-3.6.0-SNAPSHOT-tests.jar>
to org.apache.zookeeper/zookeeper/3.6.0-SNAPSHOT/zookeeper-3.6.0-SNAPSHOT-tests.jar
[JENKINS] Archiving <https://builds.apache.org/job/zookeeper-master-maven-owasp/ws/zookeeper-server/target/zookeeper-3.6.0-SNAPSHOT-sources.jar>
to org.apache.zookeeper/zookeeper/3.6.0-SNAPSHOT/zookeeper-3.6.0-SNAPSHOT-sources.jar
[JENKINS] Archiving <https://builds.apache.org/job/zookeeper-master-maven-owasp/ws/zookeeper-server/target/zookeeper-3.6.0-SNAPSHOT-javadoc.jar>
to org.apache.zookeeper/zookeeper/3.6.0-SNAPSHOT/zookeeper-3.6.0-SNAPSHOT-javadoc.jar
[JENKINS] Archiving <https://builds.apache.org/job/zookeeper-master-maven-owasp/ws/zookeeper-client/pom.xml>
to org.apache.zookeeper/zookeeper-client/3.6.0-SNAPSHOT/zookeeper-client-3.6.0-SNAPSHOT.pom
[JENKINS] Archiving <https://builds.apache.org/job/zookeeper-master-maven-owasp/ws/zookeeper-jute/pom.xml>
to org.apache.zookeeper/zookeeper-jute/3.6.0-SNAPSHOT/zookeeper-jute-3.6.0-SNAPSHOT.pom
[JENKINS] Archiving <https://builds.apache.org/job/zookeeper-master-maven-owasp/ws/zookeeper-jute/target/zookeeper-jute-3.6.0-SNAPSHOT.jar>
to org.apache.zookeeper/zookeeper-jute/3.6.0-SNAPSHOT/zookeeper-jute-3.6.0-SNAPSHOT.jar
[JENKINS] Archiving <https://builds.apache.org/job/zookeeper-master-maven-owasp/ws/zookeeper-jute/target/zookeeper-jute-3.6.0-SNAPSHOT-tests.jar>
to org.apache.zookeeper/zookeeper-jute/3.6.0-SNAPSHOT/zookeeper-jute-3.6.0-SNAPSHOT-tests.jar
[JENKINS] Archiving <https://builds.apache.org/job/zookeeper-master-maven-owasp/ws/zookeeper-jute/target/zookeeper-jute-3.6.0-SNAPSHOT-sources.jar>
to org.apache.zookeeper/zookeeper-jute/3.6.0-SNAPSHOT/zookeeper-jute-3.6.0-SNAPSHOT-sources.jar
[JENKINS] Archiving <https://builds.apache.org/job/zookeeper-master-maven-owasp/ws/zookeeper-jute/target/zookeeper-jute-3.6.0-SNAPSHOT-javadoc.jar>
to org.apache.zookeeper/zookeeper-jute/3.6.0-SNAPSHOT/zookeeper-jute-3.6.0-SNAPSHOT-javadoc.jar
[JENKINS] Archiving <https://builds.apache.org/job/zookeeper-master-maven-owasp/ws/zookeeper-metrics-providers/pom.xml>
to org.apache.zookeeper/zookeeper-metrics-providers/3.6.0-SNAPSHOT/zookeeper-metrics-providers-3.6.0-SNAPSHOT.pom
[JENKINS] Archiving <https://builds.apache.org/job/zookeeper-master-maven-owasp/ws/zookeeper-metrics-providers/zookeeper-prometheus-metrics/pom.xml>
to org.apache.zookeeper/zookeeper-prometheus-metrics/3.6.0-SNAPSHOT/zookeeper-prometheus-metrics-3.6.0-SNAPSHOT.pom
[JENKINS] Archiving <https://builds.apache.org/job/zookeeper-master-maven-owasp/ws/zookeeper-recipes/zookeeper-recipes-election/pom.xml>
to org.apache.zookeeper/zookeeper-recipes-election/3.6.0-SNAPSHOT/zookeeper-recipes-election-3.6.0-SNAPSHOT.pom
[JENKINS] Archiving <https://builds.apache.org/job/zookeeper-master-maven-owasp/ws/zookeeper-recipes/zookeeper-recipes-queue/pom.xml>
to org.apache.zookeeper/zookeeper-recipes-queue/3.6.0-SNAPSHOT/zookeeper-recipes-queue-3.6.0-SNAPSHOT.pom
[JENKINS] Archiving <https://builds.apache.org/job/zookeeper-master-maven-owasp/ws/zookeeper-docs/pom.xml>
to org.apache.zookeeper/zookeeper-docs/3.6.0-SNAPSHOT/zookeeper-docs-3.6.0-SNAPSHOT.pom
[JENKINS] Archiving <https://builds.apache.org/job/zookeeper-master-maven-owasp/ws/zookeeper-docs/target/zookeeper-docs-3.6.0-SNAPSHOT.jar>
to org.apache.zookeeper/zookeeper-docs/3.6.0-SNAPSHOT/zookeeper-docs-3.6.0-SNAPSHOT.jar
[JENKINS] Archiving <https://builds.apache.org/job/zookeeper-master-maven-owasp/ws/zookeeper-docs/target/zookeeper-docs-3.6.0-SNAPSHOT-tests.jar>
to org.apache.zookeeper/zookeeper-docs/3.6.0-SNAPSHOT/zookeeper-docs-3.6.0-SNAPSHOT-tests.jar
[JENKINS] Archiving <https://builds.apache.org/job/zookeeper-master-maven-owasp/ws/zookeeper-docs/target/zookeeper-docs-3.6.0-SNAPSHOT-sources.jar>
to org.apache.zookeeper/zookeeper-docs/3.6.0-SNAPSHOT/zookeeper-docs-3.6.0-SNAPSHOT-sources.jar
[JENKINS] Archiving <https://builds.apache.org/job/zookeeper-master-maven-owasp/ws/zookeeper-recipes/pom.xml>
to org.apache.zookeeper/zookeeper-recipes/3.6.0-SNAPSHOT/zookeeper-recipes-3.6.0-SNAPSHOT.pom
[JENKINS] Archiving <https://builds.apache.org/job/zookeeper-master-maven-owasp/ws/pom.xml>
to org.apache.zookeeper/parent/3.6.0-SNAPSHOT/parent-3.6.0-SNAPSHOT.pom
[JENKINS] Archiving <https://builds.apache.org/job/zookeeper-master-maven-owasp/ws/zookeeper-recipes/zookeeper-recipes-lock/pom.xml>
to org.apache.zookeeper/zookeeper-recipes-lock/3.6.0-SNAPSHOT/zookeeper-recipes-lock-3.6.0-SNAPSHOT.pom
[JENKINS] Archiving <https://builds.apache.org/job/zookeeper-master-maven-owasp/ws/zookeeper-assembly/pom.xml>
to org.apache.zookeeper/zookeeper-assembly/3.6.0-SNAPSHOT/zookeeper-assembly-3.6.0-SNAPSHOT.pom
channel stopped
Archiving artifacts
[Fast Archiver] Compressed 1.08 MB of artifacts by 34.7% relative to #178
[SpotBugs] Skipping execution of recorder since overall result is 'FAILURE'

Mime
View raw message