zookeeper-dev mailing list archives

Site index · List index
Message view « Date » · « Thread »
Top « Date » · « Thread »
From Apache Jenkins Server <jenk...@builds.apache.org>
Subject Build failed in Jenkins: PreCommit-ZOOKEEPER-github-pr-build-maven #1384
Date Wed, 02 Oct 2019 23:22:48 GMT
See <https://builds.apache.org/job/PreCommit-ZOOKEEPER-github-pr-build-maven/1384/display/redirect>

Changes:


------------------------------------------
[...truncated 739.73 KB...]
[INFO] Copying netty-transport-native-unix-common-4.1.36.Final.jar to <https://builds.apache.org/job/PreCommit-ZOOKEEPER-github-pr-build-maven/ws/zookeeper-server/target/lib/netty-transport-native-unix-common-4.1.36.Final.jar>
[INFO] Copying slf4j-api-1.7.25.jar to <https://builds.apache.org/job/PreCommit-ZOOKEEPER-github-pr-build-maven/ws/zookeeper-server/target/lib/slf4j-api-1.7.25.jar>
[INFO] Copying slf4j-log4j12-1.7.25.jar to <https://builds.apache.org/job/PreCommit-ZOOKEEPER-github-pr-build-maven/ws/zookeeper-server/target/lib/slf4j-log4j12-1.7.25.jar>
[INFO] Copying jetty-server-9.4.18.v20190429.jar to <https://builds.apache.org/job/PreCommit-ZOOKEEPER-github-pr-build-maven/ws/zookeeper-server/target/lib/jetty-server-9.4.18.v20190429.jar>
[INFO] Copying javax.servlet-api-3.1.0.jar to <https://builds.apache.org/job/PreCommit-ZOOKEEPER-github-pr-build-maven/ws/zookeeper-server/target/lib/javax.servlet-api-3.1.0.jar>
[INFO] Copying jetty-http-9.4.18.v20190429.jar to <https://builds.apache.org/job/PreCommit-ZOOKEEPER-github-pr-build-maven/ws/zookeeper-server/target/lib/jetty-http-9.4.18.v20190429.jar>
[INFO] Copying jetty-util-9.4.18.v20190429.jar to <https://builds.apache.org/job/PreCommit-ZOOKEEPER-github-pr-build-maven/ws/zookeeper-server/target/lib/jetty-util-9.4.18.v20190429.jar>
[INFO] Copying jetty-io-9.4.18.v20190429.jar to <https://builds.apache.org/job/PreCommit-ZOOKEEPER-github-pr-build-maven/ws/zookeeper-server/target/lib/jetty-io-9.4.18.v20190429.jar>
[INFO] Copying jetty-servlet-9.4.18.v20190429.jar to <https://builds.apache.org/job/PreCommit-ZOOKEEPER-github-pr-build-maven/ws/zookeeper-server/target/lib/jetty-servlet-9.4.18.v20190429.jar>
[INFO] Copying jetty-security-9.4.18.v20190429.jar to <https://builds.apache.org/job/PreCommit-ZOOKEEPER-github-pr-build-maven/ws/zookeeper-server/target/lib/jetty-security-9.4.18.v20190429.jar>
[INFO] Copying jackson-databind-2.9.10.jar to <https://builds.apache.org/job/PreCommit-ZOOKEEPER-github-pr-build-maven/ws/zookeeper-server/target/lib/jackson-databind-2.9.10.jar>
[INFO] Copying jackson-annotations-2.9.10.jar to <https://builds.apache.org/job/PreCommit-ZOOKEEPER-github-pr-build-maven/ws/zookeeper-server/target/lib/jackson-annotations-2.9.10.jar>
[INFO] Copying jackson-core-2.9.10.jar to <https://builds.apache.org/job/PreCommit-ZOOKEEPER-github-pr-build-maven/ws/zookeeper-server/target/lib/jackson-core-2.9.10.jar>
[INFO] Copying json-simple-1.1.1.jar to <https://builds.apache.org/job/PreCommit-ZOOKEEPER-github-pr-build-maven/ws/zookeeper-server/target/lib/json-simple-1.1.1.jar>
[INFO] Copying bcprov-jdk15on-1.60.jar to <https://builds.apache.org/job/PreCommit-ZOOKEEPER-github-pr-build-maven/ws/zookeeper-server/target/lib/bcprov-jdk15on-1.60.jar>
[INFO] Copying bcpkix-jdk15on-1.60.jar to <https://builds.apache.org/job/PreCommit-ZOOKEEPER-github-pr-build-maven/ws/zookeeper-server/target/lib/bcpkix-jdk15on-1.60.jar>
[INFO] Copying jline-2.11.jar to <https://builds.apache.org/job/PreCommit-ZOOKEEPER-github-pr-build-maven/ws/zookeeper-server/target/lib/jline-2.11.jar>
[INFO] Copying metrics-core-3.2.5.jar to <https://builds.apache.org/job/PreCommit-ZOOKEEPER-github-pr-build-maven/ws/zookeeper-server/target/lib/metrics-core-3.2.5.jar>
[INFO] Copying log4j-1.2.17.jar to <https://builds.apache.org/job/PreCommit-ZOOKEEPER-github-pr-build-maven/ws/zookeeper-server/target/lib/log4j-1.2.17.jar>
[INFO] Copying kerb-core-1.1.0.jar to <https://builds.apache.org/job/PreCommit-ZOOKEEPER-github-pr-build-maven/ws/zookeeper-server/target/lib/kerb-core-1.1.0.jar>
[INFO] Copying kerby-pkix-1.1.0.jar to <https://builds.apache.org/job/PreCommit-ZOOKEEPER-github-pr-build-maven/ws/zookeeper-server/target/lib/kerby-pkix-1.1.0.jar>
[INFO] Copying kerby-asn1-1.1.0.jar to <https://builds.apache.org/job/PreCommit-ZOOKEEPER-github-pr-build-maven/ws/zookeeper-server/target/lib/kerby-asn1-1.1.0.jar>
[INFO] Copying kerby-util-1.1.0.jar to <https://builds.apache.org/job/PreCommit-ZOOKEEPER-github-pr-build-maven/ws/zookeeper-server/target/lib/kerby-util-1.1.0.jar>
[INFO] Copying kerb-simplekdc-1.1.0.jar to <https://builds.apache.org/job/PreCommit-ZOOKEEPER-github-pr-build-maven/ws/zookeeper-server/target/lib/kerb-simplekdc-1.1.0.jar>
[INFO] Copying kerb-client-1.1.0.jar to <https://builds.apache.org/job/PreCommit-ZOOKEEPER-github-pr-build-maven/ws/zookeeper-server/target/lib/kerb-client-1.1.0.jar>
[INFO] Copying kerb-common-1.1.0.jar to <https://builds.apache.org/job/PreCommit-ZOOKEEPER-github-pr-build-maven/ws/zookeeper-server/target/lib/kerb-common-1.1.0.jar>
[INFO] Copying kerb-crypto-1.1.0.jar to <https://builds.apache.org/job/PreCommit-ZOOKEEPER-github-pr-build-maven/ws/zookeeper-server/target/lib/kerb-crypto-1.1.0.jar>
[INFO] Copying commons-io-2.6.jar to <https://builds.apache.org/job/PreCommit-ZOOKEEPER-github-pr-build-maven/ws/zookeeper-server/target/lib/commons-io-2.6.jar>
[INFO] Copying kerb-util-1.1.0.jar to <https://builds.apache.org/job/PreCommit-ZOOKEEPER-github-pr-build-maven/ws/zookeeper-server/target/lib/kerb-util-1.1.0.jar>
[INFO] Copying token-provider-1.1.0.jar to <https://builds.apache.org/job/PreCommit-ZOOKEEPER-github-pr-build-maven/ws/zookeeper-server/target/lib/token-provider-1.1.0.jar>
[INFO] Copying nimbus-jose-jwt-4.41.2.jar to <https://builds.apache.org/job/PreCommit-ZOOKEEPER-github-pr-build-maven/ws/zookeeper-server/target/lib/nimbus-jose-jwt-4.41.2.jar>
[INFO] Copying jcip-annotations-1.0-1.jar to <https://builds.apache.org/job/PreCommit-ZOOKEEPER-github-pr-build-maven/ws/zookeeper-server/target/lib/jcip-annotations-1.0-1.jar>
[INFO] Copying json-smart-2.3.jar to <https://builds.apache.org/job/PreCommit-ZOOKEEPER-github-pr-build-maven/ws/zookeeper-server/target/lib/json-smart-2.3.jar>
[INFO] Copying accessors-smart-1.2.jar to <https://builds.apache.org/job/PreCommit-ZOOKEEPER-github-pr-build-maven/ws/zookeeper-server/target/lib/accessors-smart-1.2.jar>
[INFO] Copying asm-5.0.4.jar to <https://builds.apache.org/job/PreCommit-ZOOKEEPER-github-pr-build-maven/ws/zookeeper-server/target/lib/asm-5.0.4.jar>
[INFO] Copying kerb-admin-1.1.0.jar to <https://builds.apache.org/job/PreCommit-ZOOKEEPER-github-pr-build-maven/ws/zookeeper-server/target/lib/kerb-admin-1.1.0.jar>
[INFO] Copying kerb-server-1.1.0.jar to <https://builds.apache.org/job/PreCommit-ZOOKEEPER-github-pr-build-maven/ws/zookeeper-server/target/lib/kerb-server-1.1.0.jar>
[INFO] Copying kerb-identity-1.1.0.jar to <https://builds.apache.org/job/PreCommit-ZOOKEEPER-github-pr-build-maven/ws/zookeeper-server/target/lib/kerb-identity-1.1.0.jar>
[INFO] Copying kerby-xdr-1.1.0.jar to <https://builds.apache.org/job/PreCommit-ZOOKEEPER-github-pr-build-maven/ws/zookeeper-server/target/lib/kerby-xdr-1.1.0.jar>
[INFO] Copying kerby-config-1.1.0.jar to <https://builds.apache.org/job/PreCommit-ZOOKEEPER-github-pr-build-maven/ws/zookeeper-server/target/lib/kerby-config-1.1.0.jar>
[INFO] Copying mockito-core-2.27.0.jar to <https://builds.apache.org/job/PreCommit-ZOOKEEPER-github-pr-build-maven/ws/zookeeper-server/target/lib/mockito-core-2.27.0.jar>
[INFO] Copying byte-buddy-1.9.10.jar to <https://builds.apache.org/job/PreCommit-ZOOKEEPER-github-pr-build-maven/ws/zookeeper-server/target/lib/byte-buddy-1.9.10.jar>
[INFO] Copying byte-buddy-agent-1.9.10.jar to <https://builds.apache.org/job/PreCommit-ZOOKEEPER-github-pr-build-maven/ws/zookeeper-server/target/lib/byte-buddy-agent-1.9.10.jar>
[INFO] Copying objenesis-2.6.jar to <https://builds.apache.org/job/PreCommit-ZOOKEEPER-github-pr-build-maven/ws/zookeeper-server/target/lib/objenesis-2.6.jar>
[INFO] Copying junit-4.12.jar to <https://builds.apache.org/job/PreCommit-ZOOKEEPER-github-pr-build-maven/ws/zookeeper-server/target/lib/junit-4.12.jar>
[INFO] Copying hamcrest-core-1.3.jar to <https://builds.apache.org/job/PreCommit-ZOOKEEPER-github-pr-build-maven/ws/zookeeper-server/target/lib/hamcrest-core-1.3.jar>
[INFO] Copying snappy-java-1.1.7.jar to <https://builds.apache.org/job/PreCommit-ZOOKEEPER-github-pr-build-maven/ws/zookeeper-server/target/lib/snappy-java-1.1.7.jar>
[INFO] 
[INFO] --- checksum-maven-plugin:1.8:artifacts (default) @ zookeeper ---
[INFO] zookeeper-3.6.0-SNAPSHOT.jar - SHA-512 : 1bfc7227dbd53a8e379b31b89c75851e797234e49bb4ab67767cbe20641fac5472a1360531a2198997a09f26dcc12c5ebbefcf43b7906c576368d85749811e75
[INFO] zookeeper-3.6.0-SNAPSHOT-tests.jar - SHA-512 : 9af47fce215352df10bd30d5a5f7eafd079c0862379474da809451db3fa70a4f52e1dfe41dccdd90b473be5bc88c2cd429630090d2d2834289abd9239ea6b04a
[INFO] zookeeper-3.6.0-SNAPSHOT-sources.jar - SHA-512 : 051c110a925ff8336b3334bd909cfcebe319f015dc8efe7630b9fcb7e5142c2bab388afeb7f10191b80ee711cb0816109597f0169c5769fd080f7ce869f3ba5f
[INFO] zookeeper-3.6.0-SNAPSHOT-javadoc.jar - SHA-512 : 07e02828fafbe7891fc0b6bafeace5189e96c2c7de17142b64e5cc5e947cd36d79dd210e02106e7b91dd03e18e5283e02f7cf129b6cdc4eea6f96676ddd8edf8
[INFO] 
[INFO] >>> spotbugs-maven-plugin:3.1.9:check (default-cli) > :spotbugs @ zookeeper
>>>
[INFO] 
[INFO] --- spotbugs-maven-plugin:3.1.9:spotbugs (spotbugs) @ zookeeper ---
[INFO] Fork Value is true
     [java] SLF4J: No SLF4J providers were found.
     [java] SLF4J: Defaulting to no-operation (NOP) logger implementation
     [java] SLF4J: See http://www.slf4j.org/codes.html#noProviders for further details.
[INFO] Done SpotBugs Analysis....
[INFO] 
[INFO] <<< spotbugs-maven-plugin:3.1.9:check (default-cli) < :spotbugs @ zookeeper
<<<
[INFO] 
[INFO] 
[INFO] --- spotbugs-maven-plugin:3.1.9:check (default-cli) @ zookeeper ---
[INFO] BugInstance size is 0
[INFO] Error size is 0
[INFO] No errors/warnings found
[INFO] 
[INFO] --- maven-checkstyle-plugin:3.1.0:check (default-cli) @ zookeeper ---
[INFO] Starting audit...
[ERROR] <https://builds.apache.org/job/PreCommit-ZOOKEEPER-github-pr-build-maven/ws/zookeeper-server/src/main/java/org/apache/zookeeper/server/DataTree.java>:59:
Using the '.*' form of import should be avoided - org.apache.zookeeper.server.watch.*. [AvoidStarImport]
[ERROR] <https://builds.apache.org/job/PreCommit-ZOOKEEPER-github-pr-build-maven/ws/zookeeper-server/src/main/java/org/apache/zookeeper/server/FinalRequestProcessor.java>:23:
Using the '.*' form of import should be avoided - java.util.*. [AvoidStarImport]
[ERROR] <https://builds.apache.org/job/PreCommit-ZOOKEEPER-github-pr-build-maven/ws/zookeeper-server/src/main/java/org/apache/zookeeper/server/FinalRequestProcessor.java>:25:
Extra separation in import group before 'org.apache.commons.lang.StringUtils' [ImportOrder]
[ERROR] <https://builds.apache.org/job/PreCommit-ZOOKEEPER-github-pr-build-maven/ws/zookeeper-server/src/main/java/org/apache/zookeeper/server/FinalRequestProcessor.java>:48:
Using the '.*' form of import should be avoided - org.apache.zookeeper.proto.*. [AvoidStarImport]
[ERROR] <https://builds.apache.org/job/PreCommit-ZOOKEEPER-github-pr-build-maven/ws/zookeeper-server/src/main/java/org/apache/zookeeper/server/FinalRequestProcessor.java>:361:
Comment matches to-do format '(FIXME)|(XXX)|(@author)'. [TodoComment]
[ERROR] <https://builds.apache.org/job/PreCommit-ZOOKEEPER-github-pr-build-maven/ws/zookeeper-server/src/main/java/org/apache/zookeeper/server/util/RequestPathMetricsCollector.java>:43:
Extra separation in import group before 'org.apache.zookeeper.ZooDefs.OpCode.*' [ImportOrder]
[ERROR] <https://builds.apache.org/job/PreCommit-ZOOKEEPER-github-pr-build-maven/ws/zookeeper-server/src/main/java/org/apache/zookeeper/server/util/RequestPathMetricsCollector.java>:43:
Import org.apache.zookeeper.ZooDefs.OpCode.* appears after other imports that it should precede
[ImportOrder]
[ERROR] <https://builds.apache.org/job/PreCommit-ZOOKEEPER-github-pr-build-maven/ws/zookeeper-server/src/main/java/org/apache/zookeeper/server/util/RequestPathMetricsCollector.java>:43:
Using the '.*' form of import should be avoided - org.apache.zookeeper.ZooDefs.OpCode.*. [AvoidStarImport]
[ERROR] <https://builds.apache.org/job/PreCommit-ZOOKEEPER-github-pr-build-maven/ws/zookeeper-server/src/main/java/org/apache/zookeeper/server/watch/WatchManager.java>:31:
Extra separation in import group before 'java.io.PrintWriter' [ImportOrder]
[ERROR] <https://builds.apache.org/job/PreCommit-ZOOKEEPER-github-pr-build-maven/ws/zookeeper-server/src/main/java/org/apache/zookeeper/server/watch/WatchManager.java>:31:
Import java.io.PrintWriter appears after other imports that it should precede [ImportOrder]
[ERROR] <https://builds.apache.org/job/PreCommit-ZOOKEEPER-github-pr-build-maven/ws/zookeeper-server/src/main/java/org/apache/zookeeper/server/watch/WatchManager.java>:32:
Using the '.*' form of import should be avoided - java.util.*. [AvoidStarImport]
[ERROR] <https://builds.apache.org/job/PreCommit-ZOOKEEPER-github-pr-build-maven/ws/zookeeper-server/src/main/java/org/apache/zookeeper/server/watch/WatchManager.java>:236:16:
'(' is followed by whitespace. [ParenPad]
[ERROR] <https://builds.apache.org/job/PreCommit-ZOOKEEPER-github-pr-build-maven/ws/zookeeper-server/src/main/java/org/apache/zookeeper/server/watch/WatchManager.java>:236:53:
')' is preceded with whitespace. [ParenPad]
[ERROR] <https://builds.apache.org/job/PreCommit-ZOOKEEPER-github-pr-build-maven/ws/zookeeper-server/src/main/java/org/apache/zookeeper/server/watch/WatchManager.java>:237:20:
'(' is followed by whitespace. [ParenPad]
[ERROR] <https://builds.apache.org/job/PreCommit-ZOOKEEPER-github-pr-build-maven/ws/zookeeper-server/src/main/java/org/apache/zookeeper/server/watch/WatchManager.java>:237:39:
')' is preceded with whitespace. [ParenPad]
[ERROR] <https://builds.apache.org/job/PreCommit-ZOOKEEPER-github-pr-build-maven/ws/zookeeper-server/src/main/java/org/apache/zookeeper/server/watch/WatcherModeManager.java>:23:
Extra separation in import group before 'java.util.Map' [ImportOrder]
[ERROR] <https://builds.apache.org/job/PreCommit-ZOOKEEPER-github-pr-build-maven/ws/zookeeper-server/src/main/java/org/apache/zookeeper/server/watch/WatcherModeManager.java>:23:
Import java.util.Map appears after other imports that it should precede [ImportOrder]
[ERROR] <https://builds.apache.org/job/PreCommit-ZOOKEEPER-github-pr-build-maven/ws/zookeeper-server/src/main/java/org/apache/zookeeper/server/watch/WatcherModeManager.java>:43:
'if' construct must use '{}'s. [NeedBraces]
[ERROR] <https://builds.apache.org/job/PreCommit-ZOOKEEPER-github-pr-build-maven/ws/zookeeper-server/src/main/java/org/apache/zookeeper/server/watch/WatcherModeManager.java>:44:
'if' construct must use '{}'s. [NeedBraces]
[ERROR] <https://builds.apache.org/job/PreCommit-ZOOKEEPER-github-pr-build-maven/ws/zookeeper-server/src/main/java/org/apache/zookeeper/server/watch/WatcherModeManager.java>:46:48:
'&&' should be on a new line. [OperatorWrap]
[ERROR] <https://builds.apache.org/job/PreCommit-ZOOKEEPER-github-pr-build-maven/ws/zookeeper-server/src/main/java/org/apache/zookeeper/ZooKeeper.java>:56:
Using the '.*' form of import should be avoided - org.apache.zookeeper.proto.*. [AvoidStarImport]
[ERROR] <https://builds.apache.org/job/PreCommit-ZOOKEEPER-github-pr-build-maven/ws/zookeeper-server/src/main/java/org/apache/zookeeper/ZooKeeper.java>:232:9:
'synchronized' is not followed by whitespace. [WhitespaceAround]
[ERROR] <https://builds.apache.org/job/PreCommit-ZOOKEEPER-github-pr-build-maven/ws/zookeeper-server/src/main/java/org/apache/zookeeper/ZooKeeper.java>:238:9:
'synchronized' is not followed by whitespace. [WhitespaceAround]
[ERROR] <https://builds.apache.org/job/PreCommit-ZOOKEEPER-github-pr-build-maven/ws/zookeeper-server/src/main/java/org/apache/zookeeper/ZooKeeper.java>:533:17:
'synchronized' is not followed by whitespace. [WhitespaceAround]
[ERROR] <https://builds.apache.org/job/PreCommit-ZOOKEEPER-github-pr-build-maven/ws/zookeeper-server/src/main/java/org/apache/zookeeper/ZooKeeper.java>:534:21:
'for' is not followed by whitespace. [WhitespaceAround]
[ERROR] <https://builds.apache.org/job/PreCommit-ZOOKEEPER-github-pr-build-maven/ws/zookeeper-server/src/main/java/org/apache/zookeeper/ZooKeeper.java>:539:17:
'synchronized' is not followed by whitespace. [WhitespaceAround]
[ERROR] <https://builds.apache.org/job/PreCommit-ZOOKEEPER-github-pr-build-maven/ws/zookeeper-server/src/main/java/org/apache/zookeeper/ZooKeeper.java>:540:21:
'for' is not followed by whitespace. [WhitespaceAround]
[ERROR] <https://builds.apache.org/job/PreCommit-ZOOKEEPER-github-pr-build-maven/ws/zookeeper-server/src/main/java/org/apache/zookeeper/ClientCnxn.java>:73:
Using the '.*' form of import should be avoided - org.apache.zookeeper.proto.*. [AvoidStarImport]
[ERROR] <https://builds.apache.org/job/PreCommit-ZOOKEEPER-github-pr-build-maven/ws/zookeeper-server/src/test/java/org/apache/zookeeper/test/PersistentRecursiveWatcherTest.java>:34:
Extra separation in import group before 'java.io.IOException' [ImportOrder]
[ERROR] <https://builds.apache.org/job/PreCommit-ZOOKEEPER-github-pr-build-maven/ws/zookeeper-server/src/test/java/org/apache/zookeeper/test/PersistentRecursiveWatcherTest.java>:34:
Import java.io.IOException appears after other imports that it should precede [ImportOrder]
[ERROR] <https://builds.apache.org/job/PreCommit-ZOOKEEPER-github-pr-build-maven/ws/zookeeper-server/src/test/java/org/apache/zookeeper/test/PersistentRecursiveWatcherTest.java>:57:13:
'(' is followed by whitespace. [ParenPad]
[ERROR] <https://builds.apache.org/job/PreCommit-ZOOKEEPER-github-pr-build-maven/ws/zookeeper-server/src/test/java/org/apache/zookeeper/test/PersistentRecursiveWatcherTest.java>:57:77:
')' is preceded with whitespace. [ParenPad]
[ERROR] <https://builds.apache.org/job/PreCommit-ZOOKEEPER-github-pr-build-maven/ws/zookeeper-server/src/test/java/org/apache/zookeeper/test/PersistentRecursiveWatcherTest.java>:66:13:
'(' is followed by whitespace. [ParenPad]
[ERROR] <https://builds.apache.org/job/PreCommit-ZOOKEEPER-github-pr-build-maven/ws/zookeeper-server/src/test/java/org/apache/zookeeper/test/PersistentRecursiveWatcherTest.java>:66:77:
')' is preceded with whitespace. [ParenPad]
[ERROR] <https://builds.apache.org/job/PreCommit-ZOOKEEPER-github-pr-build-maven/ws/zookeeper-server/src/test/java/org/apache/zookeeper/test/PersistentRecursiveWatcherTest.java>:101:13:
'(' is followed by whitespace. [ParenPad]
[ERROR] <https://builds.apache.org/job/PreCommit-ZOOKEEPER-github-pr-build-maven/ws/zookeeper-server/src/test/java/org/apache/zookeeper/test/PersistentRecursiveWatcherTest.java>:101:77:
')' is preceded with whitespace. [ParenPad]
[ERROR] <https://builds.apache.org/job/PreCommit-ZOOKEEPER-github-pr-build-maven/ws/zookeeper-server/src/test/java/org/apache/zookeeper/test/PersistentRecursiveWatcherTest.java>:117:13:
'(' is followed by whitespace. [ParenPad]
[ERROR] <https://builds.apache.org/job/PreCommit-ZOOKEEPER-github-pr-build-maven/ws/zookeeper-server/src/test/java/org/apache/zookeeper/test/PersistentRecursiveWatcherTest.java>:117:77:
')' is preceded with whitespace. [ParenPad]
[ERROR] <https://builds.apache.org/job/PreCommit-ZOOKEEPER-github-pr-build-maven/ws/zookeeper-server/src/test/java/org/apache/zookeeper/test/PersistentRecursiveWatcherTest.java>:154:13:
'(' is followed by whitespace. [ParenPad]
[ERROR] <https://builds.apache.org/job/PreCommit-ZOOKEEPER-github-pr-build-maven/ws/zookeeper-server/src/test/java/org/apache/zookeeper/test/PersistentRecursiveWatcherTest.java>:154:77:
')' is preceded with whitespace. [ParenPad]
[ERROR] <https://builds.apache.org/job/PreCommit-ZOOKEEPER-github-pr-build-maven/ws/zookeeper-server/src/test/java/org/apache/zookeeper/test/PersistentWatcherTest.java>:34:
Extra separation in import group before 'java.io.IOException' [ImportOrder]
[ERROR] <https://builds.apache.org/job/PreCommit-ZOOKEEPER-github-pr-build-maven/ws/zookeeper-server/src/test/java/org/apache/zookeeper/test/PersistentWatcherTest.java>:34:
Import java.io.IOException appears after other imports that it should precede [ImportOrder]
[ERROR] <https://builds.apache.org/job/PreCommit-ZOOKEEPER-github-pr-build-maven/ws/zookeeper-server/src/test/java/org/apache/zookeeper/test/PersistentWatcherTest.java>:57:13:
'(' is followed by whitespace. [ParenPad]
[ERROR] <https://builds.apache.org/job/PreCommit-ZOOKEEPER-github-pr-build-maven/ws/zookeeper-server/src/test/java/org/apache/zookeeper/test/PersistentWatcherTest.java>:57:77:
')' is preceded with whitespace. [ParenPad]
[ERROR] <https://builds.apache.org/job/PreCommit-ZOOKEEPER-github-pr-build-maven/ws/zookeeper-server/src/test/java/org/apache/zookeeper/test/PersistentWatcherTest.java>:66:13:
'(' is followed by whitespace. [ParenPad]
[ERROR] <https://builds.apache.org/job/PreCommit-ZOOKEEPER-github-pr-build-maven/ws/zookeeper-server/src/test/java/org/apache/zookeeper/test/PersistentWatcherTest.java>:66:77:
')' is preceded with whitespace. [ParenPad]
[ERROR] <https://builds.apache.org/job/PreCommit-ZOOKEEPER-github-pr-build-maven/ws/zookeeper-server/src/test/java/org/apache/zookeeper/test/PersistentWatcherTest.java>:99:13:
'(' is followed by whitespace. [ParenPad]
[ERROR] <https://builds.apache.org/job/PreCommit-ZOOKEEPER-github-pr-build-maven/ws/zookeeper-server/src/test/java/org/apache/zookeeper/test/PersistentWatcherTest.java>:99:77:
')' is preceded with whitespace. [ParenPad]
[ERROR] <https://builds.apache.org/job/PreCommit-ZOOKEEPER-github-pr-build-maven/ws/zookeeper-server/src/test/java/org/apache/zookeeper/test/PersistentWatcherTest.java>:116:13:
'(' is followed by whitespace. [ParenPad]
[ERROR] <https://builds.apache.org/job/PreCommit-ZOOKEEPER-github-pr-build-maven/ws/zookeeper-server/src/test/java/org/apache/zookeeper/test/PersistentWatcherTest.java>:116:77:
')' is preceded with whitespace. [ParenPad]
[ERROR] <https://builds.apache.org/job/PreCommit-ZOOKEEPER-github-pr-build-maven/ws/zookeeper-server/src/test/java/org/apache/zookeeper/test/PersistentWatcherTest.java>:153:13:
'(' is followed by whitespace. [ParenPad]
[ERROR] <https://builds.apache.org/job/PreCommit-ZOOKEEPER-github-pr-build-maven/ws/zookeeper-server/src/test/java/org/apache/zookeeper/test/PersistentWatcherTest.java>:153:77:
')' is preceded with whitespace. [ParenPad]
Audit done.
[INFO] There are 52 errors reported by Checkstyle 8.17 with checkstyle-strict.xml ruleset.
[ERROR] src/main/java/org/apache/zookeeper/server/DataTree.java:[59] (imports) AvoidStarImport:
Using the '.*' form of import should be avoided - org.apache.zookeeper.server.watch.*.
[ERROR] src/main/java/org/apache/zookeeper/server/FinalRequestProcessor.java:[23] (imports)
AvoidStarImport: Using the '.*' form of import should be avoided - java.util.*.
[ERROR] src/main/java/org/apache/zookeeper/server/FinalRequestProcessor.java:[25] (imports)
ImportOrder: Extra separation in import group before 'org.apache.commons.lang.StringUtils'
[ERROR] src/main/java/org/apache/zookeeper/server/FinalRequestProcessor.java:[48] (imports)
AvoidStarImport: Using the '.*' form of import should be avoided - org.apache.zookeeper.proto.*.
[ERROR] src/main/java/org/apache/zookeeper/server/FinalRequestProcessor.java:[361] (misc)
TodoComment: Comment matches to-do format '(FIXME)|(XXX)|(@author)'.
[ERROR] src/main/java/org/apache/zookeeper/server/util/RequestPathMetricsCollector.java:[43]
(imports) ImportOrder: Extra separation in import group before 'org.apache.zookeeper.ZooDefs.OpCode.*'
[ERROR] src/main/java/org/apache/zookeeper/server/util/RequestPathMetricsCollector.java:[43]
(imports) ImportOrder: Import org.apache.zookeeper.ZooDefs.OpCode.* appears after other imports
that it should precede
[ERROR] src/main/java/org/apache/zookeeper/server/util/RequestPathMetricsCollector.java:[43]
(imports) AvoidStarImport: Using the '.*' form of import should be avoided - org.apache.zookeeper.ZooDefs.OpCode.*.
[ERROR] src/main/java/org/apache/zookeeper/server/watch/WatchManager.java:[31] (imports) ImportOrder:
Extra separation in import group before 'java.io.PrintWriter'
[ERROR] src/main/java/org/apache/zookeeper/server/watch/WatchManager.java:[31] (imports) ImportOrder:
Import java.io.PrintWriter appears after other imports that it should precede
[ERROR] src/main/java/org/apache/zookeeper/server/watch/WatchManager.java:[32] (imports) AvoidStarImport:
Using the '.*' form of import should be avoided - java.util.*.
[ERROR] src/main/java/org/apache/zookeeper/server/watch/WatchManager.java:[236,16] (whitespace)
ParenPad: '(' is followed by whitespace.
[ERROR] src/main/java/org/apache/zookeeper/server/watch/WatchManager.java:[236,53] (whitespace)
ParenPad: ')' is preceded with whitespace.
[ERROR] src/main/java/org/apache/zookeeper/server/watch/WatchManager.java:[237,20] (whitespace)
ParenPad: '(' is followed by whitespace.
[ERROR] src/main/java/org/apache/zookeeper/server/watch/WatchManager.java:[237,39] (whitespace)
ParenPad: ')' is preceded with whitespace.
[ERROR] src/main/java/org/apache/zookeeper/server/watch/WatcherModeManager.java:[23] (imports)
ImportOrder: Extra separation in import group before 'java.util.Map'
[ERROR] src/main/java/org/apache/zookeeper/server/watch/WatcherModeManager.java:[23] (imports)
ImportOrder: Import java.util.Map appears after other imports that it should precede
[ERROR] src/main/java/org/apache/zookeeper/server/watch/WatcherModeManager.java:[43] (blocks)
NeedBraces: 'if' construct must use '{}'s.
[ERROR] src/main/java/org/apache/zookeeper/server/watch/WatcherModeManager.java:[44] (blocks)
NeedBraces: 'if' construct must use '{}'s.
[ERROR] src/main/java/org/apache/zookeeper/server/watch/WatcherModeManager.java:[46,48] (whitespace)
OperatorWrap: '&&' should be on a new line.
[ERROR] src/main/java/org/apache/zookeeper/ZooKeeper.java:[56] (imports) AvoidStarImport:
Using the '.*' form of import should be avoided - org.apache.zookeeper.proto.*.
[ERROR] src/main/java/org/apache/zookeeper/ZooKeeper.java:[232,9] (whitespace) WhitespaceAround:
'synchronized' is not followed by whitespace.
[ERROR] src/main/java/org/apache/zookeeper/ZooKeeper.java:[238,9] (whitespace) WhitespaceAround:
'synchronized' is not followed by whitespace.
[ERROR] src/main/java/org/apache/zookeeper/ZooKeeper.java:[533,17] (whitespace) WhitespaceAround:
'synchronized' is not followed by whitespace.
[ERROR] src/main/java/org/apache/zookeeper/ZooKeeper.java:[534,21] (whitespace) WhitespaceAround:
'for' is not followed by whitespace.
[ERROR] src/main/java/org/apache/zookeeper/ZooKeeper.java:[539,17] (whitespace) WhitespaceAround:
'synchronized' is not followed by whitespace.
[ERROR] src/main/java/org/apache/zookeeper/ZooKeeper.java:[540,21] (whitespace) WhitespaceAround:
'for' is not followed by whitespace.
[ERROR] src/main/java/org/apache/zookeeper/ClientCnxn.java:[73] (imports) AvoidStarImport:
Using the '.*' form of import should be avoided - org.apache.zookeeper.proto.*.
[ERROR] src/test/java/org/apache/zookeeper/test/PersistentRecursiveWatcherTest.java:[34] (imports)
ImportOrder: Extra separation in import group before 'java.io.IOException'
[ERROR] src/test/java/org/apache/zookeeper/test/PersistentRecursiveWatcherTest.java:[34] (imports)
ImportOrder: Import java.io.IOException appears after other imports that it should precede
[ERROR] src/test/java/org/apache/zookeeper/test/PersistentRecursiveWatcherTest.java:[57,13]
(whitespace) ParenPad: '(' is followed by whitespace.
[ERROR] src/test/java/org/apache/zookeeper/test/PersistentRecursiveWatcherTest.java:[57,77]
(whitespace) ParenPad: ')' is preceded with whitespace.
[ERROR] src/test/java/org/apache/zookeeper/test/PersistentRecursiveWatcherTest.java:[66,13]
(whitespace) ParenPad: '(' is followed by whitespace.
[ERROR] src/test/java/org/apache/zookeeper/test/PersistentRecursiveWatcherTest.java:[66,77]
(whitespace) ParenPad: ')' is preceded with whitespace.
[ERROR] src/test/java/org/apache/zookeeper/test/PersistentRecursiveWatcherTest.java:[101,13]
(whitespace) ParenPad: '(' is followed by whitespace.
[ERROR] src/test/java/org/apache/zookeeper/test/PersistentRecursiveWatcherTest.java:[101,77]
(whitespace) ParenPad: ')' is preceded with whitespace.
[ERROR] src/test/java/org/apache/zookeeper/test/PersistentRecursiveWatcherTest.java:[117,13]
(whitespace) ParenPad: '(' is followed by whitespace.
[ERROR] src/test/java/org/apache/zookeeper/test/PersistentRecursiveWatcherTest.java:[117,77]
(whitespace) ParenPad: ')' is preceded with whitespace.
[ERROR] src/test/java/org/apache/zookeeper/test/PersistentRecursiveWatcherTest.java:[154,13]
(whitespace) ParenPad: '(' is followed by whitespace.
[ERROR] src/test/java/org/apache/zookeeper/test/PersistentRecursiveWatcherTest.java:[154,77]
(whitespace) ParenPad: ')' is preceded with whitespace.
[ERROR] src/test/java/org/apache/zookeeper/test/PersistentWatcherTest.java:[34] (imports)
ImportOrder: Extra separation in import group before 'java.io.IOException'
[ERROR] src/test/java/org/apache/zookeeper/test/PersistentWatcherTest.java:[34] (imports)
ImportOrder: Import java.io.IOException appears after other imports that it should precede
[ERROR] src/test/java/org/apache/zookeeper/test/PersistentWatcherTest.java:[57,13] (whitespace)
ParenPad: '(' is followed by whitespace.
[ERROR] src/test/java/org/apache/zookeeper/test/PersistentWatcherTest.java:[57,77] (whitespace)
ParenPad: ')' is preceded with whitespace.
[ERROR] src/test/java/org/apache/zookeeper/test/PersistentWatcherTest.java:[66,13] (whitespace)
ParenPad: '(' is followed by whitespace.
[ERROR] src/test/java/org/apache/zookeeper/test/PersistentWatcherTest.java:[66,77] (whitespace)
ParenPad: ')' is preceded with whitespace.
[ERROR] src/test/java/org/apache/zookeeper/test/PersistentWatcherTest.java:[99,13] (whitespace)
ParenPad: '(' is followed by whitespace.
[ERROR] src/test/java/org/apache/zookeeper/test/PersistentWatcherTest.java:[99,77] (whitespace)
ParenPad: ')' is preceded with whitespace.
[ERROR] src/test/java/org/apache/zookeeper/test/PersistentWatcherTest.java:[116,13] (whitespace)
ParenPad: '(' is followed by whitespace.
[ERROR] src/test/java/org/apache/zookeeper/test/PersistentWatcherTest.java:[116,77] (whitespace)
ParenPad: ')' is preceded with whitespace.
[ERROR] src/test/java/org/apache/zookeeper/test/PersistentWatcherTest.java:[153,13] (whitespace)
ParenPad: '(' is followed by whitespace.
[ERROR] src/test/java/org/apache/zookeeper/test/PersistentWatcherTest.java:[153,77] (whitespace)
ParenPad: ')' is preceded with whitespace.
[INFO] ------------------------------------------------------------------------
[INFO] Reactor Summary for Apache ZooKeeper 3.6.0-SNAPSHOT:
[INFO] 
[INFO] Apache ZooKeeper ................................... SUCCESS [ 27.411 s]
[INFO] Apache ZooKeeper - Documentation ................... SUCCESS [  9.888 s]
[INFO] Apache ZooKeeper - Jute ............................ SUCCESS [01:40 min]
[INFO] Apache ZooKeeper - Server .......................... FAILURE [18:39 min]
[INFO] Apache ZooKeeper - Metrics Providers ............... SKIPPED
[INFO] Apache ZooKeeper - Prometheus.io Metrics Provider .. SKIPPED
[INFO] Apache ZooKeeper - Client .......................... SKIPPED
[INFO] Apache ZooKeeper - Client - C ...................... SKIPPED
[INFO] Apache ZooKeeper - Recipes ......................... SKIPPED
[INFO] Apache ZooKeeper - Recipes - Election .............. SKIPPED
[INFO] Apache ZooKeeper - Recipes - Lock .................. SKIPPED
[INFO] Apache ZooKeeper - Recipes - Queue ................. SKIPPED
[INFO] Apache ZooKeeper - Assembly ........................ SKIPPED
[INFO] Apache ZooKeeper - Contrib ......................... SKIPPED
[INFO] Apache ZooKeeper - Contrib - Loggraph .............. SKIPPED
[INFO] Apache ZooKeeper - Contrib - Rest .................. SKIPPED
[INFO] Apache ZooKeeper - Contrib - ZooInspector .......... SKIPPED
[INFO] ------------------------------------------------------------------------
[INFO] BUILD FAILURE
[INFO] ------------------------------------------------------------------------
[INFO] Total time:  21:38 min
[INFO] Finished at: 2019-10-02T23:22:36Z
[INFO] ------------------------------------------------------------------------
Waiting for Jenkins to finish collecting data
[ERROR] Failed to execute goal org.apache.maven.plugins:maven-checkstyle-plugin:3.1.0:check
(default-cli) on project zookeeper: You have 52 Checkstyle violations. -> [Help 1]
[ERROR] 
[ERROR] To see the full stack trace of the errors, re-run Maven with the -e switch.
[ERROR] Re-run Maven using the -X switch to enable full debug logging.
[ERROR] 
[ERROR] For more information about the errors and possible solutions, please read the following
articles:
[ERROR] [Help 1] http://cwiki.apache.org/confluence/display/MAVEN/MojoFailureException
[ERROR] 
[ERROR] After correcting the problems, you can resume the build with the command
[ERROR]   mvn <goals> -rf :zookeeper
[JENKINS] Archiving <https://builds.apache.org/job/PreCommit-ZOOKEEPER-github-pr-build-maven/ws/zookeeper-server/pom.xml>
to org.apache.zookeeper/zookeeper/3.6.0-SNAPSHOT/zookeeper-3.6.0-SNAPSHOT.pom
[JENKINS] Archiving <https://builds.apache.org/job/PreCommit-ZOOKEEPER-github-pr-build-maven/ws/zookeeper-server/target/zookeeper-3.6.0-SNAPSHOT.jar>
to org.apache.zookeeper/zookeeper/3.6.0-SNAPSHOT/zookeeper-3.6.0-SNAPSHOT.jar
[JENKINS] Archiving <https://builds.apache.org/job/PreCommit-ZOOKEEPER-github-pr-build-maven/ws/zookeeper-server/target/zookeeper-3.6.0-SNAPSHOT-tests.jar>
to org.apache.zookeeper/zookeeper/3.6.0-SNAPSHOT/zookeeper-3.6.0-SNAPSHOT-tests.jar
[JENKINS] Archiving <https://builds.apache.org/job/PreCommit-ZOOKEEPER-github-pr-build-maven/ws/zookeeper-server/target/zookeeper-3.6.0-SNAPSHOT-sources.jar>
to org.apache.zookeeper/zookeeper/3.6.0-SNAPSHOT/zookeeper-3.6.0-SNAPSHOT-sources.jar
[JENKINS] Archiving <https://builds.apache.org/job/PreCommit-ZOOKEEPER-github-pr-build-maven/ws/zookeeper-server/target/zookeeper-3.6.0-SNAPSHOT-javadoc.jar>
to org.apache.zookeeper/zookeeper/3.6.0-SNAPSHOT/zookeeper-3.6.0-SNAPSHOT-javadoc.jar
[JENKINS] Archiving <https://builds.apache.org/job/PreCommit-ZOOKEEPER-github-pr-build-maven/ws/zookeeper-contrib/zookeeper-contrib-loggraph/pom.xml>
to org.apache.zookeeper/zookeeper-contrib-loggraph/3.6.0-SNAPSHOT/zookeeper-contrib-loggraph-3.6.0-SNAPSHOT.pom
[JENKINS] Archiving <https://builds.apache.org/job/PreCommit-ZOOKEEPER-github-pr-build-maven/ws/zookeeper-metrics-providers/pom.xml>
to org.apache.zookeeper/zookeeper-metrics-providers/3.6.0-SNAPSHOT/zookeeper-metrics-providers-3.6.0-SNAPSHOT.pom
[JENKINS] Archiving <https://builds.apache.org/job/PreCommit-ZOOKEEPER-github-pr-build-maven/ws/zookeeper-metrics-providers/zookeeper-prometheus-metrics/pom.xml>
to org.apache.zookeeper/zookeeper-prometheus-metrics/3.6.0-SNAPSHOT/zookeeper-prometheus-metrics-3.6.0-SNAPSHOT.pom
[JENKINS] Archiving <https://builds.apache.org/job/PreCommit-ZOOKEEPER-github-pr-build-maven/ws/zookeeper-recipes/zookeeper-recipes-election/pom.xml>
to org.apache.zookeeper/zookeeper-recipes-election/3.6.0-SNAPSHOT/zookeeper-recipes-election-3.6.0-SNAPSHOT.pom
[JENKINS] Archiving <https://builds.apache.org/job/PreCommit-ZOOKEEPER-github-pr-build-maven/ws/pom.xml>
to org.apache.zookeeper/parent/3.6.0-SNAPSHOT/parent-3.6.0-SNAPSHOT.pom
[JENKINS] Archiving <https://builds.apache.org/job/PreCommit-ZOOKEEPER-github-pr-build-maven/ws/zookeeper-recipes/zookeeper-recipes-lock/pom.xml>
to org.apache.zookeeper/zookeeper-recipes-lock/3.6.0-SNAPSHOT/zookeeper-recipes-lock-3.6.0-SNAPSHOT.pom
[JENKINS] Archiving <https://builds.apache.org/job/PreCommit-ZOOKEEPER-github-pr-build-maven/ws/zookeeper-contrib/pom.xml>
to org.apache.zookeeper/zookeeper-contrib/3.6.0-SNAPSHOT/zookeeper-contrib-3.6.0-SNAPSHOT.pom
[JENKINS] Archiving <https://builds.apache.org/job/PreCommit-ZOOKEEPER-github-pr-build-maven/ws/zookeeper-client/pom.xml>
to org.apache.zookeeper/zookeeper-client/3.6.0-SNAPSHOT/zookeeper-client-3.6.0-SNAPSHOT.pom
[JENKINS] Archiving <https://builds.apache.org/job/PreCommit-ZOOKEEPER-github-pr-build-maven/ws/zookeeper-jute/pom.xml>
to org.apache.zookeeper/zookeeper-jute/3.6.0-SNAPSHOT/zookeeper-jute-3.6.0-SNAPSHOT.pom
[JENKINS] Archiving <https://builds.apache.org/job/PreCommit-ZOOKEEPER-github-pr-build-maven/ws/zookeeper-jute/target/zookeeper-jute-3.6.0-SNAPSHOT.jar>
to org.apache.zookeeper/zookeeper-jute/3.6.0-SNAPSHOT/zookeeper-jute-3.6.0-SNAPSHOT.jar
[JENKINS] Archiving <https://builds.apache.org/job/PreCommit-ZOOKEEPER-github-pr-build-maven/ws/zookeeper-jute/target/zookeeper-jute-3.6.0-SNAPSHOT-tests.jar>
to org.apache.zookeeper/zookeeper-jute/3.6.0-SNAPSHOT/zookeeper-jute-3.6.0-SNAPSHOT-tests.jar
[JENKINS] Archiving <https://builds.apache.org/job/PreCommit-ZOOKEEPER-github-pr-build-maven/ws/zookeeper-jute/target/zookeeper-jute-3.6.0-SNAPSHOT-sources.jar>
to org.apache.zookeeper/zookeeper-jute/3.6.0-SNAPSHOT/zookeeper-jute-3.6.0-SNAPSHOT-sources.jar
[JENKINS] Archiving <https://builds.apache.org/job/PreCommit-ZOOKEEPER-github-pr-build-maven/ws/zookeeper-jute/target/zookeeper-jute-3.6.0-SNAPSHOT-javadoc.jar>
to org.apache.zookeeper/zookeeper-jute/3.6.0-SNAPSHOT/zookeeper-jute-3.6.0-SNAPSHOT-javadoc.jar
[JENKINS] Archiving <https://builds.apache.org/job/PreCommit-ZOOKEEPER-github-pr-build-maven/ws/zookeeper-recipes/zookeeper-recipes-queue/pom.xml>
to org.apache.zookeeper/zookeeper-recipes-queue/3.6.0-SNAPSHOT/zookeeper-recipes-queue-3.6.0-SNAPSHOT.pom
[JENKINS] Archiving <https://builds.apache.org/job/PreCommit-ZOOKEEPER-github-pr-build-maven/ws/zookeeper-docs/pom.xml>
to org.apache.zookeeper/zookeeper-docs/3.6.0-SNAPSHOT/zookeeper-docs-3.6.0-SNAPSHOT.pom
[JENKINS] Archiving <https://builds.apache.org/job/PreCommit-ZOOKEEPER-github-pr-build-maven/ws/zookeeper-docs/target/zookeeper-docs-3.6.0-SNAPSHOT.jar>
to org.apache.zookeeper/zookeeper-docs/3.6.0-SNAPSHOT/zookeeper-docs-3.6.0-SNAPSHOT.jar
[JENKINS] Archiving <https://builds.apache.org/job/PreCommit-ZOOKEEPER-github-pr-build-maven/ws/zookeeper-docs/target/zookeeper-docs-3.6.0-SNAPSHOT-tests.jar>
to org.apache.zookeeper/zookeeper-docs/3.6.0-SNAPSHOT/zookeeper-docs-3.6.0-SNAPSHOT-tests.jar
[JENKINS] Archiving <https://builds.apache.org/job/PreCommit-ZOOKEEPER-github-pr-build-maven/ws/zookeeper-docs/target/zookeeper-docs-3.6.0-SNAPSHOT-sources.jar>
to org.apache.zookeeper/zookeeper-docs/3.6.0-SNAPSHOT/zookeeper-docs-3.6.0-SNAPSHOT-sources.jar
[JENKINS] Archiving <https://builds.apache.org/job/PreCommit-ZOOKEEPER-github-pr-build-maven/ws/zookeeper-recipes/pom.xml>
to org.apache.zookeeper/zookeeper-recipes/3.6.0-SNAPSHOT/zookeeper-recipes-3.6.0-SNAPSHOT.pom
[JENKINS] Archiving <https://builds.apache.org/job/PreCommit-ZOOKEEPER-github-pr-build-maven/ws/zookeeper-client/zookeeper-client-c/pom.xml>
to org.apache.zookeeper/zookeeper-client-c/3.6.0-SNAPSHOT/zookeeper-client-c-3.6.0-SNAPSHOT.pom
[JENKINS] Archiving <https://builds.apache.org/job/PreCommit-ZOOKEEPER-github-pr-build-maven/ws/zookeeper-contrib/zookeeper-contrib-rest/pom.xml>
to org.apache.zookeeper/zookeeper-contrib-rest/3.6.0-SNAPSHOT/zookeeper-contrib-rest-3.6.0-SNAPSHOT.pom
[JENKINS] Archiving <https://builds.apache.org/job/PreCommit-ZOOKEEPER-github-pr-build-maven/ws/zookeeper-assembly/pom.xml>
to org.apache.zookeeper/zookeeper-assembly/3.6.0-SNAPSHOT/zookeeper-assembly-3.6.0-SNAPSHOT.pom
[JENKINS] Archiving <https://builds.apache.org/job/PreCommit-ZOOKEEPER-github-pr-build-maven/ws/zookeeper-contrib/zookeeper-contrib-zooinspector/pom.xml>
to org.apache.zookeeper/zookeeper-contrib-zooinspector/3.6.0-SNAPSHOT/zookeeper-contrib-zooinspector-3.6.0-SNAPSHOT.pom
channel stopped
[SpotBugs] Skipping execution of recorder since overall result is 'FAILURE'
Setting status of 5e268f4fe33d31b446c424bb2a954ae30ab2bd32 to FAILURE with url https://builds.apache.org/job/PreCommit-ZOOKEEPER-github-pr-build-maven/1384/
and message: 'FAILURE
 '
Using context: JenkinsMaven

Mime
View raw message