zookeeper-dev mailing list archives

Site index · List index
Message view « Date » · « Thread »
Top « Date » · « Thread »
From Apache Jenkins Server <jenk...@builds.apache.org>
Subject Build failed in Jenkins: PreCommit-ZOOKEEPER-github-pr-build-maven #1484
Date Fri, 25 Oct 2019 11:46:12 GMT
See <https://builds.apache.org/job/PreCommit-ZOOKEEPER-github-pr-build-maven/1484/display/redirect?page=changes>

Changes:

[mahadev] ZOOKEEPER-1189. For an invalid snapshot file(less than 10bytes size)

[mahadev] ZOOKEEPER-1185. Send AuthFailed event to client if SASL authentication

[camille] ZOOKEEPER-1174. FD leak when network unreachable (Ted Dunning via

[phunt] ZOOKEEPER-1203. Zookeeper systest is missing Junit Classes (Prashant

[camille] ZOOKEEPER-1174. FD leak when network unreachable (Ted Dunning via

[mahadev] ZOOKEEPER-1201. Clean SaslServerCallbackHandler.java. (Thomas Koch via

[phunt] ZOOKEEPER-1206. Sequential node creation does not use always use digits

[phunt] ZOOKEEPER-1212. zkServer.sh stop action is not conformat with LSB para

[phunt] ZOOKEEPER-1190. ant package is not including many of the bin scripts in

[phunt] ZOOKEEPER-1190. ant package is not including many of the bin scripts in

[mahadev] ZOOKEEPER-1086. zookeeper test jar has non mavenised dependency.

[mahadev] ZOOKEEPER-1181. Fix problems with Kerberos TGT renewal. (Eugene Koontz

[mahadev] Preparing for release 3.4.0

[camille] ZOOKEEPER-1264: FollowerResyncConcurrencyTest failing intermittently

[mahadev] ZOOKEEPER-1268. problems with read only mode, intermittent test failures

[camille] ZOOKEEPER-1246. Dead code in PrepRequestProcessor catch Exception block

[phunt] ZOOKEEPER-1271. testEarlyLeaderAbandonment failing on solaris - clients

[mahadev] ZOOKEEPER-1192. Leader.waitForEpochAck() checks waitingForNewEpoch

[mahadev] ZOOKEEPER-1270. testEarlyLeaderAbandonment failing intermittently,

[camille] ZOOKEEPER-1264. FollowerResyncConcurrencyTest failing intermittently.

[mahadev] Preparing for release 3.4.0 - take 2

[camille] ZOOKEEPER-1208. Ephemeral node not removed after the client session is

[camille] ZOOKEEPER-1239. add logging/stats to identify fsync stalls. (phunt via

[mahadev] Preparing for release 3.4.0 take 3

[mahadev] Changes to docs

[mahadev] ZOOKEEPER-1299. Add winconfig.h file to ignore in release audit.

[phunt] ZOOKEEPER-1311. ZooKeeper test jar is broken (Ivan Kelly via phunt)

[mahadev] ZOOKEEPER-1305. zookeeper.c:prepend_string func can dereference null

[mahadev] ZOOKEEPER-1316. zookeeper_init leaks memory if chroot is just '/'.

[mahadev] ZOOKEEPER-1315. zookeeper_init always reports sessionPasswd=<hidden>.

[mahadev] ZOOKEEPER-1317. Possible segfault in zookeeper_init. (Akira Kitada via

[mahadev] ZOOKEEPER-1319. Missing data after restarting+expanding a cluster.

[mahadev] ZOOKEEPER-1269. Multi deserialization issues (Camille Fournier via

[mahadev] Preparing for release 3.4.1

[mahadev] Fixing the rc date for 3.4.1

[phunt] ZOOKEEPER-1323. c client doesn't compile on freebsd (michi mutsuzaki via

[mahadev] ZOOKEEPER-1333. NPE in FileTxnSnapLog when restarting a cluster.

[mahadev] ZOOKEEPER-1333. Fixing the logging - Patrick Hunt via mahadev

[mahadev] Preparing for release 3.4.2

[phunt] ZOOKEEPER-1089. zkServer.sh status does not work due to invalid option

[phunt] ZOOKEEPER-1345. Add a .gitignore file with general exclusions and

[phunt] ZOOKEEPER-1345. Add a .gitignore file with general exclusions and

[phunt] ZOOKEEPER-1345. Add a .gitignore file with general exclusions and

[breed] ZOOKEEPER-1343. getEpochToPropose should check if lastAcceptedEpoch is

[camille] ZOOKEEPER-1358. In StaticHostProviderTest.java,

[camille] ZOOKEEPER-1351. invalid test verification in MultiTransactionTest (phunt

[phunt] ZOOKEEPER-973. bind() could fail on Leader because it does not

[mahadev] ZOOKEEPER-1367. Data inconsistencies and unexpired ephemeral nodes after

[mahadev] ZOOKEEPER-1353. C client test suite fails consistently. (Clint Byrum via

[mahadev] ZOOKEEPER-1373. Hardcoded SASL login context name clashes with Hadoop

[mahadev] ZOOKEEPER-1322. Cleanup/fix logging in Quorum code. (phunt via mahadev)

[mahadev] ZOOKEEPER-1352. server.InvalidSnapshotTest is using connection timeouts

[mahadev] ZOOKEEPER-1336. javadoc for multi is confusing, references functionality

[mahadev] ZOOKEEPER-1327. there are still remnants of hadoop urls. (Harsh J via

[mahadev] ZOOKEEPER-1340. multi problem - typical user operations are generating

[mahadev] ZOOKEEPER-1374. C client multi-threaded test suite fails to compile on

[mahadev] ZOOKEEPER-1337. multi's "Transaction" class is missing tests. (phunt and

[mahadev] ZOOKEEPER-1338. class cast exceptions may be thrown by multi ErrorResult

[mahadev] Preparing for 3.4.3

[mahadev] Release Notes for 3.4.3

[mahadev] Preparing for release 3.4.3

[camille] ZOOKEEPER-1321. Add number of client connections metric in JMX and srvr.

[phunt] ZOOKEEPER-1389. it would be nice if start-foreground used exec  in order

[camille] ZOOKEEPER-1386. avoid flaky URL redirection in "ant javadoc" :   replace

[camille] ZOOKEEPER-1354. AuthTest.testBadAuthThenSendOtherCommands fails

[phunt] ZOOKEEPER-1277. servers stop serving when lower 32bits of zxid roll over

[phunt] ZOOKEEPER-1412. java client watches inconsistently triggered on

[phunt] ZOOKEEPER-1344. ZooKeeper client multi-update command is not considering

[phunt] ZOOKEEPER-1307. zkCli.sh is exiting when an Invalid ACL exception is

[camille] ZOOKEEPER-1390. some expensive debug code not protected by a check for

[phunt] ZOOKEEPER-1406. dpkg init scripts don't restart - missing

[phunt] ZOOKEEPER-1403. zkCli.sh script quoting issue (James Page via phunt)

[camille] ZOOKEEPER-1377. add support for dumping a snapshot file content (similar

[phunt] ZOOKEEPER-1384. test-cppunit overrides LD_LIBRARY_PATH and fails if gcc

[camille] ZOOKEEPER-1419. Leader election never settles for a 5-node cluster

[phunt] ZOOKEEPER-1256. ClientPortBindTest is failing on Mac OS X (Daniel Gómez

[henry] ZOOKEEPER-1433. improve ZxidRolloverTest (test seems flakey) (phunt via

[henry] ZOOKEEPER-1395. node-watcher double-free redux (Mike Lundy via henryr)

[camille] ZOOKEEPER-1450. Backport of ZOOKEEPER-1294 fix to 3.4 and 3.3 (Norman

[michim] ZOOKEEPER-1048. addauth command does not work in cli_mt/cli_st (allengao

[michim] ZOOKEEPER-1339. C client doesn't build with --enable-debug (Eric Liang

[michim] ZOOKEEPER-1318. In Python binding, get_children (and get and exists, and

[henry] ZOOKEEPER-1431. zkpython async calls leak memory (Kapil Thangavelu and

[michim] ZOOKEEPER-1163. Memory leak in zk_hashtable.c:do_insert_watcher_object()

[mahadev] ZOOKEEPER-1466. QuorumCnxManager.shutdown missing synchronization.

[phunt] ZOOKEEPER-1490. If the configured log directory does not exist zookeeper

[phunt] ZOOKEEPER-1210. Can't build ZooKeeper RPM with RPM >= 4.6.0 (i.e. on

[phunt] ZOOKEEPER-1236. Security uses proprietary Sun APIs (Adalberto Medeiros

[phunt] ZOOKEEPER-1471. Jute generates invalid C++ code (Michi Mutsuzaki via

[phunt] ZOOKEEPER-1454. Document how to run autoreconf if cppunit is installed

[camille] ZOOKEEPER-1465. Cluster availability following new leader election    

[phunt] ZOOKEEPER-1427. Writing to local files is done non-atomically (phunt)

[phunt] ZOOKEEPER-1489. Data loss after truncate on transaction log (phunt)

[phunt] ZOOKEEPER-1521. LearnerHandler initLimit/syncLimit problems specifying

[phunt] ZOOKEEPER-1493. C Client: zookeeper_process doesn't invoke completion

[phunt] ZOOKEEPER-1522. intermittent failures in Zab test due to NPE in

[phunt] ZOOKEEPER-1503. remove redundant JAAS configuration code in SaslAuthTest

[phunt] ZOOKEEPER-1510. Should not log SASL errors for non-secure usage (Todd

[phunt] ZOOKEEPER-1510. Should not log SASL errors for non-secure usage (Todd

[henry] ZOOKEEPER-1514. FastLeaderElection - leader ignores the round

[phunt] ZOOKEEPER-1497. Allow server-side SASL login with JAAS configuration to

[michim] ZOOKEEPER-1536 c client : memory leak in winport.c (brooklin via michim)

[michim] ZOOKEEPER-1481 allow the C cli to run exists with a watcher (phunt via

[michim] ZOOKEEPER-1105 c client zookeeper_close not send CLOSE_OP request to

[mahadev] ZOOKEEPER-1380. zkperl: _zk_release_watch doesn't remove items properly

[mahadev] ZOOKEEPER-1501. Nagios plugin always returns OK when it cannot connect

[mahadev] ZOOKEEPER-1437. Client uses session before SASL authentication complete.

[mahadev] ZOOKEEPER-1494. C client: socket leak after receive timeout in

[mahadev] ZOOKEEPER-1483. Fix leader election recipe documentation. (Michi

[michim] Revert r1380932: ZOOKEEPER-1105 c client zookeeper_close not send

[mahadev] ZOOKEEPER-1361. Leader.lead iterates over 'learners' set without proper

[mahadev] Release Notes for 3.4.4

[mahadev] ZOOKEEPER-1496. Ephemeral node not getting cleared even after client has

[mahadev] Add Release Note for ZOOKEEPER-1496.

[mahadev] Preparing for release 3.4.4

[henry] ZOOKEEPER-1376. zkServer.sh does not correctly check for

[mahadev] ZOOKEEPER-1550. ZooKeeperSaslClient does not finish anonymous login on

[mahadev] Fixing the CHANGES.txt file

[mahadev] Preparing for release 3.4.5

[mahadev] Preparing for 3.4.5 - take 2

[phunt] ZOOKEEPER-1560 Zookeeper client hangs on creation of large nodes (Skye

[mahadev] Preparing for release 3.4.5

[phunt] ZOOKEEPER-1474. Cannot build Zookeeper with IBM Java: use of Sun MXBean

[phunt] ZOOKEEPER-1564. Allow JUnit test build with IBM Java (Paulo Ricardo Paz

[phunt] ZOOKEEPER-1596. Zab1_0Test should ensure that the file is closed (Enis

[phunt] ZOOKEEPER-1513. "Unreasonable length" exception while starting a server

[phunt] ZOOKEEPER-1581. change copyright in notice to 2012 (breed via phunt)

[phunt] ZOOKEEPER-1598. Ability to support more digits in the version string

[phunt] ZOOKEEPER-753. log4j dependency in the pom needs to have exclusion lists

[phunt] ZOOKEEPER-1553. Findbugs configuration is missing some dependencies

[phunt] ZOOKEEPER-1583. Document maxClientCnxns in conf/zoo_sample.cfg

[phunt] ZOOKEEPER-1478. Small bug in QuorumTest.testFollowersStartAfterLeader( )

[phunt] ZOOKEEPER-1387. Wrong epoch file created (Benjamin Busjaeger via breed,

[phunt] ZOOKEEPER-1584. Adding mvn-install target for deploying the zookeeper

[mahadev] ZOOKEEPER-1578. org.apache.zookeeper.server.quorum.Zab1_0Test failed due

[phunt] ZOOKEEPER-1334. Zookeeper 3.4.x is not OSGi compliant - MANIFEST.MF is

[camille] ZOOKEEPER-1535. ZK Shell/Cli re-executes last command on exit (Edward

[fpj] ZOOKEEPER-1324. Remove Duplicate NEWLEADER packets from the Leader to

[phunt] ZOOKEEPER-1495. ZK client hangs when using a function not available on

[phunt] ZOOKEEPER-1615. minor typos in ZooKeeper Programmer's Guide web page

[phunt] ZOOKEEPER-1613. The documentation still points to 2008 in the copyright

[phunt] ZOOKEEPER-1562. Memory leaks in zoo_multi API (Deepak Jagtap via phunt)

[phunt] ZOOKEEPER-1645. ZooKeeper OSGi package imports not complete (Arnoud

[phunt] ZOOKEEPER-1648. Fix WatcherTest in JDK7 (Thawan Kooburat via phunt)

[phunt] ZOOKEEPER-1606. intermittent failures in ZkDatabaseCorruptionTest on

[phunt] ZOOKEEPER-1647. OSGi package import/export changes not applied to

[michim] ZOOKEEPER-1633. Introduce a protocol version to connection initiation

[fpj] ZOOKEEPER-1697:  large snapshots can cause continuous quorum failure  

[fpj] ZOOKEEPER-1706. Typo in Double Barriers example (Jingguo Yao via fpj)

[camille] ZOOKEEPER-1642. Leader loading database twice (fpj via camille)

[camille] ZOOKEEPER-1663. scripts don't work when path contains spaces (Amichai

[camille]   ZOOKEEPER-1714 perl client segfaults if ZOO_READ_ACL_UNSAFE constant

[camille]   ZOOKEEPER-1719. zkCli.sh, zkServer.sh and zkEnv.sh regression caused

[phunt] ZOOKEEPER-1702. ZooKeeper client may write operation packets before

[camille] ZOOKEEPER-1629. testTransactionLogCorruption occasionally fails.

[camille] ZOOKEEPER-1629. testTransactionLogCorruption occasionally fails.

[camille] ZOOKEEPER-1731. Unsynchronized access to

[fpj] ZOOKEEPER-1713. wrong time calculation in zkfuse.cc (german via fpj)

[fpj] ZOOKEEPER-1379. 'printwatches, redo, history and connect '. client

[fpj] ZOOKEEPER-1670: zookeeper should set a default value for SERVER_JVMFLAGS

[fpj] ZOOKEEPER-1448: Node+Quota creation in transaction log can crash leader

[camille] ZOOKEEPER-1664. Kerberos auth doesn't work with native platform GSS

[michim] ZOOKEEPER-1750. Race condition producing NPE in NIOServerCnxn.toString

[fpj] ZOOKEEPER-1754. Read-only server allows to create znode (Rakesh R via

[mahadev] ZOOKEEPER-1751. ClientCnxn#run could miss the second ping or connection

[fpj] ZOOKEEPER-1657. Increased CPU usage by unnecessary SASL checks (Philip

[fpj] ZOOKEEPER-1753. ClientCnxn is not properly releasing the resources,

[fpj] ZOOKEEPER-1096. Leader communication should listen on specified IP, not

[mahadev] ZOOKEEPER-1696. Fail to run zookeeper client on Weblogic application

[fpj] ZOOKEEPER-87. Follower does not shut itself down if its too far behind

[fpj] ZOOKEEPER-1603. StaticHostProviderTest testUpdateClientMigrateOrNot

[mahadev] Reverting ZOOKEEPER-1696 patch that was committed.

[mahadev] ZOOKEEPER-1696. Fail to run zookeeper client on Weblogic application

[thawan] ZOOKEEPER-1552. Enable sync request processor in Observer (thawan, fpj)

[thawan] ZOOKEEPER-1758. Add documentation for zookeeper.observer.syncEnabled

[fpj] ZOOKEEPER-1670. zookeeper should set a default value for SERVER_JVMFLAGS

[phunt] ZOOKEEPER-1770. NullPointerException in SnapshotFormatter (Germán Blanco

[fpj] ZOOKEEPER-732. Improper translation of error into Python exception

[thawan] ZOOKEEPER-1551. Observers ignore txns that come after snapshot and

[phunt] ZOOKEEPER-1781. ZooKeeper Server fails if snapCount is set to 1 (Takashi

[phunt] ZOOKEEPER-1774. QuorumPeerMainTest fails consistently with complains

[phunt] ZOOKEEPER-1771. ZooInspector authentication (Benjamin Jaton via phunt)

[phunt] ZOOKEEPER-877. zkpython does not work with python3.1 (Daniel Enman via

[phunt] ZOOKEEPER-1627. Add org.apache.zookeeper.common to exported packages in

[camille] ZOOKEEPER-1624. PrepRequestProcessor abort multi-operation incorrectly.

[phunt] ZOOKEEPER-1610. Some classes are using == or != to compare Long/String

[phunt] ZOOKEEPER-1646. mt c client tests fail on Ubuntu Raring (phunt)

[fpj] ZOOKEEPER-1558. Leader should not snapshot uncommitted state (fpj)

[fpj] ZOOKEEPER-1732. ZooKeeper server unable to join established ensemble

[fpj] ZOOKEEPER-1667. Watch event isn't handled correctly when a client

[phunt] ZOOKEEPER-1799. SaslAuthFailDesignatedClientTest.testAuth fails

[phunt] ZOOKEEPER-1557. jenkins jdk7 test failure in

[phunt] ZOOKEEPER-1744. clientPortAddress breaks "zkServer.sh status" (Nick

[thawan] ZOOKEEPER-1798. Fix race condition in testNormalObserverRun (thawan, fpj

[phunt] ZOOKEEPER-1812. ZooInspector reconnection always fails if first

[camille] ZOOKEEPER-1666. Avoid Reverse DNS lookup if the hostname in   connection

[thawan] ZOOKEEPER-1798. Fix race condition in testNormalObserverRun (Part 2)

[fpj] ZOOKEEPER-1786. ZooKeeper data model documentation is incorrect   (Niraj

[fpj] ZOOKEEPER-1808. Add version to FLE notifications for 3.4 branch (fpj)

[fpj] ZOOKEEPER-1597. Windows build failing (michim via fpj)

[fpj] ZOOKEEPER-1817. Fix don't care for b3.4 (fpj)

[fpj] ZOOKEEPER-1653. zookeeper fails to start because of inconsistent epoch

[fpj] ZOOKEEPER-1821. very ugly warning when compiling load_gen.c (german

[michim] ZOOKEEPER-1632. fix memory leaks in cli_st (fpj via michim)

[fpj] ZOOKEEPER-1459. Standalone ZooKeeperServer is not closing   the

[michim] ZOOKEEPER-1019. zkfuse doesn't list dependency on boost in README (Raul

[michim] ZOOKEEPER-1834. Catch IOException in FileTxnLog (fpj via michim)

[camille] ZOOKEEPER-1382. Zookeeper server holds onto dead/expired session ids in

[michim] ZOOKEEPER-1715. Upgrade netty version (Sean Bridges via michim)

[fpj] ZOOKEEPER-1837. Fix JMXEnv checks (potential race conditions) (Germán

[michim] ZOOKEEPER-1839. Deadlock in NettyServerCnxn (Rakesh R via michim)

[phunt] ZOOKEEPER-1622. session ids will be negative in the year 2022 (Eric

[michim] ZOOKEEPER-1756. zookeeper_interest() in C client can return a timeval of

[phunt] ZOOKEEPER-1388. Client side 'PathValidation' is missing for the

[fpj] ZOOKEEPER-1841. problem in QuorumTest (Germán via fpj)

[fpj] ZOOKEEPER-1733. FLETest#testLE is flaky on windows boxes   (michim via

[fpj] ZOOKEEPER-1733. FLETest#testLE is flaky on windows boxes   (michim,

[fpj] ZOOKEEPER-1849. Need to properly tear down tests in various   cases

[phunt] ZOOKEEPER-1430. add maven deploy support to the build (Giridharan

[fpj] ZOOKEEPER-1179. NettyServerCnxn does not properly close   socket on 4

[fpj] ZOOKEEPER-1179. NettyServerCnxn does not properly close socket on 4

[fpj] ZOOKEEPER-1852. ServerCnxnFactory instance is not properly cleanedup

[fpj] ZOOKEEPER-1852. ServerCnxnFactory instance is not properly cleanedup

[michim] ZOOKEEPER-1414. QuorumPeerMainTest.testQuorum, testBadPackets are

[michim] ZOOKEEPER-1057. zookeeper c-client, connection to offline server fails

[michim] ZOOKEEPER-1857. PrepRequestProcessotTest doesn't shutdown ZooKeeper

[fpj] ZOOKEEPER-1238. when the linger time was changed for NIO the patch

[fpj] ZOOKEEPER-1837. Fix JMXEnv checks (potential race conditions)   (Germán

[fpj] ZOOKEEPER-1858. JMX checks - potential race conditions while stopping

[fpj] ZOOKEEPER-1867. Bug in ZkDatabaseCorruptionTest (fpj)

[fpj] ZOOKEEPER-1872. QuorumPeer is not shutdown in few cases (Rakesh R via

[phunt] ZOOKEEPER-1573. Unable to load database due to missing parent node

[phunt] ZOOKEEPER-1811. The ZooKeeperSaslClient service name principal is

[michim] ZOOKEEPER-1873. Unnecessarily InstanceNotFoundException is coming when

[fpj] ZOOKEEPER-1844. TruncateTest fails on windows (Rakesh R via fpj)

[camille] ZOOKEEPER-1755. Concurrent operations of four letter 'dump' ephemeral  

[fpj] Preparing for release 3.4.6

[fpj] Updating version in build.xml.

[michim] ZOOKEEPER-1888. ZkCli.cmd commands fail with "'java' is not recognized

[michim] ZOOKEEPER-1878. Inconsistent behavior in autocreation of dataDir and

[michim] ZOOKEEPER-1901. [JDK8] Sort children for comparison in AsyncOps tests

[michim] ZOOKEEPER-1904. WatcherTest#testWatchAutoResetWithPending is failing

[michim] ZOOKEEPER-1906. zkpython: invalid data in GetData for empty node (Nikita

[michim] ZOOKEEPER-1897. ZK Shell/Cli not processing commands (stack via michim)

[michim] Set svn:eol-style property to native.

[michim] ZOOKEEPER-1575. adding .gitattributes to prevent CRLF and LF mismatches

[michim] ZOOKEEPER-1913. Invalid manifest files due to bogus revision property

[michim] ZOOKEEPER-1911. REST contrib module does not include all required files

[michim] ZOOKEEPER-1926. Unit tests should only use build/test/data for data

[rakeshr] ZOOKEEPER-657. Cut down the running time of ZKDatabase corruption (Michi

[michim] ZOOKEEPER-1895. update all notice files, copyright, etc... with the new

[michim] ZOOKEEPER-1062. Net-ZooKeeper: Net::ZooKeeper consumes 100% cpu on wait

[michim] ZOOKEEPER-1797. PurgeTxnLog may delete data logs during roll (Rakesh R

[phunt] 'src/contrib/zooinspector/NOTICE.txt' isn't complying to

[fpj]  ZOOKEEPER-1945. deb - zkCli.sh, zkServer.sh and zkEnv.sh regression

[phunt] ZOOKEEPER-1746. AsyncCallback.*Callback don't have any Javadoc (Hongchao

[phunt] ZOOKEEPER-1939. ReconfigRecoveryTest.testNextConfigUnreachable is

[shralex] ZOOKEEPER-1900

[rakeshr] ZOOKEEPER-1222. getACL should only call DataTree.copyStat when passed in

[fpj] ZOOKEEPER-2039. Jute compareBytes incorrect comparison index (Ian

[rakeshr] ZOOKEEPER-2047 testTruncationNullLog fails on windows (flavio via

[rakeshr] ZOOKEEPER-2026 Startup order in ServerCnxnFactory-ies is wrong (Stevo

[michim] ZOOKEEPER-1917. Apache Zookeeper logs cleartext admin passwords (fpj via

[rakeshr] ZOOKEEPER-1948 Enable JMX remote monitoring (Biju Nair via rakeshr)

[rakeshr] ZOOKEEPER-1917 Apache Zookeeper logs cleartext admin passwords (michim

[michim] ZOOKEEPER-2049 Yosemite build failure: htonll conflict (Till Toenshoff

[rakeshr] ZOOKEEPER-2052 Unable to delete a node when the node has no children

[fpj] ZOOKEEPER-2060 Trace bug in NettyServerCnxnFactory (Ian via fpj)

[fpj] ZOOKEEPER-2064 Prevent resource leak in various classes (Ted Yu via fpj)

[michim] ZOOKEEPER-1949 recipes jar not included in the distribution package

[michim] ZOOKEEPER-2114 jute generated allocate_* functions are not externally

[michim] ZOOKEEPER-2073 Memory leak on zookeeper_close (Dave Gosselin via michim)

[rgs] ZOOKEEPER-2056 Zookeeper 3.4.x and 3.5.0-alpha is not OSGi compliant

[rgs] ZOOKEEPER-2146 BinaryInputArchive readString should check length before

[rgs] ZOOKEEPER-2174 JUnit4ZKTestRunner logs test failure for all exceptions

[rakeshr] ZOOKEEPER-2126 Improve exit log messsage of EventThread and SendThread

[rgs] ZOOKEEPER-1077: C client lib doesn't build on Solaris (Chris Nauroth via

[michim] ZOOKEEPER-2186 QuorumCnxManager#receiveConnection may crash with random

[michim] ZOOKEEPER-2124 Allow Zookeeper version string to have underscore '_'

[rgs] ZOOKEEPER-2179: Typo in Watcher.java (Archana T via rgs)

[rgs] ZOOKEEPER-2096: C client builds with incorrect error codes in

[rgs] ZOOKEEPER-2194: Let DataNode.getChildren() return an unmodifiable view

[rgs] ZOOKEEPER-2205: Log type of unexpected quorum packet in learner handler

[rgs] ZOOKEEPER-2201: Network issues can cause cluster to hang due to

[rgs] ZOOKEEPER-2213: Empty path in Set crashes server and prevents restart

[rgs] ZOOKEEPER-706: Large numbers of watches can cause session

[rgs] ZOOKEEPER-602: log all exceptions not caught by ZK threads (Rakesh R via

[rgs] ZOOKEEPER-2224: Four letter command hangs when network is slow (Arshad

[michim] ZOOKEEPER-2235: License update (fpj via michim)

[rakeshr] ZOOKEEPER-2237 Port async multi to 3.4 branch (Ivan Kelly via rakeshr)

[rgs] ZOOKEEPER-2239: JMX State from LocalPeerBean incorrect (Kevin Lee via

[hdeng] ZOOKEEPER-1907 Improve Thread handling (Rakesh R via hdeng)

[rgs] ZOOKEEPER-1927: zkServer.sh fails to read dataDir (and others) from

[fpj] ZOOKEEPER-2033: zookeeper follower fails to start after a restart

[rakeshr] ZOOKEEPER-2256: Zookeeper is not using specified JMX port in

[rgs] ZOOKEEPER-2270: Allow MBeanRegistry to be overridden for better unit

[cnauroth] ZOOKEEPER-2040: Server to log underlying cause of SASL connection

[rakeshr] ZOOKEEPER-2245: SimpleSysTest test cases fails (Arshad Mohammad via

[fpj] ZOOKEEPER-1506: Re-try DNS hostname -> IP resolution if node connection

[rakeshr] ZOOKEEPER-2279: QuorumPeer loadDataBase() error message is

[rakeshr] ZOOKEEPER-1803: Add description for pzxid in programmer's guide(Arshad

[rgs] ZOOKEEPER-2253: C asserts ordering of ping requests, while Java client

[cnauroth] ZOOKEEPER-2268: Zookeeper doc creation fails on windows (Arshad Mohammad

[cnauroth] ZOOKEEPER-2296: compilation broken for 3.4 (Raul Gutierrez Segales via

[cnauroth] ZOOKEEPER-1029: C client bug in zookeeper_init (if bad hostname is

[michim] ZOOKEEPER-2142: JMX ObjectName is incorrect for observers (Edward

[rgs] ZOOKEEPER-1853: zkCli.sh can't issue a CREATE command containing spaces

[rgs] ZOOKEEPER-2227: stmk four-letter word fails execution at server while

[rgs] ZOOKEEPER-2315: Change client connect zk service timeout log level from

[rgs] ZOOKEEPER-2240: Make the three-node minimum more explicit in

[rgs] Preparing for release 3.4.7

[rgs] Updating version in build.xml

[rgs] ZOOKEEPER-1929: std::length_error on update children (Charles Strahan

[rgs] ZOOKEEPER-2211: PurgeTxnLog does not correctly purge when snapshots and

[rgs] ZOOKEEPER-2311: assert in setup_random (Marshall McMullen via rgs)

[rgs] ZOOKEEPER-2295: TGT refresh time logic is wrong (Arshad Mohammad via

[cnauroth] ZOOKEEPER-2281: ZK Server startup fails if there are spaces in the

[cnauroth] ZOOKEEPER-2281: Move to correct section of CHANGES.txt.

[rgs] ZOOKEEPER-2340: JMX is disabled even if JMXDISABLE is false (Arshad

[rgs] ZOOKEEPER-2229: Several four-letter words are undocumented (Chris

[rgs] ZOOKEEPER-2347: Deadlock shutting down zookeeper (Rakesh R via rgs)

[cnauroth] ZOOKEEPER-2360: Update commons collections version used by

[rgs] Preparing for release 3.4.8

[cnauroth] ZOOKEEPER-2243: Supported platforms is completely out of date (cnauroth)

[rgs] Update version in build.xml

[rakeshr] ZOOKEEPER-2375: Prevent multiple initialization of login object in each

[phunt] ZOOKEEPER-2294 Ant target generate-clover-reports is broken (charlie via

[phunt] ZOOKEEPER-2378 upgrade ivy to recent version (phunt)

[phunt] ZOOKEEPER-2373 Licenses section missing from pom file (phunt)

[phunt] ZOOKEEPER-2373 Licenses section missing from pom file - part 2 missed an

[cnauroth] ZOOKEEPER-2379: recent commit broke findbugs qabot check (rakeshr via

[phunt] ZOOKEEPER-2133 zkperl: Segmentation fault if getting a node with null

[phunt] Added some CHANGES details that I missed in recent commits. (phunt)

[phunt] ZOOKEEPER-2283 traceFile property is not used in the ZooKeeper, it

[phunt] ZOOKEEPER-2385 Zookeeper trunk build is failing on windows (Arshad

[phunt] ZOOKEEPER-2240 Make the three-node minimum more explicit in

[phunt] ZOOKEEPER-2195 fsync.warningthresholdms in zoo.cfg not working (Biju

[camille] ZOOKEEPER-2141 ACL cache in DataTree never removes entries (Adam

[camille] ZOOKEEPER-2141 ACL cache in DataTree never removes entries (Adam

[phunt] ZOOKEEPER-2423: Upgrade Netty version due to security vulnerability

[phunt] ZOOKEEPER-2405: getTGT() in Login.java mishandles confidential

[phunt] ZOOKEEPER-2477: documentation should refer to Java cli shell and not C

[phunt] ZOOKEEPER-1256: ClientPortBindTest is failing on Mac OS X (Camille via

[rgs] ZOOKEEPER-2498: Potential resource leak in C client when processing

[fpj] Fix command handling in the C client shell (phunt via fpj)

[cnauroth] ZOOKEEPER-2452: Back-port ZOOKEEPER-1460 to 3.4 for IPv6 literal address

[fpj] ZOOKEEPER-2247: Zookeeper service becomes unavailable when leader fails

[cnauroth] ZOOKEEPER-2514: Simplify releasenotes creation for 3.4 branch -

[rakeshr] Preparing for release 3.4.9

[rakeshr] Preparing for release 3.4.9 RC1

[rakeshr] Update version in build.xml

[phunt] ZOOKEEPER-2502: Flaky Test:

[phunt] ZOOKEEPER-2558: Potential memory leak in recordio.c (Michael Han via

[phunt] ZOOKEEPER-2507: C unit test improvement: line break between 'ZooKeeper

[cnauroth] ZOOKEEPER-2557: Update gitignore to account for other file extensions.

[phunt] ZOOKEEPER-2579: ZooKeeper server should verify that dataDir and snapDir

[phunt] ZOOKEEPER-2594: Use TLS for downloading artifacts during build (Olaf

[rakeshr] ZOOKEEPER-2467: NullPointerException when redo Command is passed

[fpj] ZOOKEEPER-2606: SaslServerCallbackHandler#handleAuthorizeCallback()

[phunt] ZOOKEEPER-1045: Support Quorum Peer mutual authentication via SASL

[fpj] ZOOKEEPER-2542: Update NOTICE file with Netty notice in 3.4

[rakeshr] ZOOKEEPER-2552: Revisit release doc and remove the issues not covered by

[fpj] ZOOKEEPER-2479: Add 'electionTimeTaken' value in LeaderMXBean and

[hanm] ZOOKEEPER-2470: ServerConfig#parse(String[]) ignores tickTime

[hanm] ZOOKEEPER-2646: Java target in branch 3.4 doesn't match documentation

[rgs] ZOOKEEPER-2652: Fix HierarchicalQuorumTest.java

[hanm] ZOOKEEPER-2656: Fix ServerConfigTest#testValidArguments test case fai…

[hanm] ZOOKEEPER-2465: Documentation copyright notice is out of date.

[hanm] ZOOKEEPER-2383: Startup race in ZooKeeperServer

[rgs] Test Improvement by adding more QuorumPeer Auth related test cases

[hanm] ZOOKEEPER-2620: Add comments to testReadOnlySnapshotDir and

[rakeshr] ZOOKEEPER-2656: Fix ServerConfigTest#testValidArguments test case.

[hanm] ZOOKEEPER-2651: Missing src/pom.template in release

[hanm] ZOOKEEPER-2633: contrib/zkfuse build fix with gcc 6.2.

[hanm] ZOOKEEPER-2574: PurgeTxnLog can inadvertently delete required txn log

[rakeshr] ZOOKEEPER-2671: Fix compilation error in branch-3.4

[hanm] ZOOKEEPER-2664: ClientPortBindTest#testBindByAddress may fail due to "No

[rakeshr] ZOOKEEPER-2573: Modify Info.REVISION to adapt git repo

[arshad] ZOOKEEPER-2622: ZooTrace.logQuorumPacket does nothing

[rakeshr] ZOOKEEPER-2044: CancelledKeyException in zookeeper branch-3.4

[rakeshr] ZOOKEEPER-2682: Make it optional to fail build on test failure

[rakeshr] ZOOKEEPER-2672: Remove CHANGE.txt

[rakeshr] ZOOKEEPER-2680: Correct DataNode.getChildren() inconsistent behaviour

[rakeshr] ZOOKEEPER-2617: correct a few spelling typos

[arshad] ZOOKEEPER-2689: Fix Kerberos Authentication related test cases

[hanm] ZOOKEEPER-2678: Discovery and Sync can take a very long time on large DB

[hanm] ZOOKEEPER-2692: Fix race condition in testWatchAutoResetWithPending

[rakeshr] ZOOKEEPER-2696: Eclipse ant ask no longer determines correct classpath

[rakeshr] ZOOKEEPER-2693: DOS attack on wchp/wchc four letter words (4lw)

[rakeshr] ZOOKEEPER-2710: Regenerate documentation for branch-3.4 release

[hanm] ZOOKEEPER-2665: Port QA github pull request build to branch 3.4 and 3.5

[rakeshr] Preparing for release 3.4.10

[rakeshr] ZOOKEEPER-2716: Flaky Test:

[hanm] ZOOKEEPER-2726 ZOOKEEPER-2693: Patch for introduces potential race

[rakeshr] ZOOKEEPER-2712: MiniKdc test case intermittently failing due to

[rakeshr] ZOOKEEPER-2706: checkstyle broken on branch-3.4

[rakeshr] Preparing for release 3.4.10

[rakeshr] Update the version to 3.4.11-SNAPSHOT

[hanm] ZOOKEEPER-2744: Typos in the comments of ZooKeeper class

[hanm] ZOOKEEPER-2638: ZooKeeper should log which serverCnxnFactory is used

[hanm] ZOOKEEPER-2729: Cleanup findbug warnings in branch-3.4: Correctness

[hanm] ZOOKEEPER-2749: Cleanup findbug warnings in branch-3.4: Experimental

[hanm] ZOOKEEPER-2743: Netty connection leaks JMX connection bean.

[hanm] ZOOKEEPER-2722: fix flaky testSessionEstablishment test.

[hanm] ZOOKEEPER-2758: Fix typo

[hanm] ZOOKEEPER-2759: Flaky test:

[hanm] ZOOKEEPER-2759: Flaky test:

[hanm] ZOOKEEPER-2785: Server inappropriately throttles connections under loa…

[hanm] Ephemeral znode will not be removed when sesstion timeout, if the system

[rakeshr] ZOOKEEPER-2732: Cleanup findbug warnings in branch-3.4: Performance

[rakeshr] ZOOKEEPER-2733: Cleanup findbug warnings in branch-3.4: Dodgy code

[rakeshr] ZOOKEEPER-2731: Cleanup findbug warnings in branch-3.4: Malicious code

[rakeshr] ZOOKEEPER-2762: Cleanup findbug warnings in branch-3.4: Multithreaded

[hanm] ZOOKEEPER-2691: recreateSocketAddresses may recreate the unreachable …

[hanm] ZOOKEEPER-2788: remove unused variable MAX_CONNECTION_ATTEMPTS.

[hanm] ZOOKEEPER-1748: Add option for tcp keepalive

[hanm] ZOOKEEPER-2798: Fix flaky test:

[hanm] fix documentation source for ZOOKEEPER-1748.

[hanm] Fix a typo in doc source in commit

[hanm] ZOOKEEPER-2775: ZK Client not able to connect with Xid out of order

[hanm] ZOOKEEPER-2786: Flaky test:

[rakeshr] ZOOKEEPER-2730: Cleanup findbug warnings in branch-3.4: Disable

[hanm] ZOOKEEPER-2691: fix documentation issue. The configuration option should

[hanm] ZOOKEEPER-2786: Flaky test:

[hanm] ZOOKEEPER-2818: Improve the ZooKeeper#setACL java doc

[hanm] ZOOKEEPER-2811: PurgeTxnLog#validateAndGetFile: return tag has no

[hanm] ZOOKEEPER-2740: close netty connection when exceptions occur during

[hanm] ZOOKEEPER-2856: ZooKeeperSaslClient#respondToServer should log exception

[hanm] ZOOKEEPER-2829: Interface usability / compatibility improvements through

[hanm] ZOOKEEPER-1643. Windows: fetch_and_add not 64bit-compatible, may not be

[hanm] ZOOKEEPER-2841: ZooKeeper public include files leak porting changes

[hanm] ZOOKEEPER-2614 ZOOKEEPER-1576: Port to branch 3.4

[hanm] ZOOKEEPER-2355: Ephemeral node is never deleted if follower fails while

[hanm] ZOOKEEPER-1669: Operations to server will be timed-out while thousands

[hanm] ZOOKEEPER-2853: The lastZxidSeen in FileTxnLog.java is never being

[hanm] ZOOKEEPER-2864: Add script to run a java api compatibility tool

[hanm] ZOOKEEPER-2870: Improve the efficiency of AtomicFileOutputStream

[hanm] ZOOKEEPER-2859: Fix CMake build on OS X.

[hanm] ZOOKEEPER-2874: Windows Debug builds don't link with `/MTd`

[hanm] ZOOKEEPER-2861: Main-Class JAR manifest attribute is incorrect

[hanm] ZOOKEEPER-2880: Rename README.txt to README.md

[hanm] ZOOKEEPER-2349: Update documentation for snapCount

[hanm] ZOOKEEPER-2777: There is a typo in zk.py which prevents from

[hanm] ZOOKEEPER-2809: Unnecessary stack-trace in server when the client dis…

[phunt] ZOOKEEPER-2875: Add ant task for running OWASP dependency report

[phunt] ZOOKEEPER-2905: Don't include `config.h` in `zookeeper.h`

[phunt] ZOOKEEPER-2906: The OWASP dependency check jar should not be included in

[phunt] ZOOKEEPER-2887: define dependency versions in build.xml to be easily

[phunt] ZOOKEEPER-2908: quorum.auth.MiniKdcTest.testKerberosLogin failing with

[phunt] ZOOKEEPER-2914: Clear or suppress Java 9 compiler warning messages

[phunt] ZOOKEEPER-2909: Create ant task to generate ivy dependency reports

[phunt] ZOOKEEPER-2890: Local automatic variable is left uninitialized and then

[phunt] ZOOKEEPER-2915: Use "strict" conflict management in ivy

[phunt] ZOOKEEPER-1703: Added instructions on how to run the example code

[phunt1] Preparing for release 3.4.11

[phunt1] ZOOKEEPER-2880 Rename README.txt to README.md - fixed packaging

[phunt1] Prepare for the next release: update the version to 3.4.12-SNAPSHOT

[phunt] ZOOKEEPER-2690: Update documentation source for ZOOKEEPER-2574

[phunt] ZOOKEEPER-2923: The comment of the variable matchSyncs in class

[phunt] ZOOKEEPER-2931: WriteLock recipe: Fix bug in znode ordering when the

[phunt] ZOOKEEPER-2795: Change log level for "ZKShutdownHandler is not

[phunt] ZOOKEEPER-2944: Specify correct overflow value

[phunt] ZOOKEEPER-2806: Flaky test:

[phunt] ZOOKEEPER-2948: Failing c unit tests on apache jenkins

[phunt] ZOOKEEPER-2924: Refactor tests of LoadFromLogTest.java

[phunt] ZOOKEEPER-2951: remove trailing \ from JAVA_HOME

[phunt] ZOOKEEPER-2950: Add keys for the Zxid from the stat command to

[phunt] ZOOKEEPER-2952: Upgrade third party libs: netty, slf4j, log4j

[phunt] ZOOKEEPER-2953: Flaky Test: testNoLogBeforeLeaderEstablishment

[phunt] ZOOKEEPER-2893: very poor choice of logging if client fails to connect

[camille] ZOOKEEPER-2960: The dataDir and dataLogDir are used opposingly

[phunt] ZOOKEEPER-2249: CRC check failed when preAllocSize smaller than node

[phunt] ZOOKEEPER-2961: Fix testElectionFraud Flakyness

[afine] ZOOKEEPER-2967: Add check to validate dataDir and dataLogDir parameters

[afine] ZOOKEEPER-2978: fix potential null pointer exception when deleting node

[afine] ZOOKEEPER-2845: Apply commit log when restarting server.

[afine] ZOOKEEPER-2936: Removed duplicate code

[hanm] ZOOKEEPER-2992: The eclipse build target fails due to protocol

[afine] ZOOKEEPER-2962: Removed Unused method.

[afine] Preparing for release 3.4.12

[afine] Preparing for release 3.4.12 RC 1

[phunt] ZOOKEEPER-2415: SessionTest is using Thread deprecated API. (branch-3.4)

[afine] Prepare for the next release: update the version to 3.4.13-SNAPSHOT

[phunt] ZOOKEEPER-2994: Tool required to recover log and snapshot entries with

[phunt] ZOOKEEPER-3007: Potential NPE in ReferenceCountedACLCache#deserialize

[phunt] ZOOKEEPER-3027: Accidently removed public API of

[hanm] ZOOKEEPER-2988: NPE triggered if server receives a vote for a server …

[phunt] ZOOKEEPER-3012: Fix unit test: testDataDirAndDataLogDir should not use

[ashraer] ZOOKEEPER-2959: ignore accepted epoch and LEADERINFO ack from observers

[phunt] ZOOKEEPER-3039: TxnLogToolkit uses Scanner badly (3.4)

[phunt] ZOOKEEPER-2980 Backport ZOOKEEPER-2939 Deal with maxbuffer as it relates

[phunt] ZOOKEEPER-3041: Typo in error message, affects log analysis; charater

[phunt] ZOOKEEPER-2955: Enable Clover code coverage report

[phunt] ZOOKEEPER-3046: added junit timeout to precede 'ant' timeout

[hanm] ZOOKEEPER-2993: Removed 'generated' line from .gitignore

[hanm] ZOOKEEPER-2184: Zookeeper Client should re-resolve hosts when connection

[phunt] ZOOKEEPER-3043: QuorumKerberosHostBasedAuthTest fails on Linux box:

[hanm] ZOOKEEPER-2920: Upgrade OWASP Dependency Check to 3.2.1

[phunt] ZOOKEEPER-2968: Add C client code coverage tests

[andor] ZOOKEEPER-3019: add metric for slow fsyncs count

[hanm] Preparing for release 3.4.13

[hanm] Prepare for the next release: update the version to 3.4.14-SNAPSHOT

[andor] ZOOKEEPER-3022: MAVEN MIGRATION 3.4 - Iteration 1 - docs, it

[andor] ZOOKEEPER-3033: branch-3.4 - MAVEN MIGRATION - Step 1.2 - zk-recipes

[andor] ZOOKEEPER-3042: testFailedTxnAsPartOfQuorumLoss is flaky

[phunt] ZOOKEEPER-3046: increased test timeout

[phunt] ZOOKEEPER-3077: build outside of source directory

[hanm] ZOOKEEPER-3009: fix the related bugs in branch-3.4

[phunt] ZOOKEEPER-3062: mention fsync.warningthresholdms in FileTxnLog LOG.warn

[andor] ZOOKEEPER-3030: MAVEN MIGRATION 3.4 - Step 1.3 - move contrib

[andor] ZOOKEEPER-3120: add NetBeans nbproject directory to .gitignore

[andor] ZOOKEEPER-3033: create maven structure for recipes

[andor] ZOOKEEPER-3031: 3.4: MAVEN MIGRATION - move client dir

[andor] ZOOKEEPER-3080_3.4: MAVEN MIGRATION - Step 1.5 - move jute dir

[andor] ZOOKEEPER-3148: Add Kerberos tests for modern JDKs

[andor] ZOOKEEPER-3153: Create MarkDown files and build process for them for …

[andor] ZOOKEEPER-3032: MAVEN MIGRATION - branch 3.4 move java server, client

[andor] ZOOKEEPER-3154: Update release process to use the MarkDown solution

[andor] ZOOKEEPER-3032: MAVEN MIGRATION - branch-3.4 - zookeeper-server

[andor] ZOOKEEPER-3156: Add in option to canonicalize host name

[andor] ZOOKEEPER-3155: Remove Forrest XMLs and their build process from the …

[andor] ZOOKEEPER-3162: branch3.4). Broken lock semantics in C client

[phunt] ZOOKEEPER-3230: Add Apache NetBeans Maven project files to .gitignore

[andor] ZOOKEEPER-3217: owasp job flagging slf4j on trunk

[andor] ZOOKEEPER-3029: MAVEN MIGRATION 3.4 -

[andor] ZOOKEEPER-3210: typo in zookeeperInternals doc

[andor] ZOOKEEPER-3226: MAVEN MIGRATION - 3.4 -

[andor] ZOOKEEPER-3171: MAVEN MIGRATION - 3.4 -

[andor] ZOOKEEPER-3122: MAVEN MIGRATION - 3.4 - - pom versions fix

[andor] ZOOKEEPER-3223: Configure Spotbugs - on branch 3.4

[andor] Fix typos

[andor] ZOOKEEPER-3256: Enable OWASP checks to Maven build

[andor] ZOOKEEPER-3265: Fix fileset to match shell scripts and python files i…

[andor] ZOOKEEPER-1392: Request READ or ADMIN permission for getAcl()

[andor] ZOOKEEPER-3122: Bugfix - Change maven java target versions to 1.6

[andor] ZOOKEEPER-3262: Update dependencies flagged by OWASP report

[andor] Prepare for the next release: update the version to 3.4.15-SNAPSHOT

[andor] ZOOKEEPER-3275: Fix release targets: package, tar, mvn-deploy (3.4)

[andor] Fix ant package target: pom.template, zooinspector

[andor] Fix package target: need to copy src/packages folder on 3.4

[andor] ZOOKEEPER-1815: Tolerate incorrectly set system hostname in tests (3.4)

[andor] ZOOKEEPER-3028: MAVEN MIGRATION - 3.4 - Create maven assembly

[andor] ZOOKEEPER-3234: Add Travis-CI configuration file

[andor] Fix for license files and contrib folder during release (3.4)

[phunt] Fix typo in error log message, added missing space

[phunt] Add .ant-targets-build.xml to the ignore list - ant generates this

[phunt] ZOOKEEPER-3253: client should not send requests with cxid=-4, -2, or -1

[phunt] Exclude spotbugs annotations jar from the release

[phunt] Revert "ZOOKEEPER-3253: client should not send requests with cxid=-4,

[phunt] ZOOKEEPER-3253: client should not send requests with cxid=-4, -2, or -1

[andor] ZOOKEEPER-3046: wait for clients to reconnect after restarting server

[phunt] ZOOKEEPER-3304: Maven build of "loggraph" is broken on branch-3.4

[phunt] ZOOKEEPER-2621: ZooKeeper doesn't start on MINGW32 (Windows)

[phunt] Add some python basics to gitignore

[phunt] ZOOKEEPER-3105: Character coding problem occur when create a node using

[nkalmar] ZOOKEEPER-3389: Zookeeper does not export all required packages in OSGi

[hanm] ZOOKEEPER-2894: Memory and completions leak on zookeeper_close

[eolivelli] ZOOKEEPER-3441: OWASP is flagging jackson-databind-2.9.9.jar for CVE-…

[hanm] ZOOKEEPER-1636: cleanup completion list of a failed multi request

[hanm] ZOOKEEPER-2891: Invalid processing of zookeeper_close for mutli-request

[yinfangxi] ZOOKEEPER-3589: 3.4-branch has potential data inconsistency caused by


------------------------------------------
[...truncated 4.37 MB...]
[ERROR] target/classes/org/apache/zookeeper/txn/Txn.java:[97] (blocks) NeedBraces: 'if' construct must use '{}'s.
[ERROR] target/classes/org/apache/zookeeper/txn/Txn.java:[100,3] (design) DesignForExtension: Class 'Txn' looks like designed for extension (can be subclassed), but the method 'equals' does not have javadoc that explains how to do that safely. If class is not designed for extension consider making the class 'Txn' final or making the method 'equals' static/final/abstract/empty, or adding allowed annotation for the method.
[ERROR] target/classes/org/apache/zookeeper/txn/Txn.java:[100,3] (javadoc) JavadocMethod: Missing a Javadoc comment.
[ERROR] target/classes/org/apache/zookeeper/txn/Txn.java:[100,25] (misc) FinalParameters: Parameter peer_ should be final.
[ERROR] target/classes/org/apache/zookeeper/txn/Txn.java:[100,32] (naming) ParameterName: Name 'peer_' must match pattern '^[a-z][a-zA-Z0-9]*$'.
[ERROR] target/classes/org/apache/zookeeper/txn/Txn.java:[109,16] (whitespace) WhitespaceAround: '==' is not followed by whitespace.
[ERROR] target/classes/org/apache/zookeeper/txn/Txn.java:[109,16] (whitespace) WhitespaceAround: '==' is not preceded with whitespace.
[ERROR] target/classes/org/apache/zookeeper/txn/Txn.java:[110] (blocks) NeedBraces: 'if' construct must use '{}'s.
[ERROR] target/classes/org/apache/zookeeper/txn/Txn.java:[111,47] (whitespace) WhitespaceAfter: ',' is not followed by whitespace.
[ERROR] target/classes/org/apache/zookeeper/txn/Txn.java:[112] (blocks) NeedBraces: 'if' construct must use '{}'s.
[ERROR] target/classes/org/apache/zookeeper/txn/Txn.java:[115,3] (design) DesignForExtension: Class 'Txn' looks like designed for extension (can be subclassed), but the method 'hashCode' does not have javadoc that explains how to do that safely. If class is not designed for extension consider making the class 'Txn' final or making the method 'hashCode' static/final/abstract/empty, or adding allowed annotation for the method.
[ERROR] target/classes/org/apache/zookeeper/txn/Txn.java:[115,3] (javadoc) JavadocMethod: Missing a Javadoc comment.
[ERROR] target/classes/org/apache/zookeeper/txn/Txn.java:[116,18] (coding) MagicNumber: '17' is a magic number.
[ERROR] target/classes/org/apache/zookeeper/txn/Txn.java:[118,15] (whitespace) WhitespaceAfter: 'typecast' is not followed by whitespace.
[ERROR] target/classes/org/apache/zookeeper/txn/Txn.java:[119,14] (coding) MagicNumber: '37' is a magic number.
[ERROR] target/classes/org/apache/zookeeper/txn/Txn.java:[119,16] (whitespace) WhitespaceAround: '*' is not followed by whitespace.
[ERROR] target/classes/org/apache/zookeeper/txn/Txn.java:[119,16] (whitespace) WhitespaceAround: '*' is not preceded with whitespace.
[ERROR] target/classes/org/apache/zookeeper/txn/Txn.java:[121,14] (coding) MagicNumber: '37' is a magic number.
[ERROR] target/classes/org/apache/zookeeper/txn/Txn.java:[121,16] (whitespace) WhitespaceAround: '*' is not followed by whitespace.
[ERROR] target/classes/org/apache/zookeeper/txn/Txn.java:[121,16] (whitespace) WhitespaceAround: '*' is not preceded with whitespace.
[ERROR] target/classes/org/apache/zookeeper/txn/Txn.java:[124,3] (javadoc) JavadocMethod: Missing a Javadoc comment.
[ERROR] target/classes/org/apache/zookeeper/txn/MultiTxn.java:[22] (imports) AvoidStarImport: Using the '.*' form of import should be avoided - org.apache.jute.*.
[ERROR] target/classes/org/apache/zookeeper/txn/MultiTxn.java:[24] (javadoc) JavadocType: Missing a Javadoc comment.
[ERROR] target/classes/org/apache/zookeeper/txn/MultiTxn.java:[26,3] (javadoc) JavadocVariable: Missing a Javadoc comment.
[ERROR] target/classes/org/apache/zookeeper/txn/MultiTxn.java:[27,3] (javadoc) JavadocMethod: Missing a Javadoc comment.
[ERROR] target/classes/org/apache/zookeeper/txn/MultiTxn.java:[29,3] (javadoc) JavadocMethod: Missing a Javadoc comment.
[ERROR] target/classes/org/apache/zookeeper/txn/MultiTxn.java:[30,9] (misc) FinalParameters: Parameter txns should be final.
[ERROR] target/classes/org/apache/zookeeper/txn/MultiTxn.java:[30,54] (coding) HiddenField: 'txns' hides a field.
[ERROR] target/classes/org/apache/zookeeper/txn/MultiTxn.java:[31,14] (whitespace) WhitespaceAround: '=' is not followed by whitespace.
[ERROR] target/classes/org/apache/zookeeper/txn/MultiTxn.java:[31,14] (whitespace) WhitespaceAround: '=' is not preceded with whitespace.
[ERROR] target/classes/org/apache/zookeeper/txn/MultiTxn.java:[33,3] (design) DesignForExtension: Class 'MultiTxn' looks like designed for extension (can be subclassed), but the method 'getTxns' does not have javadoc that explains how to do that safely. If class is not designed for extension consider making the class 'MultiTxn' final or making the method 'getTxns' static/final/abstract/empty, or adding allowed annotation for the method.
[ERROR] target/classes/org/apache/zookeeper/txn/MultiTxn.java:[33,3] (javadoc) JavadocMethod: Missing a Javadoc comment.
[ERROR] target/classes/org/apache/zookeeper/txn/MultiTxn.java:[36,3] (design) DesignForExtension: Class 'MultiTxn' looks like designed for extension (can be subclassed), but the method 'setTxns' does not have javadoc that explains how to do that safely. If class is not designed for extension consider making the class 'MultiTxn' final or making the method 'setTxns' static/final/abstract/empty, or adding allowed annotation for the method.
[ERROR] target/classes/org/apache/zookeeper/txn/MultiTxn.java:[36,3] (javadoc) JavadocMethod: Missing a Javadoc comment.
[ERROR] target/classes/org/apache/zookeeper/txn/MultiTxn.java:[36,23] (misc) FinalParameters: Parameter m_ should be final.
[ERROR] target/classes/org/apache/zookeeper/txn/MultiTxn.java:[36,68] (naming) ParameterName: Name 'm_' must match pattern '^[a-z][a-zA-Z0-9]*$'.
[ERROR] target/classes/org/apache/zookeeper/txn/MultiTxn.java:[37,9] (whitespace) WhitespaceAround: '=' is not followed by whitespace.
[ERROR] target/classes/org/apache/zookeeper/txn/MultiTxn.java:[37,9] (whitespace) WhitespaceAround: '=' is not preceded with whitespace.
[ERROR] target/classes/org/apache/zookeeper/txn/MultiTxn.java:[39] (sizes) LineLength: Line is longer than 80 characters (found 82).
[ERROR] target/classes/org/apache/zookeeper/txn/MultiTxn.java:[39,3] (design) DesignForExtension: Class 'MultiTxn' looks like designed for extension (can be subclassed), but the method 'serialize' does not have javadoc that explains how to do that safely. If class is not designed for extension consider making the class 'MultiTxn' final or making the method 'serialize' static/final/abstract/empty, or adding allowed annotation for the method.
[ERROR] target/classes/org/apache/zookeeper/txn/MultiTxn.java:[39,3] (javadoc) JavadocMethod: Missing a Javadoc comment.
[ERROR] target/classes/org/apache/zookeeper/txn/MultiTxn.java:[39,25] (misc) FinalParameters: Parameter a_ should be final.
[ERROR] target/classes/org/apache/zookeeper/txn/MultiTxn.java:[39,39] (naming) ParameterName: Name 'a_' must match pattern '^[a-z][a-zA-Z0-9]*$'.
[ERROR] target/classes/org/apache/zookeeper/txn/MultiTxn.java:[39,43] (misc) FinalParameters: Parameter tag should be final.
[ERROR] target/classes/org/apache/zookeeper/txn/MultiTxn.java:[40,24] (whitespace) WhitespaceAfter: ',' is not followed by whitespace.
[ERROR] target/classes/org/apache/zookeeper/txn/MultiTxn.java:[41,5] (blocks) AvoidNestedBlocks: Avoid nested blocks.
[ERROR] target/classes/org/apache/zookeeper/txn/MultiTxn.java:[42,26] (whitespace) WhitespaceAfter: ',' is not followed by whitespace.
[ERROR] target/classes/org/apache/zookeeper/txn/MultiTxn.java:[43,15] (whitespace) WhitespaceAround: '!=' is not preceded with whitespace.
[ERROR] target/classes/org/apache/zookeeper/txn/MultiTxn.java:[43,24] (blocks) LeftCurly: '{' at column 24 should have line break after.
[ERROR] target/classes/org/apache/zookeeper/txn/MultiTxn.java:[44,11] (whitespace) WhitespaceAfter: 'for' is not followed by whitespace.
[ERROR] target/classes/org/apache/zookeeper/txn/MultiTxn.java:[44,35] (whitespace) WhitespaceAround: '<' is not followed by whitespace.
[ERROR] target/classes/org/apache/zookeeper/txn/MultiTxn.java:[44,35] (whitespace) WhitespaceAround: '<' is not preceded with whitespace.
[ERROR] target/classes/org/apache/zookeeper/txn/MultiTxn.java:[45] (sizes) LineLength: Line is longer than 80 characters (found 93).
[ERROR] target/classes/org/apache/zookeeper/txn/MultiTxn.java:[46,22] (whitespace) WhitespaceAfter: ',' is not followed by whitespace.
[ERROR] target/classes/org/apache/zookeeper/txn/MultiTxn.java:[49,24] (whitespace) WhitespaceAfter: ',' is not followed by whitespace.
[ERROR] target/classes/org/apache/zookeeper/txn/MultiTxn.java:[51,22] (whitespace) WhitespaceAfter: ',' is not followed by whitespace.
[ERROR] target/classes/org/apache/zookeeper/txn/MultiTxn.java:[53] (sizes) LineLength: Line is longer than 80 characters (found 83).
[ERROR] target/classes/org/apache/zookeeper/txn/MultiTxn.java:[53,3] (design) DesignForExtension: Class 'MultiTxn' looks like designed for extension (can be subclassed), but the method 'deserialize' does not have javadoc that explains how to do that safely. If class is not designed for extension consider making the class 'MultiTxn' final or making the method 'deserialize' static/final/abstract/empty, or adding allowed annotation for the method.
[ERROR] target/classes/org/apache/zookeeper/txn/MultiTxn.java:[53,3] (javadoc) JavadocMethod: Missing a Javadoc comment.
[ERROR] target/classes/org/apache/zookeeper/txn/MultiTxn.java:[53,27] (misc) FinalParameters: Parameter a_ should be final.
[ERROR] target/classes/org/apache/zookeeper/txn/MultiTxn.java:[53,40] (naming) ParameterName: Name 'a_' must match pattern '^[a-z][a-zA-Z0-9]*$'.
[ERROR] target/classes/org/apache/zookeeper/txn/MultiTxn.java:[53,44] (misc) FinalParameters: Parameter tag should be final.
[ERROR] target/classes/org/apache/zookeeper/txn/MultiTxn.java:[55,5] (blocks) AvoidNestedBlocks: Avoid nested blocks.
[ERROR] target/classes/org/apache/zookeeper/txn/MultiTxn.java:[57] (sizes) LineLength: Line is longer than 80 characters (found 96).
[ERROR] target/classes/org/apache/zookeeper/txn/MultiTxn.java:[57,16] (whitespace) WhitespaceAround: '!=' is not preceded with whitespace.
[ERROR] target/classes/org/apache/zookeeper/txn/MultiTxn.java:[57,25] (blocks) LeftCurly: '{' at column 25 should have line break after.
[ERROR] target/classes/org/apache/zookeeper/txn/MultiTxn.java:[57,40] (whitespace) WhitespaceAround: '=' is not followed by whitespace.
[ERROR] target/classes/org/apache/zookeeper/txn/MultiTxn.java:[57,40] (whitespace) WhitespaceAround: '=' is not preceded with whitespace.
[ERROR] target/classes/org/apache/zookeeper/txn/MultiTxn.java:[60,7] (whitespace) WhitespaceAround: '=' is not preceded with whitespace.
[ERROR] target/classes/org/apache/zookeeper/txn/MultiTxn.java:[61,21] (whitespace) WhitespaceAfter: ',' is not followed by whitespace.
[ERROR] target/classes/org/apache/zookeeper/txn/MultiTxn.java:[69,3] (design) DesignForExtension: Class 'MultiTxn' looks like designed for extension (can be subclassed), but the method 'toString' does not have javadoc that explains how to do that safely. If class is not designed for extension consider making the class 'MultiTxn' final or making the method 'toString' static/final/abstract/empty, or adding allowed annotation for the method.
[ERROR] target/classes/org/apache/zookeeper/txn/MultiTxn.java:[69,3] (javadoc) JavadocMethod: Missing a Javadoc comment.
[ERROR] target/classes/org/apache/zookeeper/txn/MultiTxn.java:[73] (regexp) RegexpSingleline: Line has trailing spaces.
[ERROR] target/classes/org/apache/zookeeper/txn/MultiTxn.java:[73,24] (naming) LocalVariableName: Name 'a_' must match pattern '^[a-z][a-zA-Z0-9]*$'.
[ERROR] target/classes/org/apache/zookeeper/txn/MultiTxn.java:[75,26] (whitespace) WhitespaceAfter: ',' is not followed by whitespace.
[ERROR] target/classes/org/apache/zookeeper/txn/MultiTxn.java:[76,5] (blocks) AvoidNestedBlocks: Avoid nested blocks.
[ERROR] target/classes/org/apache/zookeeper/txn/MultiTxn.java:[77,26] (whitespace) WhitespaceAfter: ',' is not followed by whitespace.
[ERROR] target/classes/org/apache/zookeeper/txn/MultiTxn.java:[78,15] (whitespace) WhitespaceAround: '!=' is not preceded with whitespace.
[ERROR] target/classes/org/apache/zookeeper/txn/MultiTxn.java:[78,24] (blocks) LeftCurly: '{' at column 24 should have line break after.
[ERROR] target/classes/org/apache/zookeeper/txn/MultiTxn.java:[79,11] (whitespace) WhitespaceAfter: 'for' is not followed by whitespace.
[ERROR] target/classes/org/apache/zookeeper/txn/MultiTxn.java:[79,35] (whitespace) WhitespaceAround: '<' is not followed by whitespace.
[ERROR] target/classes/org/apache/zookeeper/txn/MultiTxn.java:[79,35] (whitespace) WhitespaceAround: '<' is not preceded with whitespace.
[ERROR] target/classes/org/apache/zookeeper/txn/MultiTxn.java:[80] (sizes) LineLength: Line is longer than 80 characters (found 93).
[ERROR] target/classes/org/apache/zookeeper/txn/MultiTxn.java:[81,22] (whitespace) WhitespaceAfter: ',' is not followed by whitespace.
[ERROR] target/classes/org/apache/zookeeper/txn/MultiTxn.java:[84,24] (whitespace) WhitespaceAfter: ',' is not followed by whitespace.
[ERROR] target/classes/org/apache/zookeeper/txn/MultiTxn.java:[86,24] (whitespace) WhitespaceAfter: ',' is not followed by whitespace.
[ERROR] target/classes/org/apache/zookeeper/txn/MultiTxn.java:[93,3] (design) DesignForExtension: Class 'MultiTxn' looks like designed for extension (can be subclassed), but the method 'write' does not have javadoc that explains how to do that safely. If class is not designed for extension consider making the class 'MultiTxn' final or making the method 'write' static/final/abstract/empty, or adding allowed annotation for the method.
[ERROR] target/classes/org/apache/zookeeper/txn/MultiTxn.java:[93,3] (javadoc) JavadocMethod: Missing a Javadoc comment.
[ERROR] target/classes/org/apache/zookeeper/txn/MultiTxn.java:[93,21] (misc) FinalParameters: Parameter out should be final.
[ERROR] target/classes/org/apache/zookeeper/txn/MultiTxn.java:[97,3] (design) DesignForExtension: Class 'MultiTxn' looks like designed for extension (can be subclassed), but the method 'readFields' does not have javadoc that explains how to do that safely. If class is not designed for extension consider making the class 'MultiTxn' final or making the method 'readFields' static/final/abstract/empty, or adding allowed annotation for the method.
[ERROR] target/classes/org/apache/zookeeper/txn/MultiTxn.java:[97,3] (javadoc) JavadocMethod: Missing a Javadoc comment.
[ERROR] target/classes/org/apache/zookeeper/txn/MultiTxn.java:[97,26] (misc) FinalParameters: Parameter in should be final.
[ERROR] target/classes/org/apache/zookeeper/txn/MultiTxn.java:[101,3] (design) DesignForExtension: Class 'MultiTxn' looks like designed for extension (can be subclassed), but the method 'compareTo' does not have javadoc that explains how to do that safely. If class is not designed for extension consider making the class 'MultiTxn' final or making the method 'compareTo' static/final/abstract/empty, or adding allowed annotation for the method.
[ERROR] target/classes/org/apache/zookeeper/txn/MultiTxn.java:[101,3] (javadoc) JavadocMethod: Missing a Javadoc comment.
[ERROR] target/classes/org/apache/zookeeper/txn/MultiTxn.java:[101,24] (whitespace) MethodParamPad: '(' is preceded with whitespace.
[ERROR] target/classes/org/apache/zookeeper/txn/MultiTxn.java:[101,25] (misc) FinalParameters: Parameter peer_ should be final.
[ERROR] target/classes/org/apache/zookeeper/txn/MultiTxn.java:[101,32] (naming) ParameterName: Name 'peer_' must match pattern '^[a-z][a-zA-Z0-9]*$'.
[ERROR] target/classes/org/apache/zookeeper/txn/MultiTxn.java:[102] (sizes) LineLength: Line is longer than 80 characters (found 83).
[ERROR] target/classes/org/apache/zookeeper/txn/MultiTxn.java:[104,3] (design) DesignForExtension: Class 'MultiTxn' looks like designed for extension (can be subclassed), but the method 'equals' does not have javadoc that explains how to do that safely. If class is not designed for extension consider making the class 'MultiTxn' final or making the method 'equals' static/final/abstract/empty, or adding allowed annotation for the method.
[ERROR] target/classes/org/apache/zookeeper/txn/MultiTxn.java:[104,3] (javadoc) JavadocMethod: Missing a Javadoc comment.
[ERROR] target/classes/org/apache/zookeeper/txn/MultiTxn.java:[104,25] (misc) FinalParameters: Parameter peer_ should be final.
[ERROR] target/classes/org/apache/zookeeper/txn/MultiTxn.java:[104,32] (naming) ParameterName: Name 'peer_' must match pattern '^[a-z][a-zA-Z0-9]*$'.
[ERROR] target/classes/org/apache/zookeeper/txn/MultiTxn.java:[114] (blocks) NeedBraces: 'if' construct must use '{}'s.
[ERROR] target/classes/org/apache/zookeeper/txn/MultiTxn.java:[117,3] (design) DesignForExtension: Class 'MultiTxn' looks like designed for extension (can be subclassed), but the method 'hashCode' does not have javadoc that explains how to do that safely. If class is not designed for extension consider making the class 'MultiTxn' final or making the method 'hashCode' static/final/abstract/empty, or adding allowed annotation for the method.
[ERROR] target/classes/org/apache/zookeeper/txn/MultiTxn.java:[117,3] (javadoc) JavadocMethod: Missing a Javadoc comment.
[ERROR] target/classes/org/apache/zookeeper/txn/MultiTxn.java:[118,18] (coding) MagicNumber: '17' is a magic number.
[ERROR] target/classes/org/apache/zookeeper/txn/MultiTxn.java:[121,14] (coding) MagicNumber: '37' is a magic number.
[ERROR] target/classes/org/apache/zookeeper/txn/MultiTxn.java:[121,16] (whitespace) WhitespaceAround: '*' is not followed by whitespace.
[ERROR] target/classes/org/apache/zookeeper/txn/MultiTxn.java:[121,16] (whitespace) WhitespaceAround: '*' is not preceded with whitespace.
[ERROR] target/classes/org/apache/zookeeper/txn/MultiTxn.java:[124,3] (javadoc) JavadocMethod: Missing a Javadoc comment.
[ERROR] target/classes/org/apache/zookeeper/txn/ErrorTxn.java:[22] (imports) AvoidStarImport: Using the '.*' form of import should be avoided - org.apache.jute.*.
[ERROR] target/classes/org/apache/zookeeper/txn/ErrorTxn.java:[24] (javadoc) JavadocType: Missing a Javadoc comment.
[ERROR] target/classes/org/apache/zookeeper/txn/ErrorTxn.java:[26,3] (javadoc) JavadocVariable: Missing a Javadoc comment.
[ERROR] target/classes/org/apache/zookeeper/txn/ErrorTxn.java:[27,3] (javadoc) JavadocMethod: Missing a Javadoc comment.
[ERROR] target/classes/org/apache/zookeeper/txn/ErrorTxn.java:[29,3] (javadoc) JavadocMethod: Missing a Javadoc comment.
[ERROR] target/classes/org/apache/zookeeper/txn/ErrorTxn.java:[30,9] (misc) FinalParameters: Parameter err should be final.
[ERROR] target/classes/org/apache/zookeeper/txn/ErrorTxn.java:[30,13] (coding) HiddenField: 'err' hides a field.
[ERROR] target/classes/org/apache/zookeeper/txn/ErrorTxn.java:[31,13] (whitespace) WhitespaceAround: '=' is not followed by whitespace.
[ERROR] target/classes/org/apache/zookeeper/txn/ErrorTxn.java:[31,13] (whitespace) WhitespaceAround: '=' is not preceded with whitespace.
[ERROR] target/classes/org/apache/zookeeper/txn/ErrorTxn.java:[33,3] (design) DesignForExtension: Class 'ErrorTxn' looks like designed for extension (can be subclassed), but the method 'getErr' does not have javadoc that explains how to do that safely. If class is not designed for extension consider making the class 'ErrorTxn' final or making the method 'getErr' static/final/abstract/empty, or adding allowed annotation for the method.
[ERROR] target/classes/org/apache/zookeeper/txn/ErrorTxn.java:[33,3] (javadoc) JavadocMethod: Missing a Javadoc comment.
[ERROR] target/classes/org/apache/zookeeper/txn/ErrorTxn.java:[36,3] (design) DesignForExtension: Class 'ErrorTxn' looks like designed for extension (can be subclassed), but the method 'setErr' does not have javadoc that explains how to do that safely. If class is not designed for extension consider making the class 'ErrorTxn' final or making the method 'setErr' static/final/abstract/empty, or adding allowed annotation for the method.
[ERROR] target/classes/org/apache/zookeeper/txn/ErrorTxn.java:[36,3] (javadoc) JavadocMethod: Missing a Javadoc comment.
[ERROR] target/classes/org/apache/zookeeper/txn/ErrorTxn.java:[36,22] (misc) FinalParameters: Parameter m_ should be final.
[ERROR] target/classes/org/apache/zookeeper/txn/ErrorTxn.java:[36,26] (naming) ParameterName: Name 'm_' must match pattern '^[a-z][a-zA-Z0-9]*$'.
[ERROR] target/classes/org/apache/zookeeper/txn/ErrorTxn.java:[37,8] (whitespace) WhitespaceAround: '=' is not followed by whitespace.
[ERROR] target/classes/org/apache/zookeeper/txn/ErrorTxn.java:[37,8] (whitespace) WhitespaceAround: '=' is not preceded with whitespace.
[ERROR] target/classes/org/apache/zookeeper/txn/ErrorTxn.java:[39] (sizes) LineLength: Line is longer than 80 characters (found 82).
[ERROR] target/classes/org/apache/zookeeper/txn/ErrorTxn.java:[39,3] (design) DesignForExtension: Class 'ErrorTxn' looks like designed for extension (can be subclassed), but the method 'serialize' does not have javadoc that explains how to do that safely. If class is not designed for extension consider making the class 'ErrorTxn' final or making the method 'serialize' static/final/abstract/empty, or adding allowed annotation for the method.
[ERROR] target/classes/org/apache/zookeeper/txn/ErrorTxn.java:[39,3] (javadoc) JavadocMethod: Missing a Javadoc comment.
[ERROR] target/classes/org/apache/zookeeper/txn/ErrorTxn.java:[39,25] (misc) FinalParameters: Parameter a_ should be final.
[ERROR] target/classes/org/apache/zookeeper/txn/ErrorTxn.java:[39,39] (naming) ParameterName: Name 'a_' must match pattern '^[a-z][a-zA-Z0-9]*$'.
[ERROR] target/classes/org/apache/zookeeper/txn/ErrorTxn.java:[39,43] (misc) FinalParameters: Parameter tag should be final.
[ERROR] target/classes/org/apache/zookeeper/txn/ErrorTxn.java:[40,24] (whitespace) WhitespaceAfter: ',' is not followed by whitespace.
[ERROR] target/classes/org/apache/zookeeper/txn/ErrorTxn.java:[41,20] (whitespace) WhitespaceAfter: ',' is not followed by whitespace.
[ERROR] target/classes/org/apache/zookeeper/txn/ErrorTxn.java:[42,22] (whitespace) WhitespaceAfter: ',' is not followed by whitespace.
[ERROR] target/classes/org/apache/zookeeper/txn/ErrorTxn.java:[44] (sizes) LineLength: Line is longer than 80 characters (found 83).
[ERROR] target/classes/org/apache/zookeeper/txn/ErrorTxn.java:[44,3] (design) DesignForExtension: Class 'ErrorTxn' looks like designed for extension (can be subclassed), but the method 'deserialize' does not have javadoc that explains how to do that safely. If class is not designed for extension consider making the class 'ErrorTxn' final or making the method 'deserialize' static/final/abstract/empty, or adding allowed annotation for the method.
[ERROR] target/classes/org/apache/zookeeper/txn/ErrorTxn.java:[44,3] (javadoc) JavadocMethod: Missing a Javadoc comment.
[ERROR] target/classes/org/apache/zookeeper/txn/ErrorTxn.java:[44,27] (misc) FinalParameters: Parameter a_ should be final.
[ERROR] target/classes/org/apache/zookeeper/txn/ErrorTxn.java:[44,40] (naming) ParameterName: Name 'a_' must match pattern '^[a-z][a-zA-Z0-9]*$'.
[ERROR] target/classes/org/apache/zookeeper/txn/ErrorTxn.java:[44,44] (misc) FinalParameters: Parameter tag should be final.
[ERROR] target/classes/org/apache/zookeeper/txn/ErrorTxn.java:[46,8] (whitespace) WhitespaceAround: '=' is not followed by whitespace.
[ERROR] target/classes/org/apache/zookeeper/txn/ErrorTxn.java:[46,8] (whitespace) WhitespaceAround: '=' is not preceded with whitespace.
[ERROR] target/classes/org/apache/zookeeper/txn/ErrorTxn.java:[49,3] (design) DesignForExtension: Class 'ErrorTxn' looks like designed for extension (can be subclassed), but the method 'toString' does not have javadoc that explains how to do that safely. If class is not designed for extension consider making the class 'ErrorTxn' final or making the method 'toString' static/final/abstract/empty, or adding allowed annotation for the method.
[ERROR] target/classes/org/apache/zookeeper/txn/ErrorTxn.java:[49,3] (javadoc) JavadocMethod: Missing a Javadoc comment.
[ERROR] target/classes/org/apache/zookeeper/txn/ErrorTxn.java:[53] (regexp) RegexpSingleline: Line has trailing spaces.
[ERROR] target/classes/org/apache/zookeeper/txn/ErrorTxn.java:[53,24] (naming) LocalVariableName: Name 'a_' must match pattern '^[a-z][a-zA-Z0-9]*$'.
[ERROR] target/classes/org/apache/zookeeper/txn/ErrorTxn.java:[55,26] (whitespace) WhitespaceAfter: ',' is not followed by whitespace.
[ERROR] target/classes/org/apache/zookeeper/txn/ErrorTxn.java:[56,20] (whitespace) WhitespaceAfter: ',' is not followed by whitespace.
[ERROR] target/classes/org/apache/zookeeper/txn/ErrorTxn.java:[57,24] (whitespace) WhitespaceAfter: ',' is not followed by whitespace.
[ERROR] target/classes/org/apache/zookeeper/txn/ErrorTxn.java:[64,3] (design) DesignForExtension: Class 'ErrorTxn' looks like designed for extension (can be subclassed), but the method 'write' does not have javadoc that explains how to do that safely. If class is not designed for extension consider making the class 'ErrorTxn' final or making the method 'write' static/final/abstract/empty, or adding allowed annotation for the method.
[ERROR] target/classes/org/apache/zookeeper/txn/ErrorTxn.java:[64,3] (javadoc) JavadocMethod: Missing a Javadoc comment.
[ERROR] target/classes/org/apache/zookeeper/txn/ErrorTxn.java:[64,21] (misc) FinalParameters: Parameter out should be final.
[ERROR] target/classes/org/apache/zookeeper/txn/ErrorTxn.java:[68,3] (design) DesignForExtension: Class 'ErrorTxn' looks like designed for extension (can be subclassed), but the method 'readFields' does not have javadoc that explains how to do that safely. If class is not designed for extension consider making the class 'ErrorTxn' final or making the method 'readFields' static/final/abstract/empty, or adding allowed annotation for the method.
[ERROR] target/classes/org/apache/zookeeper/txn/ErrorTxn.java:[68,3] (javadoc) JavadocMethod: Missing a Javadoc comment.
[ERROR] target/classes/org/apache/zookeeper/txn/ErrorTxn.java:[68,26] (misc) FinalParameters: Parameter in should be final.
[ERROR] target/classes/org/apache/zookeeper/txn/ErrorTxn.java:[72,3] (design) DesignForExtension: Class 'ErrorTxn' looks like designed for extension (can be subclassed), but the method 'compareTo' does not have javadoc that explains how to do that safely. If class is not designed for extension consider making the class 'ErrorTxn' final or making the method 'compareTo' static/final/abstract/empty, or adding allowed annotation for the method.
[ERROR] target/classes/org/apache/zookeeper/txn/ErrorTxn.java:[72,3] (javadoc) JavadocMethod: Missing a Javadoc comment.
[ERROR] target/classes/org/apache/zookeeper/txn/ErrorTxn.java:[72,24] (whitespace) MethodParamPad: '(' is preceded with whitespace.
[ERROR] target/classes/org/apache/zookeeper/txn/ErrorTxn.java:[72,25] (misc) FinalParameters: Parameter peer_ should be final.
[ERROR] target/classes/org/apache/zookeeper/txn/ErrorTxn.java:[72,32] (naming) ParameterName: Name 'peer_' must match pattern '^[a-z][a-zA-Z0-9]*$'.
[ERROR] target/classes/org/apache/zookeeper/txn/ErrorTxn.java:[78,28] (whitespace) WhitespaceAround: '?' is not preceded with whitespace.
[ERROR] target/classes/org/apache/zookeeper/txn/ErrorTxn.java:[78,32] (whitespace) WhitespaceAround: ':' is not followed by whitespace.
[ERROR] target/classes/org/apache/zookeeper/txn/ErrorTxn.java:[78,38] (whitespace) WhitespaceAround: '<' is not followed by whitespace.
[ERROR] target/classes/org/apache/zookeeper/txn/ErrorTxn.java:[78,38] (whitespace) WhitespaceAround: '<' is not preceded with whitespace.
[ERROR] target/classes/org/apache/zookeeper/txn/ErrorTxn.java:[78,48] (whitespace) WhitespaceAround: '?' is not followed by whitespace.
[ERROR] target/classes/org/apache/zookeeper/txn/ErrorTxn.java:[78,48] (whitespace) WhitespaceAround: '?' is not preceded with whitespace.
[ERROR] target/classes/org/apache/zookeeper/txn/ErrorTxn.java:[78,51] (whitespace) WhitespaceAround: ':' is not followed by whitespace.
[ERROR] target/classes/org/apache/zookeeper/txn/ErrorTxn.java:[78,51] (whitespace) WhitespaceAround: ':' is not preceded with whitespace.
[ERROR] target/classes/org/apache/zookeeper/txn/ErrorTxn.java:[79] (blocks) NeedBraces: 'if' construct must use '{}'s.
[ERROR] target/classes/org/apache/zookeeper/txn/ErrorTxn.java:[82,3] (design) DesignForExtension: Class 'ErrorTxn' looks like designed for extension (can be subclassed), but the method 'equals' does not have javadoc that explains how to do that safely. If class is not designed for extension consider making the class 'ErrorTxn' final or making the method 'equals' static/final/abstract/empty, or adding allowed annotation for the method.
[ERROR] target/classes/org/apache/zookeeper/txn/ErrorTxn.java:[82,3] (javadoc) JavadocMethod: Missing a Javadoc comment.
[ERROR] target/classes/org/apache/zookeeper/txn/ErrorTxn.java:[82,25] (misc) FinalParameters: Parameter peer_ should be final.
[ERROR] target/classes/org/apache/zookeeper/txn/ErrorTxn.java:[82,32] (naming) ParameterName: Name 'peer_' must match pattern '^[a-z][a-zA-Z0-9]*$'.
[ERROR] target/classes/org/apache/zookeeper/txn/ErrorTxn.java:[91,15] (whitespace) WhitespaceAround: '==' is not followed by whitespace.
[ERROR] target/classes/org/apache/zookeeper/txn/ErrorTxn.java:[91,15] (whitespace) WhitespaceAround: '==' is not preceded with whitespace.
[ERROR] target/classes/org/apache/zookeeper/txn/ErrorTxn.java:[92] (blocks) NeedBraces: 'if' construct must use '{}'s.
[ERROR] target/classes/org/apache/zookeeper/txn/ErrorTxn.java:[95,3] (design) DesignForExtension: Class 'ErrorTxn' looks like designed for extension (can be subclassed), but the method 'hashCode' does not have javadoc that explains how to do that safely. If class is not designed for extension consider making the class 'ErrorTxn' final or making the method 'hashCode' static/final/abstract/empty, or adding allowed annotation for the method.
[ERROR] target/classes/org/apache/zookeeper/txn/ErrorTxn.java:[95,3] (javadoc) JavadocMethod: Missing a Javadoc comment.
[ERROR] target/classes/org/apache/zookeeper/txn/ErrorTxn.java:[96,18] (coding) MagicNumber: '17' is a magic number.
[ERROR] target/classes/org/apache/zookeeper/txn/ErrorTxn.java:[98,15] (whitespace) WhitespaceAfter: 'typecast' is not followed by whitespace.
[ERROR] target/classes/org/apache/zookeeper/txn/ErrorTxn.java:[99,14] (coding) MagicNumber: '37' is a magic number.
[ERROR] target/classes/org/apache/zookeeper/txn/ErrorTxn.java:[99,16] (whitespace) WhitespaceAround: '*' is not followed by whitespace.
[ERROR] target/classes/org/apache/zookeeper/txn/ErrorTxn.java:[99,16] (whitespace) WhitespaceAround: '*' is not preceded with whitespace.
[ERROR] target/classes/org/apache/zookeeper/txn/ErrorTxn.java:[102,3] (javadoc) JavadocMethod: Missing a Javadoc comment.
[INFO] ------------------------------------------------------------------------
[INFO] Reactor Summary for Apache ZooKeeper 3.4.14-SNAPSHOT:
[INFO] 
[INFO] Apache ZooKeeper ................................... SUCCESS [ 24.350 s]
[INFO] Apache ZooKeeper - Documentation ................... SUCCESS [ 10.561 s]
[INFO] Apache ZooKeeper - Jute ............................ FAILURE [01:19 min]
[INFO] Apache ZooKeeper - Server .......................... SKIPPED
[INFO] Apache ZooKeeper - Client .......................... SKIPPED
[INFO] Apache ZooKeeper - Client - C ...................... SKIPPED
[INFO] Apache ZooKeeper - Recipes ......................... SKIPPED
[INFO] Apache ZooKeeper - Recipes - Election .............. SKIPPED
[INFO] Apache ZooKeeper - Recipes - Lock .................. SKIPPED
[INFO] Apache ZooKeeper - Recipes - Queue ................. SKIPPED
[INFO] Apache ZooKeeper - Contrib ......................... SKIPPED
[INFO] Apache ZooKeeper - Contrib - Loggraph .............. SKIPPED
[INFO] Apache ZooKeeper - Contrib - Rest .................. SKIPPED
[INFO] Apache ZooKeeper - Contrib - ZooInspector .......... SKIPPED
[INFO] ------------------------------------------------------------------------
[INFO] BUILD FAILURE
[INFO] ------------------------------------------------------------------------
[INFO] Total time:  02:29 min
[INFO] Finished at: 2019-10-25T12:00:29Z
[INFO] ------------------------------------------------------------------------
Waiting for Jenkins to finish collecting data
[ERROR] Failed to execute goal org.apache.maven.plugins:maven-checkstyle-plugin:3.1.0:check (default-cli) on project zookeeper-jute: You have 11800 Checkstyle violations. -> [Help 1]
[ERROR] 
[ERROR] To see the full stack trace of the errors, re-run Maven with the -e switch.
[ERROR] Re-run Maven using the -X switch to enable full debug logging.
[ERROR] 
[ERROR] For more information about the errors and possible solutions, please read the following articles:
[ERROR] [Help 1] http://cwiki.apache.org/confluence/display/MAVEN/MojoFailureException
[ERROR] 
[ERROR] After correcting the problems, you can resume the build with the command
[ERROR]   mvn <goals> -rf :zookeeper-jute
[JENKINS] Archiving <https://builds.apache.org/job/PreCommit-ZOOKEEPER-github-pr-build-maven/ws/pom.xml> to org.apache.zookeeper/zookeeper/3.4.14-SNAPSHOT/zookeeper-3.4.14-SNAPSHOT.pom
[JENKINS] Archiving <https://builds.apache.org/job/PreCommit-ZOOKEEPER-github-pr-build-maven/ws/target/zookeeper-3.4.14-SNAPSHOT-source-package.tar.gz> to org.apache.zookeeper/zookeeper/3.4.14-SNAPSHOT/zookeeper-3.4.14-SNAPSHOT-source-package.tar.gz
[JENKINS] Archiving <https://builds.apache.org/job/PreCommit-ZOOKEEPER-github-pr-build-maven/ws/target/zookeeper-3.4.14-SNAPSHOT-source-package.zip> to org.apache.zookeeper/zookeeper/3.4.14-SNAPSHOT/zookeeper-3.4.14-SNAPSHOT-source-package.zip
[JENKINS] Archiving <https://builds.apache.org/job/PreCommit-ZOOKEEPER-github-pr-build-maven/ws/zookeeper-contrib/zookeeper-contrib-loggraph/pom.xml> to org.apache.zookeeper/zookeeper-contrib-loggraph/3.4.14-SNAPSHOT/zookeeper-contrib-loggraph-3.4.14-SNAPSHOT.pom
[JENKINS] Archiving <https://builds.apache.org/job/PreCommit-ZOOKEEPER-github-pr-build-maven/ws/zookeeper-recipes/zookeeper-recipes-election/pom.xml> to org.apache.zookeeper/zookeeper-recipes-election/3.4.14-SNAPSHOT/zookeeper-recipes-election-3.4.14-SNAPSHOT.pom
[JENKINS] Archiving <https://builds.apache.org/job/PreCommit-ZOOKEEPER-github-pr-build-maven/ws/zookeeper-recipes/zookeeper-recipes-lock/pom.xml> to org.apache.zookeeper/zookeeper-recipes-lock/3.4.14-SNAPSHOT/zookeeper-recipes-lock-3.4.14-SNAPSHOT.pom
[JENKINS] Archiving <https://builds.apache.org/job/PreCommit-ZOOKEEPER-github-pr-build-maven/ws/zookeeper-contrib/pom.xml> to org.apache.zookeeper/zookeeper-contrib/3.4.14-SNAPSHOT/zookeeper-contrib-3.4.14-SNAPSHOT.pom
[JENKINS] Archiving <https://builds.apache.org/job/PreCommit-ZOOKEEPER-github-pr-build-maven/ws/zookeeper-client/pom.xml> to org.apache.zookeeper/zookeeper-client/3.4.14-SNAPSHOT/zookeeper-client-3.4.14-SNAPSHOT.pom
[JENKINS] Archiving <https://builds.apache.org/job/PreCommit-ZOOKEEPER-github-pr-build-maven/ws/zookeeper-jute/pom.xml> to org.apache.zookeeper/zookeeper-jute/3.4.14-SNAPSHOT/zookeeper-jute-3.4.14-SNAPSHOT.pom
[JENKINS] Archiving <https://builds.apache.org/job/PreCommit-ZOOKEEPER-github-pr-build-maven/ws/zookeeper-jute/target/zookeeper-jute-3.4.14-SNAPSHOT.jar> to org.apache.zookeeper/zookeeper-jute/3.4.14-SNAPSHOT/zookeeper-jute-3.4.14-SNAPSHOT.jar
[JENKINS] Archiving <https://builds.apache.org/job/PreCommit-ZOOKEEPER-github-pr-build-maven/ws/zookeeper-jute/target/zookeeper-jute-3.4.14-SNAPSHOT-tests.jar> to org.apache.zookeeper/zookeeper-jute/3.4.14-SNAPSHOT/zookeeper-jute-3.4.14-SNAPSHOT-tests.jar
[JENKINS] Archiving <https://builds.apache.org/job/PreCommit-ZOOKEEPER-github-pr-build-maven/ws/zookeeper-jute/target/zookeeper-jute-3.4.14-SNAPSHOT-sources.jar> to org.apache.zookeeper/zookeeper-jute/3.4.14-SNAPSHOT/zookeeper-jute-3.4.14-SNAPSHOT-sources.jar
[JENKINS] Archiving <https://builds.apache.org/job/PreCommit-ZOOKEEPER-github-pr-build-maven/ws/zookeeper-jute/target/zookeeper-jute-3.4.14-SNAPSHOT-javadoc.jar> to org.apache.zookeeper/zookeeper-jute/3.4.14-SNAPSHOT/zookeeper-jute-3.4.14-SNAPSHOT-javadoc.jar
[JENKINS] Archiving <https://builds.apache.org/job/PreCommit-ZOOKEEPER-github-pr-build-maven/ws/zookeeper-recipes/zookeeper-recipes-queue/pom.xml> to org.apache.zookeeper/zookeeper-recipes-queue/3.4.14-SNAPSHOT/zookeeper-recipes-queue-3.4.14-SNAPSHOT.pom
[JENKINS] Archiving <https://builds.apache.org/job/PreCommit-ZOOKEEPER-github-pr-build-maven/ws/zookeeper-docs/pom.xml> to org.apache.zookeeper/zookeeper-docs/3.4.14-SNAPSHOT/zookeeper-docs-3.4.14-SNAPSHOT.pom
[JENKINS] Archiving <https://builds.apache.org/job/PreCommit-ZOOKEEPER-github-pr-build-maven/ws/zookeeper-docs/target/zookeeper-docs-3.4.14-SNAPSHOT.jar> to org.apache.zookeeper/zookeeper-docs/3.4.14-SNAPSHOT/zookeeper-docs-3.4.14-SNAPSHOT.jar
[JENKINS] Archiving <https://builds.apache.org/job/PreCommit-ZOOKEEPER-github-pr-build-maven/ws/zookeeper-docs/target/zookeeper-docs-3.4.14-SNAPSHOT-tests.jar> to org.apache.zookeeper/zookeeper-docs/3.4.14-SNAPSHOT/zookeeper-docs-3.4.14-SNAPSHOT-tests.jar
[JENKINS] Archiving <https://builds.apache.org/job/PreCommit-ZOOKEEPER-github-pr-build-maven/ws/zookeeper-docs/target/zookeeper-docs-3.4.14-SNAPSHOT-sources.jar> to org.apache.zookeeper/zookeeper-docs/3.4.14-SNAPSHOT/zookeeper-docs-3.4.14-SNAPSHOT-sources.jar
[JENKINS] Archiving <https://builds.apache.org/job/PreCommit-ZOOKEEPER-github-pr-build-maven/ws/zookeeper-recipes/pom.xml> to org.apache.zookeeper/zookeeper-recipes/3.4.14-SNAPSHOT/zookeeper-recipes-3.4.14-SNAPSHOT.pom
[JENKINS] Archiving <https://builds.apache.org/job/PreCommit-ZOOKEEPER-github-pr-build-maven/ws/zookeeper-client/zookeeper-client-c/pom.xml> to org.apache.zookeeper/zookeeper-client-c/3.4.14-SNAPSHOT/zookeeper-client-c-3.4.14-SNAPSHOT.pom
[JENKINS] Archiving <https://builds.apache.org/job/PreCommit-ZOOKEEPER-github-pr-build-maven/ws/zookeeper-contrib/zookeeper-contrib-rest/pom.xml> to org.apache.zookeeper/zookeeper-contrib-rest/3.4.14-SNAPSHOT/zookeeper-contrib-rest-3.4.14-SNAPSHOT.pom
[JENKINS] Archiving <https://builds.apache.org/job/PreCommit-ZOOKEEPER-github-pr-build-maven/ws/zookeeper-server/pom.xml> to org.apache.zookeeper/zookeeper-server/3.4.14-SNAPSHOT/zookeeper-server-3.4.14-SNAPSHOT.pom
[Fast Archiver] No prior successful build to compare, so performing full copy of artifacts
[JENKINS] Archiving <https://builds.apache.org/job/PreCommit-ZOOKEEPER-github-pr-build-maven/ws/zookeeper-contrib/zookeeper-contrib-zooinspector/pom.xml> to org.apache.zookeeper/zookeeper-contrib-zooinspector/3.4.14-SNAPSHOT/zookeeper-contrib-zooinspector-3.4.14-SNAPSHOT.pom
channel stopped
[SpotBugs] Skipping execution of recorder since overall result is 'FAILURE'
Setting status of ba1a702c4121c5b90cce656222d28c64dc6d6543 to FAILURE with url https://builds.apache.org/job/PreCommit-ZOOKEEPER-github-pr-build-maven/1484/ and message: 'FAILURE
 '
Using context: JenkinsMaven

Mime
View raw message