zookeeper-dev mailing list archives

Site index · List index
Message view « Date » · « Thread »
Top « Date » · « Thread »
From Apache Jenkins Server <jenk...@builds.apache.org>
Subject Build failed in Jenkins: PreCommit-ZOOKEEPER-github-pr-build-maven #1071
Date Thu, 08 Aug 2019 17:08:35 GMT
See <https://builds.apache.org/job/PreCommit-ZOOKEEPER-github-pr-build-maven/1071/display/redirect>

------------------------------------------
[...truncated 4.73 MB...]
[ERROR] target/classes/org/apache/jute/compiler/generated/Rcc.java:[768,29] (coding) InnerAssignment:
Inner assignments should be avoided.
[ERROR] target/classes/org/apache/jute/compiler/generated/Rcc.java:[775] (javadoc) JavadocMethod:
Expected @return tag.
[ERROR] target/classes/org/apache/jute/compiler/generated/Rcc.java:[775,9] (modifier) ModifierOrder:
'public' modifier out of order with the JLS suggestions.
[ERROR] target/classes/org/apache/jute/compiler/generated/Rcc.java:[775,31] (misc) FinalParameters:
Parameter index should be final.
[ERROR] target/classes/org/apache/jute/compiler/generated/Rcc.java:[775,35] (javadoc) JavadocMethod:
Expected @param tag for 'index'.
[ERROR] target/classes/org/apache/jute/compiler/generated/Rcc.java:[778] (blocks) NeedBraces:
'if' construct must use '{}'s.
[ERROR] target/classes/org/apache/jute/compiler/generated/Rcc.java:[779] (blocks) NeedBraces:
'else' construct must use '{}'s.
[ERROR] target/classes/org/apache/jute/compiler/generated/Rcc.java:[779,23] (coding) InnerAssignment:
Inner assignments should be avoided.
[ERROR] target/classes/org/apache/jute/compiler/generated/Rcc.java:[784,3] (javadoc) JavadocMethod:
Missing a Javadoc comment.
[ERROR] target/classes/org/apache/jute/compiler/generated/Rcc.java:[784,15] (naming) MethodName:
Name 'jj_ntk' must match pattern '^[a-z][a-zA-Z0-9]*$'.
[ERROR] target/classes/org/apache/jute/compiler/generated/Rcc.java:[785] (blocks) NeedBraces:
'if' construct must use '{}'s.
[ERROR] target/classes/org/apache/jute/compiler/generated/Rcc.java:[785,15] (whitespace) WhitespaceAround:
'=' is not followed by whitespace.
[ERROR] target/classes/org/apache/jute/compiler/generated/Rcc.java:[785,15] (whitespace) WhitespaceAround:
'=' is not preceded with whitespace.
[ERROR] target/classes/org/apache/jute/compiler/generated/Rcc.java:[785,15] (coding) InnerAssignment:
Inner assignments should be avoided.
[ERROR] target/classes/org/apache/jute/compiler/generated/Rcc.java:[786,22] (coding) InnerAssignment:
Inner assignments should be avoided.
[ERROR] target/classes/org/apache/jute/compiler/generated/Rcc.java:[786,35] (whitespace) WhitespaceAround:
'=' is not followed by whitespace.
[ERROR] target/classes/org/apache/jute/compiler/generated/Rcc.java:[786,35] (whitespace) WhitespaceAround:
'=' is not preceded with whitespace.
[ERROR] target/classes/org/apache/jute/compiler/generated/Rcc.java:[786,35] (coding) InnerAssignment:
Inner assignments should be avoided.
[ERROR] target/classes/org/apache/jute/compiler/generated/Rcc.java:[787] (blocks) NeedBraces:
'else' construct must use '{}'s.
[ERROR] target/classes/org/apache/jute/compiler/generated/Rcc.java:[788,22] (coding) InnerAssignment:
Inner assignments should be avoided.
[ERROR] target/classes/org/apache/jute/compiler/generated/Rcc.java:[791] (sizes) LineLength:
Line is longer than 80 characters (found 81).
[ERROR] target/classes/org/apache/jute/compiler/generated/Rcc.java:[791,3] (javadoc) JavadocVariable:
Missing a Javadoc comment.
[ERROR] target/classes/org/apache/jute/compiler/generated/Rcc.java:[791,33] (naming) MemberName:
Name 'jj_expentries' must match pattern '^[a-z][a-zA-Z0-9]*$'.
[ERROR] target/classes/org/apache/jute/compiler/generated/Rcc.java:[792,3] (javadoc) JavadocVariable:
Missing a Javadoc comment.
[ERROR] target/classes/org/apache/jute/compiler/generated/Rcc.java:[792,17] (naming) MemberName:
Name 'jj_expentry' must match pattern '^[a-z][a-zA-Z0-9]*$'.
[ERROR] target/classes/org/apache/jute/compiler/generated/Rcc.java:[793,3] (javadoc) JavadocVariable:
Missing a Javadoc comment.
[ERROR] target/classes/org/apache/jute/compiler/generated/Rcc.java:[793,15] (naming) MemberName:
Name 'jj_kind' must match pattern '^[a-z][a-zA-Z0-9]*$'.
[ERROR] target/classes/org/apache/jute/compiler/generated/Rcc.java:[794,3] (javadoc) JavadocVariable:
Missing a Javadoc comment.
[ERROR] target/classes/org/apache/jute/compiler/generated/Rcc.java:[794,17] (naming) MemberName:
Name 'jj_lasttokens' must match pattern '^[a-z][a-zA-Z0-9]*$'.
[ERROR] target/classes/org/apache/jute/compiler/generated/Rcc.java:[794,41] (coding) MagicNumber:
'100' is a magic number.
[ERROR] target/classes/org/apache/jute/compiler/generated/Rcc.java:[795,3] (javadoc) JavadocVariable:
Missing a Javadoc comment.
[ERROR] target/classes/org/apache/jute/compiler/generated/Rcc.java:[795,15] (naming) MemberName:
Name 'jj_endpos' must match pattern '^[a-z][a-zA-Z0-9]*$'.
[ERROR] target/classes/org/apache/jute/compiler/generated/Rcc.java:[797,3] (javadoc) JavadocMethod:
Missing a Javadoc comment.
[ERROR] target/classes/org/apache/jute/compiler/generated/Rcc.java:[797,16] (naming) MethodName:
Name 'jj_add_error_token' must match pattern '^[a-z][a-zA-Z0-9]*$'.
[ERROR] target/classes/org/apache/jute/compiler/generated/Rcc.java:[797,35] (misc) FinalParameters:
Parameter kind should be final.
[ERROR] target/classes/org/apache/jute/compiler/generated/Rcc.java:[797,45] (misc) FinalParameters:
Parameter pos should be final.
[ERROR] target/classes/org/apache/jute/compiler/generated/Rcc.java:[798] (blocks) NeedBraces:
'if' construct must use '{}'s.
[ERROR] target/classes/org/apache/jute/compiler/generated/Rcc.java:[798,16] (coding) MagicNumber:
'100' is a magic number.
[ERROR] target/classes/org/apache/jute/compiler/generated/Rcc.java:[806] (sizes) LineLength:
Line is longer than 80 characters (found 97).
[ERROR] target/classes/org/apache/jute/compiler/generated/Rcc.java:[807,32] (whitespace) WhitespaceAfter:
'typecast' is not followed by whitespace.
[ERROR] target/classes/org/apache/jute/compiler/generated/Rcc.java:[818] (blocks) NeedBraces:
'if' construct must use '{}'s.
[ERROR] target/classes/org/apache/jute/compiler/generated/Rcc.java:[818,46] (coding) InnerAssignment:
Inner assignments should be avoided.
[ERROR] target/classes/org/apache/jute/compiler/generated/Rcc.java:[823] (javadoc) JavadocMethod:
Expected @return tag.
[ERROR] target/classes/org/apache/jute/compiler/generated/Rcc.java:[825,39] (coding) MagicNumber:
'33' is a magic number.
[ERROR] target/classes/org/apache/jute/compiler/generated/Rcc.java:[832,29] (coding) MagicNumber:
'32' is a magic number.
[ERROR] target/classes/org/apache/jute/compiler/generated/Rcc.java:[833,32] (whitespace) WhitespaceAround:
'<<' is not followed by whitespace.
[ERROR] target/classes/org/apache/jute/compiler/generated/Rcc.java:[833,32] (whitespace) WhitespaceAround:
'<<' is not preceded with whitespace.
[ERROR] target/classes/org/apache/jute/compiler/generated/Rcc.java:[836,32] (whitespace) WhitespaceAround:
'<<' is not followed by whitespace.
[ERROR] target/classes/org/apache/jute/compiler/generated/Rcc.java:[836,32] (whitespace) WhitespaceAround:
'<<' is not preceded with whitespace.
[ERROR] target/classes/org/apache/jute/compiler/generated/Rcc.java:[837,23] (coding) MagicNumber:
'32' is a magic number.
[ERROR] target/classes/org/apache/jute/compiler/generated/Rcc.java:[837,25] (whitespace) WhitespaceAround:
'+' is not followed by whitespace.
[ERROR] target/classes/org/apache/jute/compiler/generated/Rcc.java:[837,25] (whitespace) WhitespaceAround:
'+' is not preceded with whitespace.
[ERROR] target/classes/org/apache/jute/compiler/generated/Rcc.java:[842,25] (coding) MagicNumber:
'33' is a magic number.
[ERROR] target/classes/org/apache/jute/compiler/generated/Rcc.java:[860,9] (modifier) ModifierOrder:
'public' modifier out of order with the JLS suggestions.
[ERROR] target/classes/org/apache/jute/compiler/generated/Rcc.java:[860,21] (naming) MethodName:
Name 'enable_tracing' must match pattern '^[a-z][a-zA-Z0-9]*$'.
[ERROR] target/classes/org/apache/jute/compiler/generated/Rcc.java:[864,9] (modifier) ModifierOrder:
'public' modifier out of order with the JLS suggestions.
[ERROR] target/classes/org/apache/jute/compiler/generated/Rcc.java:[864,21] (naming) MethodName:
Name 'disable_tracing' must match pattern '^[a-z][a-zA-Z0-9]*$'.
[ERROR] target/classes/org/apache/jute/compiler/generated/Rcc.java:[867,3] (javadoc) JavadocMethod:
Missing a Javadoc comment.
[ERROR] target/classes/org/apache/jute/compiler/generated/Rcc.java:[867,16] (naming) MethodName:
Name 'jj_rescan_token' must match pattern '^[a-z][a-zA-Z0-9]*$'.
[ERROR] target/classes/org/apache/jute/compiler/generated/Rcc.java:[869,25] (coding) MagicNumber:
'17' is a magic number.
[ERROR] target/classes/org/apache/jute/compiler/generated/Rcc.java:[874,50] (coding) InnerAssignment:
Inner assignments should be avoided.
[ERROR] target/classes/org/apache/jute/compiler/generated/Rcc.java:[875] (coding) MissingSwitchDefault:
switch without "default" clause.
[ERROR] target/classes/org/apache/jute/compiler/generated/Rcc.java:[879,18] (coding) MagicNumber:
'3' is a magic number.
[ERROR] target/classes/org/apache/jute/compiler/generated/Rcc.java:[880,18] (coding) MagicNumber:
'4' is a magic number.
[ERROR] target/classes/org/apache/jute/compiler/generated/Rcc.java:[881,18] (coding) MagicNumber:
'5' is a magic number.
[ERROR] target/classes/org/apache/jute/compiler/generated/Rcc.java:[882,18] (coding) MagicNumber:
'6' is a magic number.
[ERROR] target/classes/org/apache/jute/compiler/generated/Rcc.java:[883,18] (coding) MagicNumber:
'7' is a magic number.
[ERROR] target/classes/org/apache/jute/compiler/generated/Rcc.java:[884,18] (coding) MagicNumber:
'8' is a magic number.
[ERROR] target/classes/org/apache/jute/compiler/generated/Rcc.java:[885,18] (coding) MagicNumber:
'9' is a magic number.
[ERROR] target/classes/org/apache/jute/compiler/generated/Rcc.java:[886,18] (coding) MagicNumber:
'10' is a magic number.
[ERROR] target/classes/org/apache/jute/compiler/generated/Rcc.java:[887,18] (coding) MagicNumber:
'11' is a magic number.
[ERROR] target/classes/org/apache/jute/compiler/generated/Rcc.java:[888,18] (coding) MagicNumber:
'12' is a magic number.
[ERROR] target/classes/org/apache/jute/compiler/generated/Rcc.java:[889,18] (coding) MagicNumber:
'13' is a magic number.
[ERROR] target/classes/org/apache/jute/compiler/generated/Rcc.java:[890,18] (coding) MagicNumber:
'14' is a magic number.
[ERROR] target/classes/org/apache/jute/compiler/generated/Rcc.java:[891,18] (coding) MagicNumber:
'15' is a magic number.
[ERROR] target/classes/org/apache/jute/compiler/generated/Rcc.java:[892,18] (coding) MagicNumber:
'16' is a magic number.
[ERROR] target/classes/org/apache/jute/compiler/generated/Rcc.java:[897,9] (whitespace) WhitespaceAround:
'catch' is not followed by whitespace.
[ERROR] target/classes/org/apache/jute/compiler/generated/Rcc.java:[902,3] (javadoc) JavadocMethod:
Missing a Javadoc comment.
[ERROR] target/classes/org/apache/jute/compiler/generated/Rcc.java:[902,16] (naming) MethodName:
Name 'jj_save' must match pattern '^[a-z][a-zA-Z0-9]*$'.
[ERROR] target/classes/org/apache/jute/compiler/generated/Rcc.java:[902,24] (misc) FinalParameters:
Parameter index should be final.
[ERROR] target/classes/org/apache/jute/compiler/generated/Rcc.java:[902,35] (misc) FinalParameters:
Parameter xla should be final.
[ERROR] target/classes/org/apache/jute/compiler/generated/Rcc.java:[905,27] (blocks) LeftCurly:
'{' at column 27 should have line break after.
[ERROR] target/classes/org/apache/jute/compiler/generated/Rcc.java:[905,40] (coding) InnerAssignment:
Inner assignments should be avoided.
[ERROR] target/classes/org/apache/jute/compiler/generated/Rcc.java:[911] (javadoc) JavadocType:
Missing a Javadoc comment.
[ERROR] target/classes/org/apache/jute/compiler/generated/Rcc.java:[912,5] (javadoc) JavadocVariable:
Missing a Javadoc comment.
[ERROR] target/classes/org/apache/jute/compiler/generated/Rcc.java:[912,9] (design) VisibilityModifier:
Variable 'gen' must be private and have accessor methods.
[ERROR] target/classes/org/apache/jute/compiler/generated/Rcc.java:[913,5] (javadoc) JavadocVariable:
Missing a Javadoc comment.
[ERROR] target/classes/org/apache/jute/compiler/generated/Rcc.java:[913,11] (design) VisibilityModifier:
Variable 'first' must be private and have accessor methods.
[ERROR] target/classes/org/apache/jute/compiler/generated/Rcc.java:[914,5] (javadoc) JavadocVariable:
Missing a Javadoc comment.
[ERROR] target/classes/org/apache/jute/compiler/generated/Rcc.java:[914,9] (design) VisibilityModifier:
Variable 'arg' must be private and have accessor methods.
[ERROR] target/classes/org/apache/jute/compiler/generated/Rcc.java:[915,5] (javadoc) JavadocVariable:
Missing a Javadoc comment.
[ERROR] target/classes/org/apache/jute/compiler/generated/Rcc.java:[915,13] (design) VisibilityModifier:
Variable 'next' must be private and have accessor methods.
[ERROR] target/classes/org/apache/jute/compiler/generated/ParseException.java:[1] (sizes)
LineLength: Line is longer than 80 characters (found 81).
[ERROR] target/classes/org/apache/jute/compiler/generated/ParseException.java:[47,25] (misc)
FinalParameters: Parameter currentTokenVal should be final.
[ERROR] target/classes/org/apache/jute/compiler/generated/ParseException.java:[47,31] (javadoc)
JavadocMethod: Expected @param tag for 'currentTokenVal'.
[ERROR] target/classes/org/apache/jute/compiler/generated/ParseException.java:[48,25] (misc)
FinalParameters: Parameter expectedTokenSequencesVal should be final.
[ERROR] target/classes/org/apache/jute/compiler/generated/ParseException.java:[48,33] (javadoc)
JavadocMethod: Expected @param tag for 'expectedTokenSequencesVal'.
[ERROR] target/classes/org/apache/jute/compiler/generated/ParseException.java:[49,25] (misc)
FinalParameters: Parameter tokenImageVal should be final.
[ERROR] target/classes/org/apache/jute/compiler/generated/ParseException.java:[49,34] (javadoc)
JavadocMethod: Expected @param tag for 'tokenImageVal'.
[ERROR] target/classes/org/apache/jute/compiler/generated/ParseException.java:[51,3] (blocks)
LeftCurly: '{' at column 3 should be on the previous line.
[ERROR] target/classes/org/apache/jute/compiler/generated/ParseException.java:[52] (sizes)
LineLength: Line is longer than 80 characters (found 81).
[ERROR] target/classes/org/apache/jute/compiler/generated/ParseException.java:[73,25] (misc)
FinalParameters: Parameter message should be final.
[ERROR] target/classes/org/apache/jute/compiler/generated/ParseException.java:[73,32] (javadoc)
JavadocMethod: Expected @param tag for 'message'.
[ERROR] target/classes/org/apache/jute/compiler/generated/ParseException.java:[83,16] (design)
VisibilityModifier: Variable 'currentToken' must be private and have accessor methods.
[ERROR] target/classes/org/apache/jute/compiler/generated/ParseException.java:[90,18] (design)
VisibilityModifier: Variable 'expectedTokenSequences' must be private and have accessor methods.
[ERROR] target/classes/org/apache/jute/compiler/generated/ParseException.java:[97,19] (design)
VisibilityModifier: Variable 'tokenImage' must be private and have accessor methods.
[ERROR] target/classes/org/apache/jute/compiler/generated/ParseException.java:[106] (javadoc)
JavadocMethod: Expected @return tag.
[ERROR] target/classes/org/apache/jute/compiler/generated/ParseException.java:[106,36] (misc)
FinalParameters: Parameter currentToken should be final.
[ERROR] target/classes/org/apache/jute/compiler/generated/ParseException.java:[106,42] (javadoc)
JavadocMethod: Expected @param tag for 'currentToken'.
[ERROR] target/classes/org/apache/jute/compiler/generated/ParseException.java:[107,28] (misc)
FinalParameters: Parameter expectedTokenSequences should be final.
[ERROR] target/classes/org/apache/jute/compiler/generated/ParseException.java:[107,36] (javadoc)
JavadocMethod: Expected @param tag for 'expectedTokenSequences'.
[ERROR] target/classes/org/apache/jute/compiler/generated/ParseException.java:[108,28] (misc)
FinalParameters: Parameter tokenImage should be final.
[ERROR] target/classes/org/apache/jute/compiler/generated/ParseException.java:[108,37] (javadoc)
JavadocMethod: Expected @param tag for 'tokenImage'.
[ERROR] target/classes/org/apache/jute/compiler/generated/ParseException.java:[119] (sizes)
LineLength: Line is longer than 80 characters (found 81).
[ERROR] target/classes/org/apache/jute/compiler/generated/ParseException.java:[127] (blocks)
NeedBraces: 'if' construct must use '{}'s.
[ERROR] target/classes/org/apache/jute/compiler/generated/ParseException.java:[138] (sizes)
LineLength: Line is longer than 80 characters (found 104).
[ERROR] target/classes/org/apache/jute/compiler/generated/ParseException.java:[152,20] (design)
VisibilityModifier: Variable 'eol' must be private and have accessor methods.
[ERROR] target/classes/org/apache/jute/compiler/generated/ParseException.java:[159] (javadoc)
JavadocMethod: Expected @return tag.
[ERROR] target/classes/org/apache/jute/compiler/generated/ParseException.java:[159,17] (naming)
MethodName: Name 'add_escapes' must match pattern '^[a-z][a-zA-Z0-9]*$'.
[ERROR] target/classes/org/apache/jute/compiler/generated/ParseException.java:[159,29] (misc)
FinalParameters: Parameter str should be final.
[ERROR] target/classes/org/apache/jute/compiler/generated/ParseException.java:[159,36] (javadoc)
JavadocMethod: Expected @param tag for 'str'.
[ERROR] target/classes/org/apache/jute/compiler/generated/ParseException.java:[164,9] (blocks)
LeftCurly: '{' at column 9 should be on the previous line.
[ERROR] target/classes/org/apache/jute/compiler/generated/ParseException.java:[192,23] (coding)
InnerAssignment: Inner assignments should be avoided.
[ERROR] target/classes/org/apache/jute/compiler/generated/ParseException.java:[192,42] (coding)
MagicNumber: '0x20' is a magic number.
[ERROR] target/classes/org/apache/jute/compiler/generated/ParseException.java:[192,55] (coding)
MagicNumber: '0x7e' is a magic number.
[ERROR] target/classes/org/apache/jute/compiler/generated/ParseException.java:[193,59] (coding)
MagicNumber: '16' is a magic number.
[ERROR] target/classes/org/apache/jute/compiler/generated/ParseException.java:[194,65] (coding)
MagicNumber: '4' is a magic number.
[ERROR] target/classes/org/apache/jute/compiler/generated/ParseException.java:[205] (sizes)
LineLength: Line is longer than 80 characters (found 88).
[ERROR] target/classes/org/apache/jute/compiler/generated/TokenMgrError.java:[25,1] (blocks)
LeftCurly: '{' at column 1 should be on the previous line.
[ERROR] target/classes/org/apache/jute/compiler/generated/TokenMgrError.java:[62,7] (design)
VisibilityModifier: Variable 'errorCode' must be private and have accessor methods.
[ERROR] target/classes/org/apache/jute/compiler/generated/TokenMgrError.java:[64] (javadoc)
JavadocStyle: First sentence should end with a period.
[ERROR] target/classes/org/apache/jute/compiler/generated/TokenMgrError.java:[68] (javadoc)
JavadocMethod: Expected @return tag.
[ERROR] target/classes/org/apache/jute/compiler/generated/TokenMgrError.java:[68,44] (misc)
FinalParameters: Parameter str should be final.
[ERROR] target/classes/org/apache/jute/compiler/generated/TokenMgrError.java:[68,51] (javadoc)
JavadocMethod: Expected @param tag for 'str'.
[ERROR] target/classes/org/apache/jute/compiler/generated/TokenMgrError.java:[73,7] (blocks)
LeftCurly: '{' at column 7 should be on the previous line.
[ERROR] target/classes/org/apache/jute/compiler/generated/TokenMgrError.java:[101,19] (coding)
InnerAssignment: Inner assignments should be avoided.
[ERROR] target/classes/org/apache/jute/compiler/generated/TokenMgrError.java:[101,38] (coding)
MagicNumber: '0x20' is a magic number.
[ERROR] target/classes/org/apache/jute/compiler/generated/TokenMgrError.java:[101,51] (coding)
MagicNumber: '0x7e' is a magic number.
[ERROR] target/classes/org/apache/jute/compiler/generated/TokenMgrError.java:[102,54] (coding)
MagicNumber: '16' is a magic number.
[ERROR] target/classes/org/apache/jute/compiler/generated/TokenMgrError.java:[103,60] (coding)
MagicNumber: '4' is a magic number.
[ERROR] target/classes/org/apache/jute/compiler/generated/TokenMgrError.java:[125] (javadoc)
JavadocMethod: Expected @return tag.
[ERROR] target/classes/org/apache/jute/compiler/generated/TokenMgrError.java:[125] (sizes)
LineLength: Line is longer than 80 characters (found 136).
[ERROR] target/classes/org/apache/jute/compiler/generated/TokenMgrError.java:[125,27] (naming)
MethodName: Name 'LexicalError' must match pattern '^[a-z][a-zA-Z0-9]*$'.
[ERROR] target/classes/org/apache/jute/compiler/generated/TokenMgrError.java:[125,40] (misc)
FinalParameters: Parameter EOFSeen should be final.
[ERROR] target/classes/org/apache/jute/compiler/generated/TokenMgrError.java:[125,48] (javadoc)
JavadocMethod: Expected @param tag for 'EOFSeen'.
[ERROR] target/classes/org/apache/jute/compiler/generated/TokenMgrError.java:[125,48] (naming)
ParameterName: Name 'EOFSeen' must match pattern '^[a-z][a-zA-Z0-9]*$'.
[ERROR] target/classes/org/apache/jute/compiler/generated/TokenMgrError.java:[125,57] (misc)
FinalParameters: Parameter lexState should be final.
[ERROR] target/classes/org/apache/jute/compiler/generated/TokenMgrError.java:[125,61] (javadoc)
JavadocMethod: Expected @param tag for 'lexState'.
[ERROR] target/classes/org/apache/jute/compiler/generated/TokenMgrError.java:[125,71] (misc)
FinalParameters: Parameter errorLine should be final.
[ERROR] target/classes/org/apache/jute/compiler/generated/TokenMgrError.java:[125,75] (javadoc)
JavadocMethod: Expected @param tag for 'errorLine'.
[ERROR] target/classes/org/apache/jute/compiler/generated/TokenMgrError.java:[125,86] (misc)
FinalParameters: Parameter errorColumn should be final.
[ERROR] target/classes/org/apache/jute/compiler/generated/TokenMgrError.java:[125,90] (javadoc)
JavadocMethod: Expected @param tag for 'errorColumn'.
[ERROR] target/classes/org/apache/jute/compiler/generated/TokenMgrError.java:[125,103] (misc)
FinalParameters: Parameter errorAfter should be final.
[ERROR] target/classes/org/apache/jute/compiler/generated/TokenMgrError.java:[125,110] (javadoc)
JavadocMethod: Expected @param tag for 'errorAfter'.
[ERROR] target/classes/org/apache/jute/compiler/generated/TokenMgrError.java:[125,122] (misc)
FinalParameters: Parameter curChar should be final.
[ERROR] target/classes/org/apache/jute/compiler/generated/TokenMgrError.java:[125,127] (javadoc)
JavadocMethod: Expected @param tag for 'curChar'.
[ERROR] target/classes/org/apache/jute/compiler/generated/TokenMgrError.java:[126,5] (whitespace)
WhitespaceAround: 'return' is not followed by whitespace.
[ERROR] target/classes/org/apache/jute/compiler/generated/TokenMgrError.java:[126,37] (whitespace)
OperatorWrap: '+' should be on a new line.
[ERROR] target/classes/org/apache/jute/compiler/generated/TokenMgrError.java:[127,35] (whitespace)
OperatorWrap: '+' should be on a new line.
[ERROR] target/classes/org/apache/jute/compiler/generated/TokenMgrError.java:[128,44] (whitespace)
OperatorWrap: '+' should be on a new line.
[ERROR] target/classes/org/apache/jute/compiler/generated/TokenMgrError.java:[129] (sizes)
LineLength: Line is longer than 80 characters (found 116).
[ERROR] target/classes/org/apache/jute/compiler/generated/TokenMgrError.java:[129,98] (whitespace)
WhitespaceAfter: 'typecast' is not followed by whitespace.
[ERROR] target/classes/org/apache/jute/compiler/generated/TokenMgrError.java:[129,116] (whitespace)
OperatorWrap: '+' should be on a new line.
[ERROR] target/classes/org/apache/jute/compiler/generated/TokenMgrError.java:[134] (sizes)
LineLength: Line is longer than 80 characters (found 82).
[ERROR] target/classes/org/apache/jute/compiler/generated/TokenMgrError.java:[142] (javadoc)
JavadocMethod: Expected @return tag.
[ERROR] target/classes/org/apache/jute/compiler/generated/TokenMgrError.java:[155,24] (misc)
FinalParameters: Parameter message should be final.
[ERROR] target/classes/org/apache/jute/compiler/generated/TokenMgrError.java:[155,31] (javadoc)
JavadocMethod: Expected @param tag for 'message'.
[ERROR] target/classes/org/apache/jute/compiler/generated/TokenMgrError.java:[155,40] (misc)
FinalParameters: Parameter reason should be final.
[ERROR] target/classes/org/apache/jute/compiler/generated/TokenMgrError.java:[155,44] (javadoc)
JavadocMethod: Expected @param tag for 'reason'.
[ERROR] target/classes/org/apache/jute/compiler/generated/TokenMgrError.java:[161] (sizes)
LineLength: Line is longer than 80 characters (found 132).
[ERROR] target/classes/org/apache/jute/compiler/generated/TokenMgrError.java:[161,24] (misc)
FinalParameters: Parameter EOFSeen should be final.
[ERROR] target/classes/org/apache/jute/compiler/generated/TokenMgrError.java:[161,32] (javadoc)
JavadocMethod: Expected @param tag for 'EOFSeen'.
[ERROR] target/classes/org/apache/jute/compiler/generated/TokenMgrError.java:[161,32] (naming)
ParameterName: Name 'EOFSeen' must match pattern '^[a-z][a-zA-Z0-9]*$'.
[ERROR] target/classes/org/apache/jute/compiler/generated/TokenMgrError.java:[161,41] (misc)
FinalParameters: Parameter lexState should be final.
[ERROR] target/classes/org/apache/jute/compiler/generated/TokenMgrError.java:[161,45] (javadoc)
JavadocMethod: Expected @param tag for 'lexState'.
[ERROR] target/classes/org/apache/jute/compiler/generated/TokenMgrError.java:[161,55] (misc)
FinalParameters: Parameter errorLine should be final.
[ERROR] target/classes/org/apache/jute/compiler/generated/TokenMgrError.java:[161,59] (javadoc)
JavadocMethod: Expected @param tag for 'errorLine'.
[ERROR] target/classes/org/apache/jute/compiler/generated/TokenMgrError.java:[161,70] (misc)
FinalParameters: Parameter errorColumn should be final.
[ERROR] target/classes/org/apache/jute/compiler/generated/TokenMgrError.java:[161,74] (javadoc)
JavadocMethod: Expected @param tag for 'errorColumn'.
[ERROR] target/classes/org/apache/jute/compiler/generated/TokenMgrError.java:[161,87] (misc)
FinalParameters: Parameter errorAfter should be final.
[ERROR] target/classes/org/apache/jute/compiler/generated/TokenMgrError.java:[161,94] (javadoc)
JavadocMethod: Expected @param tag for 'errorAfter'.
[ERROR] target/classes/org/apache/jute/compiler/generated/TokenMgrError.java:[161,106] (misc)
FinalParameters: Parameter curChar should be final.
[ERROR] target/classes/org/apache/jute/compiler/generated/TokenMgrError.java:[161,111] (javadoc)
JavadocMethod: Expected @param tag for 'curChar'.
[ERROR] target/classes/org/apache/jute/compiler/generated/TokenMgrError.java:[161,120] (misc)
FinalParameters: Parameter reason should be final.
[ERROR] target/classes/org/apache/jute/compiler/generated/TokenMgrError.java:[161,124] (javadoc)
JavadocMethod: Expected @param tag for 'reason'.
[ERROR] target/classes/org/apache/jute/compiler/generated/TokenMgrError.java:[162] (sizes)
LineLength: Line is longer than 80 characters (found 95).
[ERROR] target/classes/org/apache/jute/compiler/generated/TokenMgrError.java:[165] (sizes)
LineLength: Line is longer than 80 characters (found 88).
[INFO] ------------------------------------------------------------------------
[INFO] Reactor Summary for Apache ZooKeeper 3.6.0-SNAPSHOT:
[INFO] 
[INFO] Apache ZooKeeper ................................... SUCCESS [ 25.177 s]
[INFO] Apache ZooKeeper - Documentation ................... SUCCESS [  9.724 s]
[INFO] Apache ZooKeeper - Jute ............................ FAILURE [01:21 min]
[INFO] Apache ZooKeeper - Server .......................... SKIPPED
[INFO] Apache ZooKeeper - Client .......................... SKIPPED
[INFO] Apache ZooKeeper - Client - C ...................... SKIPPED
[INFO] Apache ZooKeeper - Recipes ......................... SKIPPED
[INFO] Apache ZooKeeper - Recipes - Election .............. SKIPPED
[INFO] Apache ZooKeeper - Recipes - Lock .................. SKIPPED
[INFO] Apache ZooKeeper - Recipes - Queue ................. SKIPPED
[INFO] Apache ZooKeeper - Assembly ........................ SKIPPED
[INFO] Apache ZooKeeper - Contrib ......................... SKIPPED
[INFO] Apache ZooKeeper - Contrib - Loggraph .............. SKIPPED
[INFO] Apache ZooKeeper - Contrib - Rest .................. SKIPPED
[INFO] Apache ZooKeeper - Contrib - ZooInspector .......... SKIPPED
[INFO] ------------------------------------------------------------------------
[INFO] BUILD FAILURE
[INFO] ------------------------------------------------------------------------
[INFO] Total time:  02:27 min
[INFO] Finished at: 2019-08-08T17:08:51Z
[INFO] ------------------------------------------------------------------------
Waiting for Jenkins to finish collecting data
[ERROR] Failed to execute goal org.apache.maven.plugins:maven-checkstyle-plugin:3.1.0:check
(default-cli) on project zookeeper-jute: You have 12845 Checkstyle violations. -> [Help
1]
[ERROR] 
[ERROR] To see the full stack trace of the errors, re-run Maven with the -e switch.
[ERROR] Re-run Maven using the -X switch to enable full debug logging.
[ERROR] 
[ERROR] For more information about the errors and possible solutions, please read the following
articles:
[ERROR] [Help 1] http://cwiki.apache.org/confluence/display/MAVEN/MojoFailureException
[ERROR] 
[ERROR] After correcting the problems, you can resume the build with the command
[ERROR]   mvn <goals> -rf :zookeeper-jute
[JENKINS] Archiving <https://builds.apache.org/job/PreCommit-ZOOKEEPER-github-pr-build-maven/ws/zookeeper-server/pom.xml>
to org.apache.zookeeper/zookeeper/3.6.0-SNAPSHOT/zookeeper-3.6.0-SNAPSHOT.pom
[JENKINS] Archiving <https://builds.apache.org/job/PreCommit-ZOOKEEPER-github-pr-build-maven/ws/zookeeper-contrib/zookeeper-contrib-loggraph/pom.xml>
to org.apache.zookeeper/zookeeper-contrib-loggraph/3.6.0-SNAPSHOT/zookeeper-contrib-loggraph-3.6.0-SNAPSHOT.pom
[JENKINS] Archiving <https://builds.apache.org/job/PreCommit-ZOOKEEPER-github-pr-build-maven/ws/zookeeper-recipes/zookeeper-recipes-election/pom.xml>
to org.apache.zookeeper/zookeeper-recipes-election/3.6.0-SNAPSHOT/zookeeper-recipes-election-3.6.0-SNAPSHOT.pom
[JENKINS] Archiving <https://builds.apache.org/job/PreCommit-ZOOKEEPER-github-pr-build-maven/ws/pom.xml>
to org.apache.zookeeper/parent/3.6.0-SNAPSHOT/parent-3.6.0-SNAPSHOT.pom
[JENKINS] Archiving <https://builds.apache.org/job/PreCommit-ZOOKEEPER-github-pr-build-maven/ws/zookeeper-recipes/zookeeper-recipes-lock/pom.xml>
to org.apache.zookeeper/zookeeper-recipes-lock/3.6.0-SNAPSHOT/zookeeper-recipes-lock-3.6.0-SNAPSHOT.pom
[JENKINS] Archiving <https://builds.apache.org/job/PreCommit-ZOOKEEPER-github-pr-build-maven/ws/zookeeper-contrib/pom.xml>
to org.apache.zookeeper/zookeeper-contrib/3.6.0-SNAPSHOT/zookeeper-contrib-3.6.0-SNAPSHOT.pom
[JENKINS] Archiving <https://builds.apache.org/job/PreCommit-ZOOKEEPER-github-pr-build-maven/ws/zookeeper-client/pom.xml>
to org.apache.zookeeper/zookeeper-client/3.6.0-SNAPSHOT/zookeeper-client-3.6.0-SNAPSHOT.pom
[JENKINS] Archiving <https://builds.apache.org/job/PreCommit-ZOOKEEPER-github-pr-build-maven/ws/zookeeper-jute/pom.xml>
to org.apache.zookeeper/zookeeper-jute/3.6.0-SNAPSHOT/zookeeper-jute-3.6.0-SNAPSHOT.pom
[JENKINS] Archiving <https://builds.apache.org/job/PreCommit-ZOOKEEPER-github-pr-build-maven/ws/zookeeper-jute/target/zookeeper-jute-3.6.0-SNAPSHOT.jar>
to org.apache.zookeeper/zookeeper-jute/3.6.0-SNAPSHOT/zookeeper-jute-3.6.0-SNAPSHOT.jar
[JENKINS] Archiving <https://builds.apache.org/job/PreCommit-ZOOKEEPER-github-pr-build-maven/ws/zookeeper-jute/target/zookeeper-jute-3.6.0-SNAPSHOT-tests.jar>
to org.apache.zookeeper/zookeeper-jute/3.6.0-SNAPSHOT/zookeeper-jute-3.6.0-SNAPSHOT-tests.jar
[JENKINS] Archiving <https://builds.apache.org/job/PreCommit-ZOOKEEPER-github-pr-build-maven/ws/zookeeper-jute/target/zookeeper-jute-3.6.0-SNAPSHOT-sources.jar>
to org.apache.zookeeper/zookeeper-jute/3.6.0-SNAPSHOT/zookeeper-jute-3.6.0-SNAPSHOT-sources.jar
[JENKINS] Archiving <https://builds.apache.org/job/PreCommit-ZOOKEEPER-github-pr-build-maven/ws/zookeeper-jute/target/zookeeper-jute-3.6.0-SNAPSHOT-javadoc.jar>
to org.apache.zookeeper/zookeeper-jute/3.6.0-SNAPSHOT/zookeeper-jute-3.6.0-SNAPSHOT-javadoc.jar
[JENKINS] Archiving <https://builds.apache.org/job/PreCommit-ZOOKEEPER-github-pr-build-maven/ws/zookeeper-recipes/zookeeper-recipes-queue/pom.xml>
to org.apache.zookeeper/zookeeper-recipes-queue/3.6.0-SNAPSHOT/zookeeper-recipes-queue-3.6.0-SNAPSHOT.pom
[JENKINS] Archiving <https://builds.apache.org/job/PreCommit-ZOOKEEPER-github-pr-build-maven/ws/zookeeper-docs/pom.xml>
to org.apache.zookeeper/zookeeper-docs/3.6.0-SNAPSHOT/zookeeper-docs-3.6.0-SNAPSHOT.pom
[JENKINS] Archiving <https://builds.apache.org/job/PreCommit-ZOOKEEPER-github-pr-build-maven/ws/zookeeper-docs/target/zookeeper-docs-3.6.0-SNAPSHOT.jar>
to org.apache.zookeeper/zookeeper-docs/3.6.0-SNAPSHOT/zookeeper-docs-3.6.0-SNAPSHOT.jar
[JENKINS] Archiving <https://builds.apache.org/job/PreCommit-ZOOKEEPER-github-pr-build-maven/ws/zookeeper-docs/target/zookeeper-docs-3.6.0-SNAPSHOT-tests.jar>
to org.apache.zookeeper/zookeeper-docs/3.6.0-SNAPSHOT/zookeeper-docs-3.6.0-SNAPSHOT-tests.jar
[JENKINS] Archiving <https://builds.apache.org/job/PreCommit-ZOOKEEPER-github-pr-build-maven/ws/zookeeper-docs/target/zookeeper-docs-3.6.0-SNAPSHOT-sources.jar>
to org.apache.zookeeper/zookeeper-docs/3.6.0-SNAPSHOT/zookeeper-docs-3.6.0-SNAPSHOT-sources.jar
[JENKINS] Archiving <https://builds.apache.org/job/PreCommit-ZOOKEEPER-github-pr-build-maven/ws/zookeeper-recipes/pom.xml>
to org.apache.zookeeper/zookeeper-recipes/3.6.0-SNAPSHOT/zookeeper-recipes-3.6.0-SNAPSHOT.pom
[JENKINS] Archiving <https://builds.apache.org/job/PreCommit-ZOOKEEPER-github-pr-build-maven/ws/zookeeper-client/zookeeper-client-c/pom.xml>
to org.apache.zookeeper/zookeeper-client-c/3.6.0-SNAPSHOT/zookeeper-client-c-3.6.0-SNAPSHOT.pom
[JENKINS] Archiving <https://builds.apache.org/job/PreCommit-ZOOKEEPER-github-pr-build-maven/ws/zookeeper-contrib/zookeeper-contrib-rest/pom.xml>
to org.apache.zookeeper/zookeeper-contrib-rest/3.6.0-SNAPSHOT/zookeeper-contrib-rest-3.6.0-SNAPSHOT.pom
[JENKINS] Archiving <https://builds.apache.org/job/PreCommit-ZOOKEEPER-github-pr-build-maven/ws/zookeeper-assembly/pom.xml>
to org.apache.zookeeper/zookeeper-assembly/3.6.0-SNAPSHOT/zookeeper-assembly-3.6.0-SNAPSHOT.pom
[JENKINS] Archiving <https://builds.apache.org/job/PreCommit-ZOOKEEPER-github-pr-build-maven/ws/zookeeper-contrib/zookeeper-contrib-zooinspector/pom.xml>
to org.apache.zookeeper/zookeeper-contrib-zooinspector/3.6.0-SNAPSHOT/zookeeper-contrib-zooinspector-3.6.0-SNAPSHOT.pom
channel stopped
[SpotBugs] Skipping execution of recorder since overall result is 'FAILURE'
Setting status of 4f77033d104efda32e610e8e78fbae1a2ec40046 to FAILURE with url https://builds.apache.org/job/PreCommit-ZOOKEEPER-github-pr-build-maven/1071/
and message: 'FAILURE
 '
Using context: JenkinsMaven

Mime
View raw message