zookeeper-dev mailing list archives

Site index · List index
Message view « Date » · « Thread »
Top « Date » · « Thread »
From Apache Jenkins Server <jenk...@builds.apache.org>
Subject Build failed in Jenkins: zookeeper-master-maven-jdk11 #87
Date Tue, 06 Aug 2019 16:54:12 GMT
See <https://builds.apache.org/job/zookeeper-master-maven-jdk11/87/display/redirect?page=changes>

Changes:

[andor] ZOOKEEPER-2891: Invalid processing of zookeeper_close for mutli-request

------------------------------------------
[...truncated 506.48 KB...]
     [exec] ZooKeeper JMX enabled by default
     [exec] Using config: <https://builds.apache.org/job/zookeeper-master-maven-jdk11/ws/zookeeper-client/zookeeper-client-c/../../build/test/test-cppunit/conf/0.conf>
     [exec] ZooKeeper JMX enabled by default
     [exec] Using config: <https://builds.apache.org/job/zookeeper-master-maven-jdk11/ws/zookeeper-client/zookeeper-client-c/../../build/test/test-cppunit/conf/1.conf>
     [exec] ZooKeeper JMX enabled by default
     [exec] Using config: <https://builds.apache.org/job/zookeeper-master-maven-jdk11/ws/zookeeper-client/zookeeper-client-c/../../build/test/test-cppunit/conf/0.conf>
     [exec] ZooKeeper JMX enabled by default
     [exec] Using config: <https://builds.apache.org/job/zookeeper-master-maven-jdk11/ws/zookeeper-client/zookeeper-client-c/../../build/test/test-cppunit/conf/1.conf>
     [exec] Stopping zookeeper ... STOPPED
     [exec] Stopping zookeeper ... STOPPED
     [exec] ZooKeeper JMX enabled by default
     [exec] Using config: <https://builds.apache.org/job/zookeeper-master-maven-jdk11/ws/zookeeper-client/zookeeper-client-c/../../build/test/test-cppunit/conf/2.conf>
     [exec] ZooKeeper JMX enabled by default
     [exec] Using config: <https://builds.apache.org/job/zookeeper-master-maven-jdk11/ws/zookeeper-client/zookeeper-client-c/../../build/test/test-cppunit/conf/0.conf>
     [exec] Stopping zookeeper ... STOPPED
     [exec]  : elapsed 9693 : OK
     [exec] TestReconfigServer::testRemoveFollowerStarting zookeeper ... STARTED
     [exec] ZooKeeper JMX enabled by default
     [exec] Using config: <https://builds.apache.org/job/zookeeper-master-maven-jdk11/ws/zookeeper-client/zookeeper-client-c/../../build/test/test-cppunit/conf/1.conf>
     [exec] Starting zookeeper ... STARTED
     [exec] ZooKeeper JMX enabled by default
     [exec] Using config: <https://builds.apache.org/job/zookeeper-master-maven-jdk11/ws/zookeeper-client/zookeeper-client-c/../../build/test/test-cppunit/conf/2.conf>
     [exec] ZooKeeper JMX enabled by default
     [exec] Using config: <https://builds.apache.org/job/zookeeper-master-maven-jdk11/ws/zookeeper-client/zookeeper-client-c/../../build/test/test-cppunit/conf/0.conf>
     [exec] Starting zookeeper ... STARTED
     [exec] ZooKeeper JMX enabled by default
     [exec] Using config: <https://builds.apache.org/job/zookeeper-master-maven-jdk11/ws/zookeeper-client/zookeeper-client-c/../../build/test/test-cppunit/conf/1.conf>
     [exec] ZooKeeper JMX enabled by default
     [exec] Using config: <https://builds.apache.org/job/zookeeper-master-maven-jdk11/ws/zookeeper-client/zookeeper-client-c/../../build/test/test-cppunit/conf/2.conf>
     [exec] ZooKeeper JMX enabled by default
     [exec] Using config: <https://builds.apache.org/job/zookeeper-master-maven-jdk11/ws/zookeeper-client/zookeeper-client-c/../../build/test/test-cppunit/conf/0.conf>
     [exec] ZooKeeper JMX enabled by default
     [exec] Using config: <https://builds.apache.org/job/zookeeper-master-maven-jdk11/ws/zookeeper-client/zookeeper-client-c/../../build/test/test-cppunit/conf/1.conf>
     [exec] ZooKeeper JMX enabled by default
     [exec] Using config: <https://builds.apache.org/job/zookeeper-master-maven-jdk11/ws/zookeeper-client/zookeeper-client-c/../../build/test/test-cppunit/conf/0.conf>
     [exec] ZooKeeper JMX enabled by default
     [exec] Using config: <https://builds.apache.org/job/zookeeper-master-maven-jdk11/ws/zookeeper-client/zookeeper-client-c/../../build/test/test-cppunit/conf/1.conf>
     [exec] ZooKeeper JMX enabled by default
     [exec] Using config: <https://builds.apache.org/job/zookeeper-master-maven-jdk11/ws/zookeeper-client/zookeeper-client-c/../../build/test/test-cppunit/conf/2.conf>
     [exec] ZooKeeper JMX enabled by default
     [exec] Using config: <https://builds.apache.org/job/zookeeper-master-maven-jdk11/ws/zookeeper-client/zookeeper-client-c/../../build/test/test-cppunit/conf/0.conf>
     [exec] Stopping zookeeper ... STOPPED
     [exec] ZooKeeper JMX enabled by default
     [exec] Using config: <https://builds.apache.org/job/zookeeper-master-maven-jdk11/ws/zookeeper-client/zookeeper-client-c/../../build/test/test-cppunit/conf/1.conf>
     [exec] ZooKeeper JMX enabled by default
     [exec] Using config: <https://builds.apache.org/job/zookeeper-master-maven-jdk11/ws/zookeeper-client/zookeeper-client-c/../../build/test/test-cppunit/conf/2.conf>
     [exec] ZooKeeper JMX enabled by default
     [exec] Using config: <https://builds.apache.org/job/zookeeper-master-maven-jdk11/ws/zookeeper-client/zookeeper-client-c/../../build/test/test-cppunit/conf/0.conf>
     [exec] Stopping zookeeper ... STOPPED
     [exec] Stopping zookeeper ... STOPPED
     [exec]  : elapsed 10735 : OK
     [exec] ZooKeeper JMX enabled by default
     [exec] Using config: <https://builds.apache.org/job/zookeeper-master-maven-jdk11/ws/zookeeper-client/zookeeper-client-c/../../build/test/test-cppunit/conf/1.conf>
     [exec] TestReconfigServer::testReconfigFailureWithoutAuthStarting zookeeper ... STARTED
     [exec] Starting zookeeper ... STARTED
     [exec] ZooKeeper JMX enabled by default
     [exec] Using config: <https://builds.apache.org/job/zookeeper-master-maven-jdk11/ws/zookeeper-client/zookeeper-client-c/../../build/test/test-cppunit/conf/2.conf>
     [exec] ZooKeeper JMX enabled by default
     [exec] Using config: <https://builds.apache.org/job/zookeeper-master-maven-jdk11/ws/zookeeper-client/zookeeper-client-c/../../build/test/test-cppunit/conf/0.conf>
     [exec] Starting zookeeper ... STARTED
     [exec] ZooKeeper JMX enabled by default
     [exec] Using config: <https://builds.apache.org/job/zookeeper-master-maven-jdk11/ws/zookeeper-client/zookeeper-client-c/../../build/test/test-cppunit/conf/1.conf>
     [exec] ZooKeeper JMX enabled by default
     [exec] Using config: <https://builds.apache.org/job/zookeeper-master-maven-jdk11/ws/zookeeper-client/zookeeper-client-c/../../build/test/test-cppunit/conf/2.conf>
     [exec] ZooKeeper JMX enabled by default
     [exec] Using config: <https://builds.apache.org/job/zookeeper-master-maven-jdk11/ws/zookeeper-client/zookeeper-client-c/../../build/test/test-cppunit/conf/0.conf>
     [exec] ZooKeeper JMX enabled by default
     [exec] Using config: <https://builds.apache.org/job/zookeeper-master-maven-jdk11/ws/zookeeper-client/zookeeper-client-c/../../build/test/test-cppunit/conf/1.conf>
     [exec] ZooKeeper JMX enabled by default
     [exec] Using config: <https://builds.apache.org/job/zookeeper-master-maven-jdk11/ws/zookeeper-client/zookeeper-client-c/../../build/test/test-cppunit/conf/2.conf>
     [exec] ZooKeeper JMX enabled by default
     [exec] Using config: <https://builds.apache.org/job/zookeeper-master-maven-jdk11/ws/zookeeper-client/zookeeper-client-c/../../build/test/test-cppunit/conf/0.conf>
     [exec] ZooKeeper JMX enabled by default
     [exec] Using config: <https://builds.apache.org/job/zookeeper-master-maven-jdk11/ws/zookeeper-client/zookeeper-client-c/../../build/test/test-cppunit/conf/1.conf>
     [exec] ZooKeeper JMX enabled by default
     [exec] Using config: <https://builds.apache.org/job/zookeeper-master-maven-jdk11/ws/zookeeper-client/zookeeper-client-c/../../build/test/test-cppunit/conf/0.conf>
     [exec] Stopping zookeeper ... STOPPED
     [exec] ZooKeeper JMX enabled by default
     [exec] Using config: <https://builds.apache.org/job/zookeeper-master-maven-jdk11/ws/zookeeper-client/zookeeper-client-c/../../build/test/test-cppunit/conf/1.conf>
     [exec] ZooKeeper JMX enabled by default
     [exec] Using config: <https://builds.apache.org/job/zookeeper-master-maven-jdk11/ws/zookeeper-client/zookeeper-client-c/../../build/test/test-cppunit/conf/2.conf>
     [exec] Stopping zookeeper ... STOPPED
     [exec] Stopping zookeeper ... STOPPED
     [exec]  : elapsed 9723 : OK
     [exec] ZooKeeper JMX enabled by default
     [exec] Using config: <https://builds.apache.org/job/zookeeper-master-maven-jdk11/ws/zookeeper-client/zookeeper-client-c/../../build/test/test-cppunit/conf/0.conf>
     [exec] ZooKeeper JMX enabled by default
     [exec] Using config: <https://builds.apache.org/job/zookeeper-master-maven-jdk11/ws/zookeeper-client/zookeeper-client-c/../../build/test/test-cppunit/conf/1.conf>
     [exec] TestReconfigServer::testReconfigFailureWithoutServerSuperuserPasswordConfiguredStarting
zookeeper ... STARTED
     [exec] Starting zookeeper ... STARTED
     [exec] ZooKeeper JMX enabled by default
     [exec] Using config: <https://builds.apache.org/job/zookeeper-master-maven-jdk11/ws/zookeeper-client/zookeeper-client-c/../../build/test/test-cppunit/conf/2.conf>
     [exec] ZooKeeper JMX enabled by default
     [exec] Using config: <https://builds.apache.org/job/zookeeper-master-maven-jdk11/ws/zookeeper-client/zookeeper-client-c/../../build/test/test-cppunit/conf/0.conf>
     [exec] Starting zookeeper ... STARTED
     [exec] ZooKeeper JMX enabled by default
     [exec] Using config: <https://builds.apache.org/job/zookeeper-master-maven-jdk11/ws/zookeeper-client/zookeeper-client-c/../../build/test/test-cppunit/conf/1.conf>
     [exec] ZooKeeper JMX enabled by default
     [exec] Using config: <https://builds.apache.org/job/zookeeper-master-maven-jdk11/ws/zookeeper-client/zookeeper-client-c/../../build/test/test-cppunit/conf/2.conf>
     [exec] ZooKeeper JMX enabled by default
     [exec] Using config: <https://builds.apache.org/job/zookeeper-master-maven-jdk11/ws/zookeeper-client/zookeeper-client-c/../../build/test/test-cppunit/conf/0.conf>
     [exec] ZooKeeper JMX enabled by default
     [exec] Using config: <https://builds.apache.org/job/zookeeper-master-maven-jdk11/ws/zookeeper-client/zookeeper-client-c/../../build/test/test-cppunit/conf/1.conf>
     [exec] Stopping zookeeper ... STOPPED
     [exec] Stopping zookeeper ... STOPPED
     [exec] ZooKeeper JMX enabled by default
     [exec] Using config: <https://builds.apache.org/job/zookeeper-master-maven-jdk11/ws/zookeeper-client/zookeeper-client-c/../../build/test/test-cppunit/conf/2.conf>
     [exec] ZooKeeper JMX enabled by default
     [exec] Using config: <https://builds.apache.org/job/zookeeper-master-maven-jdk11/ws/zookeeper-client/zookeeper-client-c/../../build/test/test-cppunit/conf/0.conf>
     [exec] Stopping zookeeper ... STOPPED
     [exec] Starting zookeeper ... STARTED
     [exec] ZooKeeper JMX enabled by default
     [exec] Using config: <https://builds.apache.org/job/zookeeper-master-maven-jdk11/ws/zookeeper-client/zookeeper-client-c/../../build/test/test-cppunit/conf/1.conf>
     [exec] Starting zookeeper ... STARTED
     [exec] ZooKeeper JMX enabled by default
     [exec] Using config: <https://builds.apache.org/job/zookeeper-master-maven-jdk11/ws/zookeeper-client/zookeeper-client-c/../../build/test/test-cppunit/conf/2.conf>
     [exec] ZooKeeper JMX enabled by default
     [exec] Using config: <https://builds.apache.org/job/zookeeper-master-maven-jdk11/ws/zookeeper-client/zookeeper-client-c/../../build/test/test-cppunit/conf/0.conf>
     [exec] Starting zookeeper ... STARTED
     [exec] ZooKeeper JMX enabled by default
     [exec] Using config: <https://builds.apache.org/job/zookeeper-master-maven-jdk11/ws/zookeeper-client/zookeeper-client-c/../../build/test/test-cppunit/conf/1.conf>
     [exec] ZooKeeper JMX enabled by default
     [exec] Using config: <https://builds.apache.org/job/zookeeper-master-maven-jdk11/ws/zookeeper-client/zookeeper-client-c/../../build/test/test-cppunit/conf/2.conf>
     [exec] ZooKeeper JMX enabled by default
     [exec] Using config: <https://builds.apache.org/job/zookeeper-master-maven-jdk11/ws/zookeeper-client/zookeeper-client-c/../../build/test/test-cppunit/conf/0.conf>
     [exec] ZooKeeper JMX enabled by default
     [exec] Using config: <https://builds.apache.org/job/zookeeper-master-maven-jdk11/ws/zookeeper-client/zookeeper-client-c/../../build/test/test-cppunit/conf/1.conf>
     [exec] ZooKeeper JMX enabled by default
     [exec] Using config: <https://builds.apache.org/job/zookeeper-master-maven-jdk11/ws/zookeeper-client/zookeeper-client-c/../../build/test/test-cppunit/conf/2.conf>
     [exec] ZooKeeper JMX enabled by default
     [exec] Using config: <https://builds.apache.org/job/zookeeper-master-maven-jdk11/ws/zookeeper-client/zookeeper-client-c/../../build/test/test-cppunit/conf/0.conf>
     [exec] ZooKeeper JMX enabled by default
     [exec] Using config: <https://builds.apache.org/job/zookeeper-master-maven-jdk11/ws/zookeeper-client/zookeeper-client-c/../../build/test/test-cppunit/conf/1.conf>
     [exec] ZooKeeper JMX enabled by default
     [exec] Using config: <https://builds.apache.org/job/zookeeper-master-maven-jdk11/ws/zookeeper-client/zookeeper-client-c/../../build/test/test-cppunit/conf/0.conf>
     [exec] ZooKeeper JMX enabled by default
     [exec] Using config: <https://builds.apache.org/job/zookeeper-master-maven-jdk11/ws/zookeeper-client/zookeeper-client-c/../../build/test/test-cppunit/conf/1.conf>
     [exec] Stopping zookeeper ... STOPPED
     [exec] Stopping zookeeper ... STOPPED
     [exec] ZooKeeper JMX enabled by default
     [exec] Using config: <https://builds.apache.org/job/zookeeper-master-maven-jdk11/ws/zookeeper-client/zookeeper-client-c/../../build/test/test-cppunit/conf/2.conf>
     [exec] <https://builds.apache.org/job/zookeeper-master-maven-jdk11/ws/zookeeper-client/zookeeper-client-c/../../zookeeper-client/zookeeper-client-c/tests/zkServer.sh>:
line 62: kill: (13413) - No such process
     [exec] Stopping zookeeper ... STOPPED
     [exec]  : elapsed 14496 : OK
     [exec] <https://builds.apache.org/job/zookeeper-master-maven-jdk11/ws/zookeeper-client/zookeeper-client-c/../../zookeeper-client/zookeeper-client-c/tests/zkServer.sh>:
line 62: kill: (19985) - No such process
     [exec] Zookeeper_clientretry::testRetry ZooKeeper server started ZooKeeper server started
: elapsed 6090 : OK
     [exec] Zookeeper_operations::testAsyncWatcher1 : elapsed 5 : OK
     [exec] Zookeeper_operations::testAsyncGetOperation : elapsed 5 : OK
     [exec] Zookeeper_operations::testOperationsAndDisconnectConcurrently1 : elapsed 391 :
OK
     [exec] Zookeeper_operations::testOperationsAndDisconnectConcurrently2 : elapsed 0 : OK
     [exec] Zookeeper_operations::testConcurrentOperations1 : elapsed 22173 : OK
     [exec] Zookeeper_multi::testCreate : assertion : elapsed 3025
     [exec] Zookeeper_multi::testCreateDelete : elapsed 3037 : OK
     [exec] Zookeeper_multi::testInvalidVersion : elapsed 1005 : OK
     [exec] Zookeeper_multi::testNestedCreate : elapsed 1014 : OK
     [exec] Zookeeper_multi::testSetData : assertion : elapsed 1005
     [exec] Zookeeper_multi::testUpdateConflict : assertion : elapsed 1006
     [exec] Zookeeper_multi::testDeleteUpdateConflict : elapsed 1006 : OK
     [exec] Zookeeper_multi::testAsyncMultiFAIL: zktest-mt
     [exec] ==========================================
     [exec] 2 of 2 tests failed
     [exec] Please report to user@zookeeper.apache.org
     [exec] ==========================================
     [exec] Makefile:1815: recipe for target 'check-TESTS' failed
     [exec] make[1]: Leaving directory '<https://builds.apache.org/job/zookeeper-master-maven-jdk11/ws/zookeeper-client/zookeeper-client-c/target/c'>
     [exec] Makefile:2071: recipe for target 'check-am' failed
     [exec] terminate called after throwing an instance of 'CppUnit::Exception'
     [exec]   what():  equality assertion failed
     [exec] - Expected: 0
     [exec] - Actual  : -110
     [exec] 
     [exec] /bin/bash: line 5: 13406 Aborted                 ZKROOT=<https://builds.apache.org/job/zookeeper-master-maven-jdk11/ws/zookeeper-client/zookeeper-client-c/../..>
CLASSPATH=$CLASSPATH:$CLOVER_HOME/lib/clover*.jar ${dir}$tst
     [exec] make[1]: *** [check-TESTS] Error 1
     [exec] make: *** [check-am] Error 2
[INFO] ------------------------------------------------------------------------
[INFO] Reactor Summary for Apache ZooKeeper 3.6.0-SNAPSHOT:
[INFO] 
[INFO] Apache ZooKeeper ................................... SUCCESS [ 11.009 s]
[INFO] Apache ZooKeeper - Documentation ................... SUCCESS [  7.341 s]
[INFO] Apache ZooKeeper - Jute ............................ SUCCESS [01:35 min]
[INFO] Apache ZooKeeper - Server .......................... SUCCESS [12:29 min]
[INFO] Apache ZooKeeper - Metrics Providers ............... SUCCESS [  3.420 s]
[INFO] Apache ZooKeeper - Prometheus.io Metrics Provider .. SUCCESS [ 16.039 s]
[INFO] Apache ZooKeeper - Client .......................... SUCCESS [  3.144 s]
[INFO] Apache ZooKeeper - Client - C ...................... FAILURE [03:30 min]
[INFO] Apache ZooKeeper - Recipes ......................... SKIPPED
[INFO] Apache ZooKeeper - Recipes - Election .............. SKIPPED
[INFO] Apache ZooKeeper - Recipes - Lock .................. SKIPPED
[INFO] Apache ZooKeeper - Recipes - Queue ................. SKIPPED
[INFO] Apache ZooKeeper - Assembly ........................ SKIPPED
[INFO] Apache ZooKeeper - Contrib ......................... SKIPPED
[INFO] Apache ZooKeeper - Contrib - Loggraph .............. SKIPPED
[INFO] Apache ZooKeeper - Contrib - Rest .................. SKIPPED
[INFO] Apache ZooKeeper - Contrib - ZooInspector .......... SKIPPED
[INFO] ------------------------------------------------------------------------
[INFO] BUILD FAILURE
[INFO] ------------------------------------------------------------------------
[INFO] Total time:  19:03 min
[INFO] Finished at: 2019-08-06T16:53:39Z
[INFO] ------------------------------------------------------------------------
Waiting for Jenkins to finish collecting data
[ERROR] Failed to execute goal org.apache.maven.plugins:maven-antrun-plugin:1.8:run (test-cppunit)
on project zookeeper-client-c: An Ant BuildException has occured: exec returned: 2
[ERROR] around Ant part ...<exec failonerror="true" dir="<https://builds.apache.org/job/zookeeper-master-maven-jdk11/ws/zookeeper-client/zookeeper-client-c/target/c">
executable="make">... @ 4:164 in <https://builds.apache.org/job/zookeeper-master-maven-jdk11/ws/zookeeper-client/zookeeper-client-c/target/antrun/build-main.xml>
[ERROR] -> [Help 1]
[ERROR] 
[ERROR] To see the full stack trace of the errors, re-run Maven with the -e switch.
[ERROR] Re-run Maven using the -X switch to enable full debug logging.
[ERROR] 
[ERROR] For more information about the errors and possible solutions, please read the following
articles:
[ERROR] [Help 1] http://cwiki.apache.org/confluence/display/MAVEN/MojoExecutionException
[ERROR] 
[ERROR] After correcting the problems, you can resume the build with the command
[ERROR]   mvn <goals> -rf :zookeeper-client-c
[JENKINS] Archiving <https://builds.apache.org/job/zookeeper-master-maven-jdk11/ws/zookeeper-server/pom.xml>
to org.apache.zookeeper/zookeeper/3.6.0-SNAPSHOT/zookeeper-3.6.0-SNAPSHOT.pom
[JENKINS] Archiving <https://builds.apache.org/job/zookeeper-master-maven-jdk11/ws/zookeeper-server/target/zookeeper-3.6.0-SNAPSHOT.jar>
to org.apache.zookeeper/zookeeper/3.6.0-SNAPSHOT/zookeeper-3.6.0-SNAPSHOT.jar
[JENKINS] Archiving <https://builds.apache.org/job/zookeeper-master-maven-jdk11/ws/zookeeper-server/target/zookeeper-3.6.0-SNAPSHOT-tests.jar>
to org.apache.zookeeper/zookeeper/3.6.0-SNAPSHOT/zookeeper-3.6.0-SNAPSHOT-tests.jar
[JENKINS] Archiving <https://builds.apache.org/job/zookeeper-master-maven-jdk11/ws/zookeeper-server/target/zookeeper-3.6.0-SNAPSHOT-sources.jar>
to org.apache.zookeeper/zookeeper/3.6.0-SNAPSHOT/zookeeper-3.6.0-SNAPSHOT-sources.jar
[JENKINS] Archiving <https://builds.apache.org/job/zookeeper-master-maven-jdk11/ws/zookeeper-server/target/zookeeper-3.6.0-SNAPSHOT-javadoc.jar>
to org.apache.zookeeper/zookeeper/3.6.0-SNAPSHOT/zookeeper-3.6.0-SNAPSHOT-javadoc.jar
[JENKINS] Archiving <https://builds.apache.org/job/zookeeper-master-maven-jdk11/ws/zookeeper-contrib/zookeeper-contrib-loggraph/pom.xml>
to org.apache.zookeeper/zookeeper-contrib-loggraph/3.6.0-SNAPSHOT/zookeeper-contrib-loggraph-3.6.0-SNAPSHOT.pom
[JENKINS] Archiving <https://builds.apache.org/job/zookeeper-master-maven-jdk11/ws/zookeeper-metrics-providers/pom.xml>
to org.apache.zookeeper/zookeeper-metrics-providers/3.6.0-SNAPSHOT/zookeeper-metrics-providers-3.6.0-SNAPSHOT.pom
[JENKINS] Archiving <https://builds.apache.org/job/zookeeper-master-maven-jdk11/ws/zookeeper-metrics-providers/zookeeper-prometheus-metrics/pom.xml>
to org.apache.zookeeper/zookeeper-prometheus-metrics/3.6.0-SNAPSHOT/zookeeper-prometheus-metrics-3.6.0-SNAPSHOT.pom
[JENKINS] Archiving <https://builds.apache.org/job/zookeeper-master-maven-jdk11/ws/zookeeper-metrics-providers/zookeeper-prometheus-metrics/target/zookeeper-prometheus-metrics-3.6.0-SNAPSHOT.jar>
to org.apache.zookeeper/zookeeper-prometheus-metrics/3.6.0-SNAPSHOT/zookeeper-prometheus-metrics-3.6.0-SNAPSHOT.jar
[JENKINS] Archiving <https://builds.apache.org/job/zookeeper-master-maven-jdk11/ws/zookeeper-metrics-providers/zookeeper-prometheus-metrics/target/zookeeper-prometheus-metrics-3.6.0-SNAPSHOT-tests.jar>
to org.apache.zookeeper/zookeeper-prometheus-metrics/3.6.0-SNAPSHOT/zookeeper-prometheus-metrics-3.6.0-SNAPSHOT-tests.jar
[JENKINS] Archiving <https://builds.apache.org/job/zookeeper-master-maven-jdk11/ws/zookeeper-metrics-providers/zookeeper-prometheus-metrics/target/zookeeper-prometheus-metrics-3.6.0-SNAPSHOT-sources.jar>
to org.apache.zookeeper/zookeeper-prometheus-metrics/3.6.0-SNAPSHOT/zookeeper-prometheus-metrics-3.6.0-SNAPSHOT-sources.jar
[JENKINS] Archiving <https://builds.apache.org/job/zookeeper-master-maven-jdk11/ws/zookeeper-metrics-providers/zookeeper-prometheus-metrics/target/zookeeper-prometheus-metrics-3.6.0-SNAPSHOT-javadoc.jar>
to org.apache.zookeeper/zookeeper-prometheus-metrics/3.6.0-SNAPSHOT/zookeeper-prometheus-metrics-3.6.0-SNAPSHOT-javadoc.jar
[Fast Archiver] Compressed 446.07 KB of artifacts by 43.0% relative to #86
[JENKINS] Archiving <https://builds.apache.org/job/zookeeper-master-maven-jdk11/ws/zookeeper-recipes/zookeeper-recipes-election/pom.xml>
to org.apache.zookeeper/zookeeper-recipes-election/3.6.0-SNAPSHOT/zookeeper-recipes-election-3.6.0-SNAPSHOT.pom
[JENKINS] Archiving <https://builds.apache.org/job/zookeeper-master-maven-jdk11/ws/pom.xml>
to org.apache.zookeeper/parent/3.6.0-SNAPSHOT/parent-3.6.0-SNAPSHOT.pom
[JENKINS] Archiving <https://builds.apache.org/job/zookeeper-master-maven-jdk11/ws/zookeeper-recipes/zookeeper-recipes-lock/pom.xml>
to org.apache.zookeeper/zookeeper-recipes-lock/3.6.0-SNAPSHOT/zookeeper-recipes-lock-3.6.0-SNAPSHOT.pom
[JENKINS] Archiving <https://builds.apache.org/job/zookeeper-master-maven-jdk11/ws/zookeeper-contrib/pom.xml>
to org.apache.zookeeper/zookeeper-contrib/3.6.0-SNAPSHOT/zookeeper-contrib-3.6.0-SNAPSHOT.pom
[JENKINS] Archiving <https://builds.apache.org/job/zookeeper-master-maven-jdk11/ws/zookeeper-client/pom.xml>
to org.apache.zookeeper/zookeeper-client/3.6.0-SNAPSHOT/zookeeper-client-3.6.0-SNAPSHOT.pom
[JENKINS] Archiving <https://builds.apache.org/job/zookeeper-master-maven-jdk11/ws/zookeeper-jute/pom.xml>
to org.apache.zookeeper/zookeeper-jute/3.6.0-SNAPSHOT/zookeeper-jute-3.6.0-SNAPSHOT.pom
[JENKINS] Archiving <https://builds.apache.org/job/zookeeper-master-maven-jdk11/ws/zookeeper-jute/target/zookeeper-jute-3.6.0-SNAPSHOT.jar>
to org.apache.zookeeper/zookeeper-jute/3.6.0-SNAPSHOT/zookeeper-jute-3.6.0-SNAPSHOT.jar
[JENKINS] Archiving <https://builds.apache.org/job/zookeeper-master-maven-jdk11/ws/zookeeper-jute/target/zookeeper-jute-3.6.0-SNAPSHOT-tests.jar>
to org.apache.zookeeper/zookeeper-jute/3.6.0-SNAPSHOT/zookeeper-jute-3.6.0-SNAPSHOT-tests.jar
[JENKINS] Archiving <https://builds.apache.org/job/zookeeper-master-maven-jdk11/ws/zookeeper-jute/target/zookeeper-jute-3.6.0-SNAPSHOT-sources.jar>
to org.apache.zookeeper/zookeeper-jute/3.6.0-SNAPSHOT/zookeeper-jute-3.6.0-SNAPSHOT-sources.jar
[JENKINS] Archiving <https://builds.apache.org/job/zookeeper-master-maven-jdk11/ws/zookeeper-jute/target/zookeeper-jute-3.6.0-SNAPSHOT-javadoc.jar>
to org.apache.zookeeper/zookeeper-jute/3.6.0-SNAPSHOT/zookeeper-jute-3.6.0-SNAPSHOT-javadoc.jar
[Fast Archiver] Compressed 1.75 MB of artifacts by 10.7% relative to #86
[JENKINS] Archiving <https://builds.apache.org/job/zookeeper-master-maven-jdk11/ws/zookeeper-recipes/zookeeper-recipes-queue/pom.xml>
to org.apache.zookeeper/zookeeper-recipes-queue/3.6.0-SNAPSHOT/zookeeper-recipes-queue-3.6.0-SNAPSHOT.pom
[JENKINS] Archiving <https://builds.apache.org/job/zookeeper-master-maven-jdk11/ws/zookeeper-docs/pom.xml>
to org.apache.zookeeper/zookeeper-docs/3.6.0-SNAPSHOT/zookeeper-docs-3.6.0-SNAPSHOT.pom
[JENKINS] Archiving <https://builds.apache.org/job/zookeeper-master-maven-jdk11/ws/zookeeper-docs/target/zookeeper-docs-3.6.0-SNAPSHOT.jar>
to org.apache.zookeeper/zookeeper-docs/3.6.0-SNAPSHOT/zookeeper-docs-3.6.0-SNAPSHOT.jar
[JENKINS] Archiving <https://builds.apache.org/job/zookeeper-master-maven-jdk11/ws/zookeeper-docs/target/zookeeper-docs-3.6.0-SNAPSHOT-tests.jar>
to org.apache.zookeeper/zookeeper-docs/3.6.0-SNAPSHOT/zookeeper-docs-3.6.0-SNAPSHOT-tests.jar
[JENKINS] Archiving <https://builds.apache.org/job/zookeeper-master-maven-jdk11/ws/zookeeper-docs/target/zookeeper-docs-3.6.0-SNAPSHOT-sources.jar>
to org.apache.zookeeper/zookeeper-docs/3.6.0-SNAPSHOT/zookeeper-docs-3.6.0-SNAPSHOT-sources.jar
[JENKINS] Archiving <https://builds.apache.org/job/zookeeper-master-maven-jdk11/ws/zookeeper-recipes/pom.xml>
to org.apache.zookeeper/zookeeper-recipes/3.6.0-SNAPSHOT/zookeeper-recipes-3.6.0-SNAPSHOT.pom
[JENKINS] Archiving <https://builds.apache.org/job/zookeeper-master-maven-jdk11/ws/zookeeper-client/zookeeper-client-c/pom.xml>
to org.apache.zookeeper/zookeeper-client-c/3.6.0-SNAPSHOT/zookeeper-client-c-3.6.0-SNAPSHOT.pom
[JENKINS] Archiving <https://builds.apache.org/job/zookeeper-master-maven-jdk11/ws/zookeeper-contrib/zookeeper-contrib-rest/pom.xml>
to org.apache.zookeeper/zookeeper-contrib-rest/3.6.0-SNAPSHOT/zookeeper-contrib-rest-3.6.0-SNAPSHOT.pom
[JENKINS] Archiving <https://builds.apache.org/job/zookeeper-master-maven-jdk11/ws/zookeeper-assembly/pom.xml>
to org.apache.zookeeper/zookeeper-assembly/3.6.0-SNAPSHOT/zookeeper-assembly-3.6.0-SNAPSHOT.pom
[JENKINS] Archiving <https://builds.apache.org/job/zookeeper-master-maven-jdk11/ws/zookeeper-contrib/zookeeper-contrib-zooinspector/pom.xml>
to org.apache.zookeeper/zookeeper-contrib-zooinspector/3.6.0-SNAPSHOT/zookeeper-contrib-zooinspector-3.6.0-SNAPSHOT.pom
channel stopped
[SpotBugs] Skipping execution of recorder since overall result is 'FAILURE'

Mime
View raw message