zookeeper-dev mailing list archives

Site index · List index
Message view « Date » · « Thread »
Top « Date » · « Thread »
From Apache Jenkins Server <jenk...@builds.apache.org>
Subject Build failed in Jenkins: PreCommit-ZOOKEEPER-github-pr-build-maven #1138
Date Fri, 16 Aug 2019 02:07:28 GMT
See <https://builds.apache.org/job/PreCommit-ZOOKEEPER-github-pr-build-maven/1138/display/redirect>

------------------------------------------
[...truncated 2.73 MB...]
     [exec] g++ -DHAVE_CONFIG_H -I. -I<https://builds.apache.org/job/PreCommit-ZOOKEEPER-github-pr-build-maven/ws/zookeeper-client/zookeeper-client-c>  -I<https://builds.apache.org/job/PreCommit-ZOOKEEPER-github-pr-build-maven/ws/zookeeper-client/zookeeper-client-c/include> -I<https://builds.apache.org/job/PreCommit-ZOOKEEPER-github-pr-build-maven/ws/zookeeper-client/zookeeper-client-c/tests> -I<https://builds.apache.org/job/PreCommit-ZOOKEEPER-github-pr-build-maven/ws/zookeeper-client/zookeeper-client-c/generated>   -DUSE_STATIC_LIB -DZKSERVER_CMD="\"<https://builds.apache.org/job/PreCommit-ZOOKEEPER-github-pr-build-maven/ws/zookeeper-client/zookeeper-client-c/../../zookeeper-client/zookeeper-client-c/tests/zkServer.sh\""> -DZOO_IPV6_ENABLED  -g -O2 -MT zktest_st-MocksBase.o -MD -MP -MF .deps/zktest_st-MocksBase.Tpo -c -o zktest_st-MocksBase.o `test -f 'tests/MocksBase.cc' || echo '<https://builds.apache.org/job/PreCommit-ZOOKEEPER-github-pr-build-maven/ws/zookeeper-client/zookeeper-client-c/'`tests/MocksBase.cc>
     [exec] mv -f .deps/zktest_st-MocksBase.Tpo .deps/zktest_st-MocksBase.Po
     [exec] g++ -DHAVE_CONFIG_H -I. -I<https://builds.apache.org/job/PreCommit-ZOOKEEPER-github-pr-build-maven/ws/zookeeper-client/zookeeper-client-c>  -I<https://builds.apache.org/job/PreCommit-ZOOKEEPER-github-pr-build-maven/ws/zookeeper-client/zookeeper-client-c/include> -I<https://builds.apache.org/job/PreCommit-ZOOKEEPER-github-pr-build-maven/ws/zookeeper-client/zookeeper-client-c/tests> -I<https://builds.apache.org/job/PreCommit-ZOOKEEPER-github-pr-build-maven/ws/zookeeper-client/zookeeper-client-c/generated>   -DUSE_STATIC_LIB -DZKSERVER_CMD="\"<https://builds.apache.org/job/PreCommit-ZOOKEEPER-github-pr-build-maven/ws/zookeeper-client/zookeeper-client-c/../../zookeeper-client/zookeeper-client-c/tests/zkServer.sh\""> -DZOO_IPV6_ENABLED  -g -O2 -MT zktest_st-ZKMocks.o -MD -MP -MF .deps/zktest_st-ZKMocks.Tpo -c -o zktest_st-ZKMocks.o `test -f 'tests/ZKMocks.cc' || echo '<https://builds.apache.org/job/PreCommit-ZOOKEEPER-github-pr-build-maven/ws/zookeeper-client/zookeeper-client-c/'`tests/ZKMocks.cc>
     [exec] mv -f .deps/zktest_st-ZKMocks.Tpo .deps/zktest_st-ZKMocks.Po
     [exec] g++ -DHAVE_CONFIG_H -I. -I<https://builds.apache.org/job/PreCommit-ZOOKEEPER-github-pr-build-maven/ws/zookeeper-client/zookeeper-client-c>  -I<https://builds.apache.org/job/PreCommit-ZOOKEEPER-github-pr-build-maven/ws/zookeeper-client/zookeeper-client-c/include> -I<https://builds.apache.org/job/PreCommit-ZOOKEEPER-github-pr-build-maven/ws/zookeeper-client/zookeeper-client-c/tests> -I<https://builds.apache.org/job/PreCommit-ZOOKEEPER-github-pr-build-maven/ws/zookeeper-client/zookeeper-client-c/generated>   -DUSE_STATIC_LIB -DZKSERVER_CMD="\"<https://builds.apache.org/job/PreCommit-ZOOKEEPER-github-pr-build-maven/ws/zookeeper-client/zookeeper-client-c/../../zookeeper-client/zookeeper-client-c/tests/zkServer.sh\""> -DZOO_IPV6_ENABLED  -g -O2 -MT zktest_st-Util.o -MD -MP -MF .deps/zktest_st-Util.Tpo -c -o zktest_st-Util.o `test -f 'tests/Util.cc' || echo '<https://builds.apache.org/job/PreCommit-ZOOKEEPER-github-pr-build-maven/ws/zookeeper-client/zookeeper-client-c/'`tests/Util.cc>
     [exec] mv -f .deps/zktest_st-Util.Tpo .deps/zktest_st-Util.Po
     [exec] g++ -DHAVE_CONFIG_H -I. -I<https://builds.apache.org/job/PreCommit-ZOOKEEPER-github-pr-build-maven/ws/zookeeper-client/zookeeper-client-c>  -I<https://builds.apache.org/job/PreCommit-ZOOKEEPER-github-pr-build-maven/ws/zookeeper-client/zookeeper-client-c/include> -I<https://builds.apache.org/job/PreCommit-ZOOKEEPER-github-pr-build-maven/ws/zookeeper-client/zookeeper-client-c/tests> -I<https://builds.apache.org/job/PreCommit-ZOOKEEPER-github-pr-build-maven/ws/zookeeper-client/zookeeper-client-c/generated>   -DUSE_STATIC_LIB -DZKSERVER_CMD="\"<https://builds.apache.org/job/PreCommit-ZOOKEEPER-github-pr-build-maven/ws/zookeeper-client/zookeeper-client-c/../../zookeeper-client/zookeeper-client-c/tests/zkServer.sh\""> -DZOO_IPV6_ENABLED  -g -O2 -MT zktest_st-ThreadingUtil.o -MD -MP -MF .deps/zktest_st-ThreadingUtil.Tpo -c -o zktest_st-ThreadingUtil.o `test -f 'tests/ThreadingUtil.cc' || echo '<https://builds.apache.org/job/PreCommit-ZOOKEEPER-github-pr-build-maven/ws/zookeeper-client/zookeeper-client-c/'`tests/ThreadingUtil.cc>
     [exec] mv -f .deps/zktest_st-ThreadingUtil.Tpo .deps/zktest_st-ThreadingUtil.Po
     [exec] g++ -DHAVE_CONFIG_H -I. -I<https://builds.apache.org/job/PreCommit-ZOOKEEPER-github-pr-build-maven/ws/zookeeper-client/zookeeper-client-c>  -I<https://builds.apache.org/job/PreCommit-ZOOKEEPER-github-pr-build-maven/ws/zookeeper-client/zookeeper-client-c/include> -I<https://builds.apache.org/job/PreCommit-ZOOKEEPER-github-pr-build-maven/ws/zookeeper-client/zookeeper-client-c/tests> -I<https://builds.apache.org/job/PreCommit-ZOOKEEPER-github-pr-build-maven/ws/zookeeper-client/zookeeper-client-c/generated>   -DUSE_STATIC_LIB -DZKSERVER_CMD="\"<https://builds.apache.org/job/PreCommit-ZOOKEEPER-github-pr-build-maven/ws/zookeeper-client/zookeeper-client-c/../../zookeeper-client/zookeeper-client-c/tests/zkServer.sh\""> -DZOO_IPV6_ENABLED  -g -O2 -MT zktest_st-TestZookeeperInit.o -MD -MP -MF .deps/zktest_st-TestZookeeperInit.Tpo -c -o zktest_st-TestZookeeperInit.o `test -f 'tests/TestZookeeperInit.cc' || echo '<https://builds.apache.org/job/PreCommit-ZOOKEEPER-github-pr-build-maven/ws/zookeeper-client/zookeeper-client-c/'`tests/TestZookeeperInit.cc>
     [exec] mv -f .deps/zktest_st-TestZookeeperInit.Tpo .deps/zktest_st-TestZookeeperInit.Po
     [exec] g++ -DHAVE_CONFIG_H -I. -I<https://builds.apache.org/job/PreCommit-ZOOKEEPER-github-pr-build-maven/ws/zookeeper-client/zookeeper-client-c>  -I<https://builds.apache.org/job/PreCommit-ZOOKEEPER-github-pr-build-maven/ws/zookeeper-client/zookeeper-client-c/include> -I<https://builds.apache.org/job/PreCommit-ZOOKEEPER-github-pr-build-maven/ws/zookeeper-client/zookeeper-client-c/tests> -I<https://builds.apache.org/job/PreCommit-ZOOKEEPER-github-pr-build-maven/ws/zookeeper-client/zookeeper-client-c/generated>   -DUSE_STATIC_LIB -DZKSERVER_CMD="\"<https://builds.apache.org/job/PreCommit-ZOOKEEPER-github-pr-build-maven/ws/zookeeper-client/zookeeper-client-c/../../zookeeper-client/zookeeper-client-c/tests/zkServer.sh\""> -DZOO_IPV6_ENABLED  -g -O2 -MT zktest_st-TestZookeeperClose.o -MD -MP -MF .deps/zktest_st-TestZookeeperClose.Tpo -c -o zktest_st-TestZookeeperClose.o `test -f 'tests/TestZookeeperClose.cc' || echo '<https://builds.apache.org/job/PreCommit-ZOOKEEPER-github-pr-build-maven/ws/zookeeper-client/zookeeper-client-c/'`tests/TestZookeeperClose.cc>
     [exec] mv -f .deps/zktest_st-TestZookeeperClose.Tpo .deps/zktest_st-TestZookeeperClose.Po
     [exec] g++ -DHAVE_CONFIG_H -I. -I<https://builds.apache.org/job/PreCommit-ZOOKEEPER-github-pr-build-maven/ws/zookeeper-client/zookeeper-client-c>  -I<https://builds.apache.org/job/PreCommit-ZOOKEEPER-github-pr-build-maven/ws/zookeeper-client/zookeeper-client-c/include> -I<https://builds.apache.org/job/PreCommit-ZOOKEEPER-github-pr-build-maven/ws/zookeeper-client/zookeeper-client-c/tests> -I<https://builds.apache.org/job/PreCommit-ZOOKEEPER-github-pr-build-maven/ws/zookeeper-client/zookeeper-client-c/generated>   -DUSE_STATIC_LIB -DZKSERVER_CMD="\"<https://builds.apache.org/job/PreCommit-ZOOKEEPER-github-pr-build-maven/ws/zookeeper-client/zookeeper-client-c/../../zookeeper-client/zookeeper-client-c/tests/zkServer.sh\""> -DZOO_IPV6_ENABLED  -g -O2 -MT zktest_st-TestReconfig.o -MD -MP -MF .deps/zktest_st-TestReconfig.Tpo -c -o zktest_st-TestReconfig.o `test -f 'tests/TestReconfig.cc' || echo '<https://builds.apache.org/job/PreCommit-ZOOKEEPER-github-pr-build-maven/ws/zookeeper-client/zookeeper-client-c/'`tests/TestReconfig.cc>
     [exec] mv -f .deps/zktest_st-TestReconfig.Tpo .deps/zktest_st-TestReconfig.Po
     [exec] g++ -DHAVE_CONFIG_H -I. -I<https://builds.apache.org/job/PreCommit-ZOOKEEPER-github-pr-build-maven/ws/zookeeper-client/zookeeper-client-c>  -I<https://builds.apache.org/job/PreCommit-ZOOKEEPER-github-pr-build-maven/ws/zookeeper-client/zookeeper-client-c/include> -I<https://builds.apache.org/job/PreCommit-ZOOKEEPER-github-pr-build-maven/ws/zookeeper-client/zookeeper-client-c/tests> -I<https://builds.apache.org/job/PreCommit-ZOOKEEPER-github-pr-build-maven/ws/zookeeper-client/zookeeper-client-c/generated>   -DUSE_STATIC_LIB -DZKSERVER_CMD="\"<https://builds.apache.org/job/PreCommit-ZOOKEEPER-github-pr-build-maven/ws/zookeeper-client/zookeeper-client-c/../../zookeeper-client/zookeeper-client-c/tests/zkServer.sh\""> -DZOO_IPV6_ENABLED  -g -O2 -MT zktest_st-TestReconfigServer.o -MD -MP -MF .deps/zktest_st-TestReconfigServer.Tpo -c -o zktest_st-TestReconfigServer.o `test -f 'tests/TestReconfigServer.cc' || echo '<https://builds.apache.org/job/PreCommit-ZOOKEEPER-github-pr-build-maven/ws/zookeeper-client/zookeeper-client-c/'`tests/TestReconfigServer.cc>
     [exec] mv -f .deps/zktest_st-TestReconfigServer.Tpo .deps/zktest_st-TestReconfigServer.Po
     [exec] g++ -DHAVE_CONFIG_H -I. -I<https://builds.apache.org/job/PreCommit-ZOOKEEPER-github-pr-build-maven/ws/zookeeper-client/zookeeper-client-c>  -I<https://builds.apache.org/job/PreCommit-ZOOKEEPER-github-pr-build-maven/ws/zookeeper-client/zookeeper-client-c/include> -I<https://builds.apache.org/job/PreCommit-ZOOKEEPER-github-pr-build-maven/ws/zookeeper-client/zookeeper-client-c/tests> -I<https://builds.apache.org/job/PreCommit-ZOOKEEPER-github-pr-build-maven/ws/zookeeper-client/zookeeper-client-c/generated>   -DUSE_STATIC_LIB -DZKSERVER_CMD="\"<https://builds.apache.org/job/PreCommit-ZOOKEEPER-github-pr-build-maven/ws/zookeeper-client/zookeeper-client-c/../../zookeeper-client/zookeeper-client-c/tests/zkServer.sh\""> -DZOO_IPV6_ENABLED  -g -O2 -MT zktest_st-TestClientRetry.o -MD -MP -MF .deps/zktest_st-TestClientRetry.Tpo -c -o zktest_st-TestClientRetry.o `test -f 'tests/TestClientRetry.cc' || echo '<https://builds.apache.org/job/PreCommit-ZOOKEEPER-github-pr-build-maven/ws/zookeeper-client/zookeeper-client-c/'`tests/TestClientRetry.cc>
     [exec] mv -f .deps/zktest_st-TestClientRetry.Tpo .deps/zktest_st-TestClientRetry.Po
     [exec] g++ -DHAVE_CONFIG_H -I. -I<https://builds.apache.org/job/PreCommit-ZOOKEEPER-github-pr-build-maven/ws/zookeeper-client/zookeeper-client-c>  -I<https://builds.apache.org/job/PreCommit-ZOOKEEPER-github-pr-build-maven/ws/zookeeper-client/zookeeper-client-c/include> -I<https://builds.apache.org/job/PreCommit-ZOOKEEPER-github-pr-build-maven/ws/zookeeper-client/zookeeper-client-c/tests> -I<https://builds.apache.org/job/PreCommit-ZOOKEEPER-github-pr-build-maven/ws/zookeeper-client/zookeeper-client-c/generated>   -DUSE_STATIC_LIB -DZKSERVER_CMD="\"<https://builds.apache.org/job/PreCommit-ZOOKEEPER-github-pr-build-maven/ws/zookeeper-client/zookeeper-client-c/../../zookeeper-client/zookeeper-client-c/tests/zkServer.sh\""> -DZOO_IPV6_ENABLED  -g -O2 -MT zktest_st-TestOperations.o -MD -MP -MF .deps/zktest_st-TestOperations.Tpo -c -o zktest_st-TestOperations.o `test -f 'tests/TestOperations.cc' || echo '<https://builds.apache.org/job/PreCommit-ZOOKEEPER-github-pr-build-maven/ws/zookeeper-client/zookeeper-client-c/'`tests/TestOperations.cc>
     [exec] mv -f .deps/zktest_st-TestOperations.Tpo .deps/zktest_st-TestOperations.Po
     [exec] g++ -DHAVE_CONFIG_H -I. -I<https://builds.apache.org/job/PreCommit-ZOOKEEPER-github-pr-build-maven/ws/zookeeper-client/zookeeper-client-c>  -I<https://builds.apache.org/job/PreCommit-ZOOKEEPER-github-pr-build-maven/ws/zookeeper-client/zookeeper-client-c/include> -I<https://builds.apache.org/job/PreCommit-ZOOKEEPER-github-pr-build-maven/ws/zookeeper-client/zookeeper-client-c/tests> -I<https://builds.apache.org/job/PreCommit-ZOOKEEPER-github-pr-build-maven/ws/zookeeper-client/zookeeper-client-c/generated>   -DUSE_STATIC_LIB -DZKSERVER_CMD="\"<https://builds.apache.org/job/PreCommit-ZOOKEEPER-github-pr-build-maven/ws/zookeeper-client/zookeeper-client-c/../../zookeeper-client/zookeeper-client-c/tests/zkServer.sh\""> -DZOO_IPV6_ENABLED  -g -O2 -MT zktest_st-TestMulti.o -MD -MP -MF .deps/zktest_st-TestMulti.Tpo -c -o zktest_st-TestMulti.o `test -f 'tests/TestMulti.cc' || echo '<https://builds.apache.org/job/PreCommit-ZOOKEEPER-github-pr-build-maven/ws/zookeeper-client/zookeeper-client-c/'`tests/TestMulti.cc>
     [exec] mv -f .deps/zktest_st-TestMulti.Tpo .deps/zktest_st-TestMulti.Po
     [exec] g++ -DHAVE_CONFIG_H -I. -I<https://builds.apache.org/job/PreCommit-ZOOKEEPER-github-pr-build-maven/ws/zookeeper-client/zookeeper-client-c>  -I<https://builds.apache.org/job/PreCommit-ZOOKEEPER-github-pr-build-maven/ws/zookeeper-client/zookeeper-client-c/include> -I<https://builds.apache.org/job/PreCommit-ZOOKEEPER-github-pr-build-maven/ws/zookeeper-client/zookeeper-client-c/tests> -I<https://builds.apache.org/job/PreCommit-ZOOKEEPER-github-pr-build-maven/ws/zookeeper-client/zookeeper-client-c/generated>   -DUSE_STATIC_LIB -DZKSERVER_CMD="\"<https://builds.apache.org/job/PreCommit-ZOOKEEPER-github-pr-build-maven/ws/zookeeper-client/zookeeper-client-c/../../zookeeper-client/zookeeper-client-c/tests/zkServer.sh\""> -DZOO_IPV6_ENABLED  -g -O2 -MT zktest_st-TestWatchers.o -MD -MP -MF .deps/zktest_st-TestWatchers.Tpo -c -o zktest_st-TestWatchers.o `test -f 'tests/TestWatchers.cc' || echo '<https://builds.apache.org/job/PreCommit-ZOOKEEPER-github-pr-build-maven/ws/zookeeper-client/zookeeper-client-c/'`tests/TestWatchers.cc>
     [exec] mv -f .deps/zktest_st-TestWatchers.Tpo .deps/zktest_st-TestWatchers.Po
     [exec] g++ -DHAVE_CONFIG_H -I. -I<https://builds.apache.org/job/PreCommit-ZOOKEEPER-github-pr-build-maven/ws/zookeeper-client/zookeeper-client-c>  -I<https://builds.apache.org/job/PreCommit-ZOOKEEPER-github-pr-build-maven/ws/zookeeper-client/zookeeper-client-c/include> -I<https://builds.apache.org/job/PreCommit-ZOOKEEPER-github-pr-build-maven/ws/zookeeper-client/zookeeper-client-c/tests> -I<https://builds.apache.org/job/PreCommit-ZOOKEEPER-github-pr-build-maven/ws/zookeeper-client/zookeeper-client-c/generated>   -DUSE_STATIC_LIB -DZKSERVER_CMD="\"<https://builds.apache.org/job/PreCommit-ZOOKEEPER-github-pr-build-maven/ws/zookeeper-client/zookeeper-client-c/../../zookeeper-client/zookeeper-client-c/tests/zkServer.sh\""> -DZOO_IPV6_ENABLED  -g -O2 -MT zktest_st-TestClient.o -MD -MP -MF .deps/zktest_st-TestClient.Tpo -c -o zktest_st-TestClient.o `test -f 'tests/TestClient.cc' || echo '<https://builds.apache.org/job/PreCommit-ZOOKEEPER-github-pr-build-maven/ws/zookeeper-client/zookeeper-client-c/'`tests/TestClient.cc>
     [exec] mv -f .deps/zktest_st-TestClient.Tpo .deps/zktest_st-TestClient.Po
     [exec] g++ -DHAVE_CONFIG_H -I. -I<https://builds.apache.org/job/PreCommit-ZOOKEEPER-github-pr-build-maven/ws/zookeeper-client/zookeeper-client-c>  -I<https://builds.apache.org/job/PreCommit-ZOOKEEPER-github-pr-build-maven/ws/zookeeper-client/zookeeper-client-c/include> -I<https://builds.apache.org/job/PreCommit-ZOOKEEPER-github-pr-build-maven/ws/zookeeper-client/zookeeper-client-c/tests> -I<https://builds.apache.org/job/PreCommit-ZOOKEEPER-github-pr-build-maven/ws/zookeeper-client/zookeeper-client-c/generated>   -DUSE_STATIC_LIB -DZKSERVER_CMD="\"<https://builds.apache.org/job/PreCommit-ZOOKEEPER-github-pr-build-maven/ws/zookeeper-client/zookeeper-client-c/../../zookeeper-client/zookeeper-client-c/tests/zkServer.sh\""> -DZOO_IPV6_ENABLED  -g -O2 -MT zktest_st-ZooKeeperQuorumServer.o -MD -MP -MF .deps/zktest_st-ZooKeeperQuorumServer.Tpo -c -o zktest_st-ZooKeeperQuorumServer.o `test -f 'tests/ZooKeeperQuorumServer.cc' || echo '<https://builds.apache.org/job/PreCommit-ZOOKEEPER-github-pr-build-maven/ws/zookeeper-client/zookeeper-client-c/'`tests/ZooKeeperQuorumServer.cc>
     [exec] mv -f .deps/zktest_st-ZooKeeperQuorumServer.Tpo .deps/zktest_st-ZooKeeperQuorumServer.Po
     [exec] g++ -DHAVE_CONFIG_H -I. -I<https://builds.apache.org/job/PreCommit-ZOOKEEPER-github-pr-build-maven/ws/zookeeper-client/zookeeper-client-c>  -I<https://builds.apache.org/job/PreCommit-ZOOKEEPER-github-pr-build-maven/ws/zookeeper-client/zookeeper-client-c/include> -I<https://builds.apache.org/job/PreCommit-ZOOKEEPER-github-pr-build-maven/ws/zookeeper-client/zookeeper-client-c/tests> -I<https://builds.apache.org/job/PreCommit-ZOOKEEPER-github-pr-build-maven/ws/zookeeper-client/zookeeper-client-c/generated>   -DUSE_STATIC_LIB -DZKSERVER_CMD="\"<https://builds.apache.org/job/PreCommit-ZOOKEEPER-github-pr-build-maven/ws/zookeeper-client/zookeeper-client-c/../../zookeeper-client/zookeeper-client-c/tests/zkServer.sh\""> -DZOO_IPV6_ENABLED  -g -O2 -MT zktest_st-TestReadOnlyClient.o -MD -MP -MF .deps/zktest_st-TestReadOnlyClient.Tpo -c -o zktest_st-TestReadOnlyClient.o `test -f 'tests/TestReadOnlyClient.cc' || echo '<https://builds.apache.org/job/PreCommit-ZOOKEEPER-github-pr-build-maven/ws/zookeeper-client/zookeeper-client-c/'`tests/TestReadOnlyClient.cc>
     [exec] mv -f .deps/zktest_st-TestReadOnlyClient.Tpo .deps/zktest_st-TestReadOnlyClient.Po
     [exec] g++ -DHAVE_CONFIG_H -I. -I<https://builds.apache.org/job/PreCommit-ZOOKEEPER-github-pr-build-maven/ws/zookeeper-client/zookeeper-client-c>  -I<https://builds.apache.org/job/PreCommit-ZOOKEEPER-github-pr-build-maven/ws/zookeeper-client/zookeeper-client-c/include> -I<https://builds.apache.org/job/PreCommit-ZOOKEEPER-github-pr-build-maven/ws/zookeeper-client/zookeeper-client-c/tests> -I<https://builds.apache.org/job/PreCommit-ZOOKEEPER-github-pr-build-maven/ws/zookeeper-client/zookeeper-client-c/generated>   -DUSE_STATIC_LIB -DZKSERVER_CMD="\"<https://builds.apache.org/job/PreCommit-ZOOKEEPER-github-pr-build-maven/ws/zookeeper-client/zookeeper-client-c/../../zookeeper-client/zookeeper-client-c/tests/zkServer.sh\""> -DZOO_IPV6_ENABLED  -g -O2 -MT zktest_st-TestLogClientEnv.o -MD -MP -MF .deps/zktest_st-TestLogClientEnv.Tpo -c -o zktest_st-TestLogClientEnv.o `test -f 'tests/TestLogClientEnv.cc' || echo '<https://builds.apache.org/job/PreCommit-ZOOKEEPER-github-pr-build-maven/ws/zookeeper-client/zookeeper-client-c/'`tests/TestLogClientEnv.cc>
     [exec] mv -f .deps/zktest_st-TestLogClientEnv.Tpo .deps/zktest_st-TestLogClientEnv.Po
     [exec] g++ -DHAVE_CONFIG_H -I. -I<https://builds.apache.org/job/PreCommit-ZOOKEEPER-github-pr-build-maven/ws/zookeeper-client/zookeeper-client-c>  -I<https://builds.apache.org/job/PreCommit-ZOOKEEPER-github-pr-build-maven/ws/zookeeper-client/zookeeper-client-c/include> -I<https://builds.apache.org/job/PreCommit-ZOOKEEPER-github-pr-build-maven/ws/zookeeper-client/zookeeper-client-c/tests> -I<https://builds.apache.org/job/PreCommit-ZOOKEEPER-github-pr-build-maven/ws/zookeeper-client/zookeeper-client-c/generated>   -DUSE_STATIC_LIB -DZKSERVER_CMD="\"<https://builds.apache.org/job/PreCommit-ZOOKEEPER-github-pr-build-maven/ws/zookeeper-client/zookeeper-client-c/../../zookeeper-client/zookeeper-client-c/tests/zkServer.sh\""> -DZOO_IPV6_ENABLED  -g -O2 -MT zktest_st-TestServerRequireClientSASLAuth.o -MD -MP -MF .deps/zktest_st-TestServerRequireClientSASLAuth.Tpo -c -o zktest_st-TestServerRequireClientSASLAuth.o `test -f 'tests/TestServerRequireClientSASLAuth.cc' || echo '<https://builds.apache.org/job/PreCommit-ZOOKEEPER-github-pr-build-maven/ws/zookeeper-client/zookeeper-client-c/'`tests/TestServerRequireClientSASLAuth.cc>
     [exec] mv -f .deps/zktest_st-TestServerRequireClientSASLAuth.Tpo .deps/zktest_st-TestServerRequireClientSASLAuth.Po
     [exec] /bin/bash ./libtool  --tag=CXX   --mode=link g++ -DUSE_STATIC_LIB -DZKSERVER_CMD="\"<https://builds.apache.org/job/PreCommit-ZOOKEEPER-github-pr-build-maven/ws/zookeeper-client/zookeeper-client-c/../../zookeeper-client/zookeeper-client-c/tests/zkServer.sh\""> -DZOO_IPV6_ENABLED  -g -O2 -shared -Wl,--wrap -Wl,calloc -Wl,--wrap -Wl,free -Wl,--wrap -Wl,flush_send_queue -Wl,--wrap -Wl,get_xid -Wl,--wrap -Wl,deliverWatchers -Wl,--wrap -Wl,activateWatcher -Wl,--wrap -Wl,realloc   -o zktest-st zktest_st-TestDriver.o zktest_st-LibCMocks.o zktest_st-LibCSymTable.o zktest_st-MocksBase.o zktest_st-ZKMocks.o zktest_st-Util.o zktest_st-ThreadingUtil.o zktest_st-TestZookeeperInit.o zktest_st-TestZookeeperClose.o zktest_st-TestReconfig.o zktest_st-TestReconfigServer.o zktest_st-TestClientRetry.o zktest_st-TestOperations.o zktest_st-TestMulti.o zktest_st-TestWatchers.o zktest_st-TestClient.o zktest_st-ZooKeeperQuorumServer.o zktest_st-TestReadOnlyClient.o zktest_st-TestLogClientEnv.o zktest_st-TestServerRequireClientSASLAuth.o libzkst.la libhashtable.la -L/usr/lib/x86_64-linux-gnu -lcppunit -ldl -ldl 
     [exec] libtool: link: g++ -DUSE_STATIC_LIB -DZKSERVER_CMD=\"<https://builds.apache.org/job/PreCommit-ZOOKEEPER-github-pr-build-maven/ws/zookeeper-client/zookeeper-client-c/../../zookeeper-client/zookeeper-client-c/tests/zkServer.sh\"> -DZOO_IPV6_ENABLED -g -O2 -Wl,--wrap -Wl,calloc -Wl,--wrap -Wl,free -Wl,--wrap -Wl,flush_send_queue -Wl,--wrap -Wl,get_xid -Wl,--wrap -Wl,deliverWatchers -Wl,--wrap -Wl,activateWatcher -Wl,--wrap -Wl,realloc -o zktest-st zktest_st-TestDriver.o zktest_st-LibCMocks.o zktest_st-LibCSymTable.o zktest_st-MocksBase.o zktest_st-ZKMocks.o zktest_st-Util.o zktest_st-ThreadingUtil.o zktest_st-TestZookeeperInit.o zktest_st-TestZookeeperClose.o zktest_st-TestReconfig.o zktest_st-TestReconfigServer.o zktest_st-TestClientRetry.o zktest_st-TestOperations.o zktest_st-TestMulti.o zktest_st-TestWatchers.o zktest_st-TestClient.o zktest_st-ZooKeeperQuorumServer.o zktest_st-TestReadOnlyClient.o zktest_st-TestLogClientEnv.o zktest_st-TestServerRequireClientSASLAuth.o  ./.libs/libzkst.a -lm -lrt ./.libs/libhashtable.a -lgcov -L/usr/lib/x86_64-linux-gnu -lcppunit -ldl
     [exec] g++ -DHAVE_CONFIG_H -I. -I<https://builds.apache.org/job/PreCommit-ZOOKEEPER-github-pr-build-maven/ws/zookeeper-client/zookeeper-client-c>  -I<https://builds.apache.org/job/PreCommit-ZOOKEEPER-github-pr-build-maven/ws/zookeeper-client/zookeeper-client-c/include> -I<https://builds.apache.org/job/PreCommit-ZOOKEEPER-github-pr-build-maven/ws/zookeeper-client/zookeeper-client-c/tests> -I<https://builds.apache.org/job/PreCommit-ZOOKEEPER-github-pr-build-maven/ws/zookeeper-client/zookeeper-client-c/generated>   -DUSE_STATIC_LIB -DTHREADED -DZKSERVER_CMD="\"<https://builds.apache.org/job/PreCommit-ZOOKEEPER-github-pr-build-maven/ws/zookeeper-client/zookeeper-client-c/../../zookeeper-client/zookeeper-client-c/tests/zkServer.sh\""> -DZOO_IPV6_ENABLED -g -O2 -MT zktest_mt-TestDriver.o -MD -MP -MF .deps/zktest_mt-TestDriver.Tpo -c -o zktest_mt-TestDriver.o `test -f 'tests/TestDriver.cc' || echo '<https://builds.apache.org/job/PreCommit-ZOOKEEPER-github-pr-build-maven/ws/zookeeper-client/zookeeper-client-c/'`tests/TestDriver.cc>
     [exec] mv -f .deps/zktest_mt-TestDriver.Tpo .deps/zktest_mt-TestDriver.Po
     [exec] g++ -DHAVE_CONFIG_H -I. -I<https://builds.apache.org/job/PreCommit-ZOOKEEPER-github-pr-build-maven/ws/zookeeper-client/zookeeper-client-c>  -I<https://builds.apache.org/job/PreCommit-ZOOKEEPER-github-pr-build-maven/ws/zookeeper-client/zookeeper-client-c/include> -I<https://builds.apache.org/job/PreCommit-ZOOKEEPER-github-pr-build-maven/ws/zookeeper-client/zookeeper-client-c/tests> -I<https://builds.apache.org/job/PreCommit-ZOOKEEPER-github-pr-build-maven/ws/zookeeper-client/zookeeper-client-c/generated>   -DUSE_STATIC_LIB -DTHREADED -DZKSERVER_CMD="\"<https://builds.apache.org/job/PreCommit-ZOOKEEPER-github-pr-build-maven/ws/zookeeper-client/zookeeper-client-c/../../zookeeper-client/zookeeper-client-c/tests/zkServer.sh\""> -DZOO_IPV6_ENABLED -g -O2 -MT zktest_mt-LibCMocks.o -MD -MP -MF .deps/zktest_mt-LibCMocks.Tpo -c -o zktest_mt-LibCMocks.o `test -f 'tests/LibCMocks.cc' || echo '<https://builds.apache.org/job/PreCommit-ZOOKEEPER-github-pr-build-maven/ws/zookeeper-client/zookeeper-client-c/'`tests/LibCMocks.cc>
     [exec] mv -f .deps/zktest_mt-LibCMocks.Tpo .deps/zktest_mt-LibCMocks.Po
     [exec] g++ -DHAVE_CONFIG_H -I. -I<https://builds.apache.org/job/PreCommit-ZOOKEEPER-github-pr-build-maven/ws/zookeeper-client/zookeeper-client-c>  -I<https://builds.apache.org/job/PreCommit-ZOOKEEPER-github-pr-build-maven/ws/zookeeper-client/zookeeper-client-c/include> -I<https://builds.apache.org/job/PreCommit-ZOOKEEPER-github-pr-build-maven/ws/zookeeper-client/zookeeper-client-c/tests> -I<https://builds.apache.org/job/PreCommit-ZOOKEEPER-github-pr-build-maven/ws/zookeeper-client/zookeeper-client-c/generated>   -DUSE_STATIC_LIB -DTHREADED -DZKSERVER_CMD="\"<https://builds.apache.org/job/PreCommit-ZOOKEEPER-github-pr-build-maven/ws/zookeeper-client/zookeeper-client-c/../../zookeeper-client/zookeeper-client-c/tests/zkServer.sh\""> -DZOO_IPV6_ENABLED -g -O2 -MT zktest_mt-LibCSymTable.o -MD -MP -MF .deps/zktest_mt-LibCSymTable.Tpo -c -o zktest_mt-LibCSymTable.o `test -f 'tests/LibCSymTable.cc' || echo '<https://builds.apache.org/job/PreCommit-ZOOKEEPER-github-pr-build-maven/ws/zookeeper-client/zookeeper-client-c/'`tests/LibCSymTable.cc>
     [exec] mv -f .deps/zktest_mt-LibCSymTable.Tpo .deps/zktest_mt-LibCSymTable.Po
     [exec] g++ -DHAVE_CONFIG_H -I. -I<https://builds.apache.org/job/PreCommit-ZOOKEEPER-github-pr-build-maven/ws/zookeeper-client/zookeeper-client-c>  -I<https://builds.apache.org/job/PreCommit-ZOOKEEPER-github-pr-build-maven/ws/zookeeper-client/zookeeper-client-c/include> -I<https://builds.apache.org/job/PreCommit-ZOOKEEPER-github-pr-build-maven/ws/zookeeper-client/zookeeper-client-c/tests> -I<https://builds.apache.org/job/PreCommit-ZOOKEEPER-github-pr-build-maven/ws/zookeeper-client/zookeeper-client-c/generated>   -DUSE_STATIC_LIB -DTHREADED -DZKSERVER_CMD="\"<https://builds.apache.org/job/PreCommit-ZOOKEEPER-github-pr-build-maven/ws/zookeeper-client/zookeeper-client-c/../../zookeeper-client/zookeeper-client-c/tests/zkServer.sh\""> -DZOO_IPV6_ENABLED -g -O2 -MT zktest_mt-MocksBase.o -MD -MP -MF .deps/zktest_mt-MocksBase.Tpo -c -o zktest_mt-MocksBase.o `test -f 'tests/MocksBase.cc' || echo '<https://builds.apache.org/job/PreCommit-ZOOKEEPER-github-pr-build-maven/ws/zookeeper-client/zookeeper-client-c/'`tests/MocksBase.cc>
     [exec] mv -f .deps/zktest_mt-MocksBase.Tpo .deps/zktest_mt-MocksBase.Po
     [exec] g++ -DHAVE_CONFIG_H -I. -I<https://builds.apache.org/job/PreCommit-ZOOKEEPER-github-pr-build-maven/ws/zookeeper-client/zookeeper-client-c>  -I<https://builds.apache.org/job/PreCommit-ZOOKEEPER-github-pr-build-maven/ws/zookeeper-client/zookeeper-client-c/include> -I<https://builds.apache.org/job/PreCommit-ZOOKEEPER-github-pr-build-maven/ws/zookeeper-client/zookeeper-client-c/tests> -I<https://builds.apache.org/job/PreCommit-ZOOKEEPER-github-pr-build-maven/ws/zookeeper-client/zookeeper-client-c/generated>   -DUSE_STATIC_LIB -DTHREADED -DZKSERVER_CMD="\"<https://builds.apache.org/job/PreCommit-ZOOKEEPER-github-pr-build-maven/ws/zookeeper-client/zookeeper-client-c/../../zookeeper-client/zookeeper-client-c/tests/zkServer.sh\""> -DZOO_IPV6_ENABLED -g -O2 -MT zktest_mt-ZKMocks.o -MD -MP -MF .deps/zktest_mt-ZKMocks.Tpo -c -o zktest_mt-ZKMocks.o `test -f 'tests/ZKMocks.cc' || echo '<https://builds.apache.org/job/PreCommit-ZOOKEEPER-github-pr-build-maven/ws/zookeeper-client/zookeeper-client-c/'`tests/ZKMocks.cc>
     [exec] mv -f .deps/zktest_mt-ZKMocks.Tpo .deps/zktest_mt-ZKMocks.Po
     [exec] g++ -DHAVE_CONFIG_H -I. -I<https://builds.apache.org/job/PreCommit-ZOOKEEPER-github-pr-build-maven/ws/zookeeper-client/zookeeper-client-c>  -I<https://builds.apache.org/job/PreCommit-ZOOKEEPER-github-pr-build-maven/ws/zookeeper-client/zookeeper-client-c/include> -I<https://builds.apache.org/job/PreCommit-ZOOKEEPER-github-pr-build-maven/ws/zookeeper-client/zookeeper-client-c/tests> -I<https://builds.apache.org/job/PreCommit-ZOOKEEPER-github-pr-build-maven/ws/zookeeper-client/zookeeper-client-c/generated>   -DUSE_STATIC_LIB -DTHREADED -DZKSERVER_CMD="\"<https://builds.apache.org/job/PreCommit-ZOOKEEPER-github-pr-build-maven/ws/zookeeper-client/zookeeper-client-c/../../zookeeper-client/zookeeper-client-c/tests/zkServer.sh\""> -DZOO_IPV6_ENABLED -g -O2 -MT zktest_mt-Util.o -MD -MP -MF .deps/zktest_mt-Util.Tpo -c -o zktest_mt-Util.o `test -f 'tests/Util.cc' || echo '<https://builds.apache.org/job/PreCommit-ZOOKEEPER-github-pr-build-maven/ws/zookeeper-client/zookeeper-client-c/'`tests/Util.cc>
     [exec] mv -f .deps/zktest_mt-Util.Tpo .deps/zktest_mt-Util.Po
     [exec] g++ -DHAVE_CONFIG_H -I. -I<https://builds.apache.org/job/PreCommit-ZOOKEEPER-github-pr-build-maven/ws/zookeeper-client/zookeeper-client-c>  -I<https://builds.apache.org/job/PreCommit-ZOOKEEPER-github-pr-build-maven/ws/zookeeper-client/zookeeper-client-c/include> -I<https://builds.apache.org/job/PreCommit-ZOOKEEPER-github-pr-build-maven/ws/zookeeper-client/zookeeper-client-c/tests> -I<https://builds.apache.org/job/PreCommit-ZOOKEEPER-github-pr-build-maven/ws/zookeeper-client/zookeeper-client-c/generated>   -DUSE_STATIC_LIB -DTHREADED -DZKSERVER_CMD="\"<https://builds.apache.org/job/PreCommit-ZOOKEEPER-github-pr-build-maven/ws/zookeeper-client/zookeeper-client-c/../../zookeeper-client/zookeeper-client-c/tests/zkServer.sh\""> -DZOO_IPV6_ENABLED -g -O2 -MT zktest_mt-ThreadingUtil.o -MD -MP -MF .deps/zktest_mt-ThreadingUtil.Tpo -c -o zktest_mt-ThreadingUtil.o `test -f 'tests/ThreadingUtil.cc' || echo '<https://builds.apache.org/job/PreCommit-ZOOKEEPER-github-pr-build-maven/ws/zookeeper-client/zookeeper-client-c/'`tests/ThreadingUtil.cc>
     [exec] mv -f .deps/zktest_mt-ThreadingUtil.Tpo .deps/zktest_mt-ThreadingUtil.Po
     [exec] g++ -DHAVE_CONFIG_H -I. -I<https://builds.apache.org/job/PreCommit-ZOOKEEPER-github-pr-build-maven/ws/zookeeper-client/zookeeper-client-c>  -I<https://builds.apache.org/job/PreCommit-ZOOKEEPER-github-pr-build-maven/ws/zookeeper-client/zookeeper-client-c/include> -I<https://builds.apache.org/job/PreCommit-ZOOKEEPER-github-pr-build-maven/ws/zookeeper-client/zookeeper-client-c/tests> -I<https://builds.apache.org/job/PreCommit-ZOOKEEPER-github-pr-build-maven/ws/zookeeper-client/zookeeper-client-c/generated>   -DUSE_STATIC_LIB -DTHREADED -DZKSERVER_CMD="\"<https://builds.apache.org/job/PreCommit-ZOOKEEPER-github-pr-build-maven/ws/zookeeper-client/zookeeper-client-c/../../zookeeper-client/zookeeper-client-c/tests/zkServer.sh\""> -DZOO_IPV6_ENABLED -g -O2 -MT zktest_mt-TestZookeeperInit.o -MD -MP -MF .deps/zktest_mt-TestZookeeperInit.Tpo -c -o zktest_mt-TestZookeeperInit.o `test -f 'tests/TestZookeeperInit.cc' || echo '<https://builds.apache.org/job/PreCommit-ZOOKEEPER-github-pr-build-maven/ws/zookeeper-client/zookeeper-client-c/'`tests/TestZookeeperInit.cc>
     [exec] mv -f .deps/zktest_mt-TestZookeeperInit.Tpo .deps/zktest_mt-TestZookeeperInit.Po
     [exec] g++ -DHAVE_CONFIG_H -I. -I<https://builds.apache.org/job/PreCommit-ZOOKEEPER-github-pr-build-maven/ws/zookeeper-client/zookeeper-client-c>  -I<https://builds.apache.org/job/PreCommit-ZOOKEEPER-github-pr-build-maven/ws/zookeeper-client/zookeeper-client-c/include> -I<https://builds.apache.org/job/PreCommit-ZOOKEEPER-github-pr-build-maven/ws/zookeeper-client/zookeeper-client-c/tests> -I<https://builds.apache.org/job/PreCommit-ZOOKEEPER-github-pr-build-maven/ws/zookeeper-client/zookeeper-client-c/generated>   -DUSE_STATIC_LIB -DTHREADED -DZKSERVER_CMD="\"<https://builds.apache.org/job/PreCommit-ZOOKEEPER-github-pr-build-maven/ws/zookeeper-client/zookeeper-client-c/../../zookeeper-client/zookeeper-client-c/tests/zkServer.sh\""> -DZOO_IPV6_ENABLED -g -O2 -MT zktest_mt-TestZookeeperClose.o -MD -MP -MF .deps/zktest_mt-TestZookeeperClose.Tpo -c -o zktest_mt-TestZookeeperClose.o `test -f 'tests/TestZookeeperClose.cc' || echo '<https://builds.apache.org/job/PreCommit-ZOOKEEPER-github-pr-build-maven/ws/zookeeper-client/zookeeper-client-c/'`tests/TestZookeeperClose.cc>
     [exec] mv -f .deps/zktest_mt-TestZookeeperClose.Tpo .deps/zktest_mt-TestZookeeperClose.Po
     [exec] g++ -DHAVE_CONFIG_H -I. -I<https://builds.apache.org/job/PreCommit-ZOOKEEPER-github-pr-build-maven/ws/zookeeper-client/zookeeper-client-c>  -I<https://builds.apache.org/job/PreCommit-ZOOKEEPER-github-pr-build-maven/ws/zookeeper-client/zookeeper-client-c/include> -I<https://builds.apache.org/job/PreCommit-ZOOKEEPER-github-pr-build-maven/ws/zookeeper-client/zookeeper-client-c/tests> -I<https://builds.apache.org/job/PreCommit-ZOOKEEPER-github-pr-build-maven/ws/zookeeper-client/zookeeper-client-c/generated>   -DUSE_STATIC_LIB -DTHREADED -DZKSERVER_CMD="\"<https://builds.apache.org/job/PreCommit-ZOOKEEPER-github-pr-build-maven/ws/zookeeper-client/zookeeper-client-c/../../zookeeper-client/zookeeper-client-c/tests/zkServer.sh\""> -DZOO_IPV6_ENABLED -g -O2 -MT zktest_mt-TestReconfig.o -MD -MP -MF .deps/zktest_mt-TestReconfig.Tpo -c -o zktest_mt-TestReconfig.o `test -f 'tests/TestReconfig.cc' || echo '<https://builds.apache.org/job/PreCommit-ZOOKEEPER-github-pr-build-maven/ws/zookeeper-client/zookeeper-client-c/'`tests/TestReconfig.cc>
     [exec] mv -f .deps/zktest_mt-TestReconfig.Tpo .deps/zktest_mt-TestReconfig.Po
     [exec] g++ -DHAVE_CONFIG_H -I. -I<https://builds.apache.org/job/PreCommit-ZOOKEEPER-github-pr-build-maven/ws/zookeeper-client/zookeeper-client-c>  -I<https://builds.apache.org/job/PreCommit-ZOOKEEPER-github-pr-build-maven/ws/zookeeper-client/zookeeper-client-c/include> -I<https://builds.apache.org/job/PreCommit-ZOOKEEPER-github-pr-build-maven/ws/zookeeper-client/zookeeper-client-c/tests> -I<https://builds.apache.org/job/PreCommit-ZOOKEEPER-github-pr-build-maven/ws/zookeeper-client/zookeeper-client-c/generated>   -DUSE_STATIC_LIB -DTHREADED -DZKSERVER_CMD="\"<https://builds.apache.org/job/PreCommit-ZOOKEEPER-github-pr-build-maven/ws/zookeeper-client/zookeeper-client-c/../../zookeeper-client/zookeeper-client-c/tests/zkServer.sh\""> -DZOO_IPV6_ENABLED -g -O2 -MT zktest_mt-TestReconfigServer.o -MD -MP -MF .deps/zktest_mt-TestReconfigServer.Tpo -c -o zktest_mt-TestReconfigServer.o `test -f 'tests/TestReconfigServer.cc' || echo '<https://builds.apache.org/job/PreCommit-ZOOKEEPER-github-pr-build-maven/ws/zookeeper-client/zookeeper-client-c/'`tests/TestReconfigServer.cc>
     [exec] mv -f .deps/zktest_mt-TestReconfigServer.Tpo .deps/zktest_mt-TestReconfigServer.Po
     [exec] g++ -DHAVE_CONFIG_H -I. -I<https://builds.apache.org/job/PreCommit-ZOOKEEPER-github-pr-build-maven/ws/zookeeper-client/zookeeper-client-c>  -I<https://builds.apache.org/job/PreCommit-ZOOKEEPER-github-pr-build-maven/ws/zookeeper-client/zookeeper-client-c/include> -I<https://builds.apache.org/job/PreCommit-ZOOKEEPER-github-pr-build-maven/ws/zookeeper-client/zookeeper-client-c/tests> -I<https://builds.apache.org/job/PreCommit-ZOOKEEPER-github-pr-build-maven/ws/zookeeper-client/zookeeper-client-c/generated>   -DUSE_STATIC_LIB -DTHREADED -DZKSERVER_CMD="\"<https://builds.apache.org/job/PreCommit-ZOOKEEPER-github-pr-build-maven/ws/zookeeper-client/zookeeper-client-c/../../zookeeper-client/zookeeper-client-c/tests/zkServer.sh\""> -DZOO_IPV6_ENABLED -g -O2 -MT zktest_mt-TestClientRetry.o -MD -MP -MF .deps/zktest_mt-TestClientRetry.Tpo -c -o zktest_mt-TestClientRetry.o `test -f 'tests/TestClientRetry.cc' || echo '<https://builds.apache.org/job/PreCommit-ZOOKEEPER-github-pr-build-maven/ws/zookeeper-client/zookeeper-client-c/'`tests/TestClientRetry.cc>
     [exec] mv -f .deps/zktest_mt-TestClientRetry.Tpo .deps/zktest_mt-TestClientRetry.Po
     [exec] g++ -DHAVE_CONFIG_H -I. -I<https://builds.apache.org/job/PreCommit-ZOOKEEPER-github-pr-build-maven/ws/zookeeper-client/zookeeper-client-c>  -I<https://builds.apache.org/job/PreCommit-ZOOKEEPER-github-pr-build-maven/ws/zookeeper-client/zookeeper-client-c/include> -I<https://builds.apache.org/job/PreCommit-ZOOKEEPER-github-pr-build-maven/ws/zookeeper-client/zookeeper-client-c/tests> -I<https://builds.apache.org/job/PreCommit-ZOOKEEPER-github-pr-build-maven/ws/zookeeper-client/zookeeper-client-c/generated>   -DUSE_STATIC_LIB -DTHREADED -DZKSERVER_CMD="\"<https://builds.apache.org/job/PreCommit-ZOOKEEPER-github-pr-build-maven/ws/zookeeper-client/zookeeper-client-c/../../zookeeper-client/zookeeper-client-c/tests/zkServer.sh\""> -DZOO_IPV6_ENABLED -g -O2 -MT zktest_mt-TestOperations.o -MD -MP -MF .deps/zktest_mt-TestOperations.Tpo -c -o zktest_mt-TestOperations.o `test -f 'tests/TestOperations.cc' || echo '<https://builds.apache.org/job/PreCommit-ZOOKEEPER-github-pr-build-maven/ws/zookeeper-client/zookeeper-client-c/'`tests/TestOperations.cc>
     [exec] mv -f .deps/zktest_mt-TestOperations.Tpo .deps/zktest_mt-TestOperations.Po
     [exec] g++ -DHAVE_CONFIG_H -I. -I<https://builds.apache.org/job/PreCommit-ZOOKEEPER-github-pr-build-maven/ws/zookeeper-client/zookeeper-client-c>  -I<https://builds.apache.org/job/PreCommit-ZOOKEEPER-github-pr-build-maven/ws/zookeeper-client/zookeeper-client-c/include> -I<https://builds.apache.org/job/PreCommit-ZOOKEEPER-github-pr-build-maven/ws/zookeeper-client/zookeeper-client-c/tests> -I<https://builds.apache.org/job/PreCommit-ZOOKEEPER-github-pr-build-maven/ws/zookeeper-client/zookeeper-client-c/generated>   -DUSE_STATIC_LIB -DTHREADED -DZKSERVER_CMD="\"<https://builds.apache.org/job/PreCommit-ZOOKEEPER-github-pr-build-maven/ws/zookeeper-client/zookeeper-client-c/../../zookeeper-client/zookeeper-client-c/tests/zkServer.sh\""> -DZOO_IPV6_ENABLED -g -O2 -MT zktest_mt-TestMulti.o -MD -MP -MF .deps/zktest_mt-TestMulti.Tpo -c -o zktest_mt-TestMulti.o `test -f 'tests/TestMulti.cc' || echo '<https://builds.apache.org/job/PreCommit-ZOOKEEPER-github-pr-build-maven/ws/zookeeper-client/zookeeper-client-c/'`tests/TestMulti.cc>
     [exec] mv -f .deps/zktest_mt-TestMulti.Tpo .deps/zktest_mt-TestMulti.Po
     [exec] g++ -DHAVE_CONFIG_H -I. -I<https://builds.apache.org/job/PreCommit-ZOOKEEPER-github-pr-build-maven/ws/zookeeper-client/zookeeper-client-c>  -I<https://builds.apache.org/job/PreCommit-ZOOKEEPER-github-pr-build-maven/ws/zookeeper-client/zookeeper-client-c/include> -I<https://builds.apache.org/job/PreCommit-ZOOKEEPER-github-pr-build-maven/ws/zookeeper-client/zookeeper-client-c/tests> -I<https://builds.apache.org/job/PreCommit-ZOOKEEPER-github-pr-build-maven/ws/zookeeper-client/zookeeper-client-c/generated>   -DUSE_STATIC_LIB -DTHREADED -DZKSERVER_CMD="\"<https://builds.apache.org/job/PreCommit-ZOOKEEPER-github-pr-build-maven/ws/zookeeper-client/zookeeper-client-c/../../zookeeper-client/zookeeper-client-c/tests/zkServer.sh\""> -DZOO_IPV6_ENABLED -g -O2 -MT zktest_mt-TestWatchers.o -MD -MP -MF .deps/zktest_mt-TestWatchers.Tpo -c -o zktest_mt-TestWatchers.o `test -f 'tests/TestWatchers.cc' || echo '<https://builds.apache.org/job/PreCommit-ZOOKEEPER-github-pr-build-maven/ws/zookeeper-client/zookeeper-client-c/'`tests/TestWatchers.cc>
     [exec] mv -f .deps/zktest_mt-TestWatchers.Tpo .deps/zktest_mt-TestWatchers.Po
     [exec] g++ -DHAVE_CONFIG_H -I. -I<https://builds.apache.org/job/PreCommit-ZOOKEEPER-github-pr-build-maven/ws/zookeeper-client/zookeeper-client-c>  -I<https://builds.apache.org/job/PreCommit-ZOOKEEPER-github-pr-build-maven/ws/zookeeper-client/zookeeper-client-c/include> -I<https://builds.apache.org/job/PreCommit-ZOOKEEPER-github-pr-build-maven/ws/zookeeper-client/zookeeper-client-c/tests> -I<https://builds.apache.org/job/PreCommit-ZOOKEEPER-github-pr-build-maven/ws/zookeeper-client/zookeeper-client-c/generated>   -DUSE_STATIC_LIB -DTHREADED -DZKSERVER_CMD="\"<https://builds.apache.org/job/PreCommit-ZOOKEEPER-github-pr-build-maven/ws/zookeeper-client/zookeeper-client-c/../../zookeeper-client/zookeeper-client-c/tests/zkServer.sh\""> -DZOO_IPV6_ENABLED -g -O2 -MT zktest_mt-TestClient.o -MD -MP -MF .deps/zktest_mt-TestClient.Tpo -c -o zktest_mt-TestClient.o `test -f 'tests/TestClient.cc' || echo '<https://builds.apache.org/job/PreCommit-ZOOKEEPER-github-pr-build-maven/ws/zookeeper-client/zookeeper-client-c/'`tests/TestClient.cc>
     [exec] <https://builds.apache.org/job/PreCommit-ZOOKEEPER-github-pr-build-maven/ws/zookeeper-client/zookeeper-client-c/tests/TestClient.cc>: In member function 'void Zookeeper_simpleSystem::testRemoveWatchers()':
     [exec] <https://builds.apache.org/job/PreCommit-ZOOKEEPER-github-pr-build-maven/ws/zookeeper-client/zookeeper-client-c/tests/TestClient.cc>:1373:20: warning: deprecated conversion from string constant to 'char*' [-Wwrite-strings]
     [exec]        char *path = "/something";
     [exec]                     ^
     [exec] mv -f .deps/zktest_mt-TestClient.Tpo .deps/zktest_mt-TestClient.Po
     [exec] g++ -DHAVE_CONFIG_H -I. -I<https://builds.apache.org/job/PreCommit-ZOOKEEPER-github-pr-build-maven/ws/zookeeper-client/zookeeper-client-c>  -I<https://builds.apache.org/job/PreCommit-ZOOKEEPER-github-pr-build-maven/ws/zookeeper-client/zookeeper-client-c/include> -I<https://builds.apache.org/job/PreCommit-ZOOKEEPER-github-pr-build-maven/ws/zookeeper-client/zookeeper-client-c/tests> -I<https://builds.apache.org/job/PreCommit-ZOOKEEPER-github-pr-build-maven/ws/zookeeper-client/zookeeper-client-c/generated>   -DUSE_STATIC_LIB -DTHREADED -DZKSERVER_CMD="\"<https://builds.apache.org/job/PreCommit-ZOOKEEPER-github-pr-build-maven/ws/zookeeper-client/zookeeper-client-c/../../zookeeper-client/zookeeper-client-c/tests/zkServer.sh\""> -DZOO_IPV6_ENABLED -g -O2 -MT zktest_mt-ZooKeeperQuorumServer.o -MD -MP -MF .deps/zktest_mt-ZooKeeperQuorumServer.Tpo -c -o zktest_mt-ZooKeeperQuorumServer.o `test -f 'tests/ZooKeeperQuorumServer.cc' || echo '<https://builds.apache.org/job/PreCommit-ZOOKEEPER-github-pr-build-maven/ws/zookeeper-client/zookeeper-client-c/'`tests/ZooKeeperQuorumServer.cc>
     [exec] mv -f .deps/zktest_mt-ZooKeeperQuorumServer.Tpo .deps/zktest_mt-ZooKeeperQuorumServer.Po
     [exec] g++ -DHAVE_CONFIG_H -I. -I<https://builds.apache.org/job/PreCommit-ZOOKEEPER-github-pr-build-maven/ws/zookeeper-client/zookeeper-client-c>  -I<https://builds.apache.org/job/PreCommit-ZOOKEEPER-github-pr-build-maven/ws/zookeeper-client/zookeeper-client-c/include> -I<https://builds.apache.org/job/PreCommit-ZOOKEEPER-github-pr-build-maven/ws/zookeeper-client/zookeeper-client-c/tests> -I<https://builds.apache.org/job/PreCommit-ZOOKEEPER-github-pr-build-maven/ws/zookeeper-client/zookeeper-client-c/generated>   -DUSE_STATIC_LIB -DTHREADED -DZKSERVER_CMD="\"<https://builds.apache.org/job/PreCommit-ZOOKEEPER-github-pr-build-maven/ws/zookeeper-client/zookeeper-client-c/../../zookeeper-client/zookeeper-client-c/tests/zkServer.sh\""> -DZOO_IPV6_ENABLED -g -O2 -MT zktest_mt-TestReadOnlyClient.o -MD -MP -MF .deps/zktest_mt-TestReadOnlyClient.Tpo -c -o zktest_mt-TestReadOnlyClient.o `test -f 'tests/TestReadOnlyClient.cc' || echo '<https://builds.apache.org/job/PreCommit-ZOOKEEPER-github-pr-build-maven/ws/zookeeper-client/zookeeper-client-c/'`tests/TestReadOnlyClient.cc>
     [exec] mv -f .deps/zktest_mt-TestReadOnlyClient.Tpo .deps/zktest_mt-TestReadOnlyClient.Po
     [exec] g++ -DHAVE_CONFIG_H -I. -I<https://builds.apache.org/job/PreCommit-ZOOKEEPER-github-pr-build-maven/ws/zookeeper-client/zookeeper-client-c>  -I<https://builds.apache.org/job/PreCommit-ZOOKEEPER-github-pr-build-maven/ws/zookeeper-client/zookeeper-client-c/include> -I<https://builds.apache.org/job/PreCommit-ZOOKEEPER-github-pr-build-maven/ws/zookeeper-client/zookeeper-client-c/tests> -I<https://builds.apache.org/job/PreCommit-ZOOKEEPER-github-pr-build-maven/ws/zookeeper-client/zookeeper-client-c/generated>   -DUSE_STATIC_LIB -DTHREADED -DZKSERVER_CMD="\"<https://builds.apache.org/job/PreCommit-ZOOKEEPER-github-pr-build-maven/ws/zookeeper-client/zookeeper-client-c/../../zookeeper-client/zookeeper-client-c/tests/zkServer.sh\""> -DZOO_IPV6_ENABLED -g -O2 -MT zktest_mt-TestLogClientEnv.o -MD -MP -MF .deps/zktest_mt-TestLogClientEnv.Tpo -c -o zktest_mt-TestLogClientEnv.o `test -f 'tests/TestLogClientEnv.cc' || echo '<https://builds.apache.org/job/PreCommit-ZOOKEEPER-github-pr-build-maven/ws/zookeeper-client/zookeeper-client-c/'`tests/TestLogClientEnv.cc>
     [exec] mv -f .deps/zktest_mt-TestLogClientEnv.Tpo .deps/zktest_mt-TestLogClientEnv.Po
     [exec] g++ -DHAVE_CONFIG_H -I. -I<https://builds.apache.org/job/PreCommit-ZOOKEEPER-github-pr-build-maven/ws/zookeeper-client/zookeeper-client-c>  -I<https://builds.apache.org/job/PreCommit-ZOOKEEPER-github-pr-build-maven/ws/zookeeper-client/zookeeper-client-c/include> -I<https://builds.apache.org/job/PreCommit-ZOOKEEPER-github-pr-build-maven/ws/zookeeper-client/zookeeper-client-c/tests> -I<https://builds.apache.org/job/PreCommit-ZOOKEEPER-github-pr-build-maven/ws/zookeeper-client/zookeeper-client-c/generated>   -DUSE_STATIC_LIB -DTHREADED -DZKSERVER_CMD="\"<https://builds.apache.org/job/PreCommit-ZOOKEEPER-github-pr-build-maven/ws/zookeeper-client/zookeeper-client-c/../../zookeeper-client/zookeeper-client-c/tests/zkServer.sh\""> -DZOO_IPV6_ENABLED -g -O2 -MT zktest_mt-TestServerRequireClientSASLAuth.o -MD -MP -MF .deps/zktest_mt-TestServerRequireClientSASLAuth.Tpo -c -o zktest_mt-TestServerRequireClientSASLAuth.o `test -f 'tests/TestServerRequireClientSASLAuth.cc' || echo '<https://builds.apache.org/job/PreCommit-ZOOKEEPER-github-pr-build-maven/ws/zookeeper-client/zookeeper-client-c/'`tests/TestServerRequireClientSASLAuth.cc>
     [exec] mv -f .deps/zktest_mt-TestServerRequireClientSASLAuth.Tpo .deps/zktest_mt-TestServerRequireClientSASLAuth.Po
     [exec] g++ -DHAVE_CONFIG_H -I. -I<https://builds.apache.org/job/PreCommit-ZOOKEEPER-github-pr-build-maven/ws/zookeeper-client/zookeeper-client-c>  -I<https://builds.apache.org/job/PreCommit-ZOOKEEPER-github-pr-build-maven/ws/zookeeper-client/zookeeper-client-c/include> -I<https://builds.apache.org/job/PreCommit-ZOOKEEPER-github-pr-build-maven/ws/zookeeper-client/zookeeper-client-c/tests> -I<https://builds.apache.org/job/PreCommit-ZOOKEEPER-github-pr-build-maven/ws/zookeeper-client/zookeeper-client-c/generated>   -DUSE_STATIC_LIB -DTHREADED -DZKSERVER_CMD="\"<https://builds.apache.org/job/PreCommit-ZOOKEEPER-github-pr-build-maven/ws/zookeeper-client/zookeeper-client-c/../../zookeeper-client/zookeeper-client-c/tests/zkServer.sh\""> -DZOO_IPV6_ENABLED -g -O2 -MT zktest_mt-PthreadMocks.o -MD -MP -MF .deps/zktest_mt-PthreadMocks.Tpo -c -o zktest_mt-PthreadMocks.o `test -f 'tests/PthreadMocks.cc' || echo '<https://builds.apache.org/job/PreCommit-ZOOKEEPER-github-pr-build-maven/ws/zookeeper-client/zookeeper-client-c/'`tests/PthreadMocks.cc>
     [exec] mv -f .deps/zktest_mt-PthreadMocks.Tpo .deps/zktest_mt-PthreadMocks.Po
     [exec] /bin/bash ./libtool  --tag=CXX   --mode=link g++ -DUSE_STATIC_LIB -DTHREADED -DZKSERVER_CMD="\"<https://builds.apache.org/job/PreCommit-ZOOKEEPER-github-pr-build-maven/ws/zookeeper-client/zookeeper-client-c/../../zookeeper-client/zookeeper-client-c/tests/zkServer.sh\""> -DZOO_IPV6_ENABLED -g -O2 -shared -Wl,--wrap -Wl,calloc -Wl,--wrap -Wl,free -Wl,--wrap -Wl,flush_send_queue -Wl,--wrap -Wl,get_xid -Wl,--wrap -Wl,deliverWatchers -Wl,--wrap -Wl,activateWatcher -Wl,--wrap -Wl,realloc -Wl,--wrap -Wl,pthread_mutex_lock -Wl,--wrap -Wl,pthread_mutex_trylock -Wl,--wrap -Wl,pthread_mutex_unlock   -o zktest-mt zktest_mt-TestDriver.o zktest_mt-LibCMocks.o zktest_mt-LibCSymTable.o zktest_mt-MocksBase.o zktest_mt-ZKMocks.o zktest_mt-Util.o zktest_mt-ThreadingUtil.o zktest_mt-TestZookeeperInit.o zktest_mt-TestZookeeperClose.o zktest_mt-TestReconfig.o zktest_mt-TestReconfigServer.o zktest_mt-TestClientRetry.o zktest_mt-TestOperations.o zktest_mt-TestMulti.o zktest_mt-TestWatchers.o zktest_mt-TestClient.o zktest_mt-ZooKeeperQuorumServer.o zktest_mt-TestReadOnlyClient.o zktest_mt-TestLogClientEnv.o zktest_mt-TestServerRequireClientSASLAuth.o zktest_mt-PthreadMocks.o libzkmt.la libhashtable.la -lpthread -L/usr/lib/x86_64-linux-gnu -lcppunit -ldl -ldl 
     [exec] libtool: link: g++ -DUSE_STATIC_LIB -DTHREADED -DZKSERVER_CMD=\"<https://builds.apache.org/job/PreCommit-ZOOKEEPER-github-pr-build-maven/ws/zookeeper-client/zookeeper-client-c/../../zookeeper-client/zookeeper-client-c/tests/zkServer.sh\"> -DZOO_IPV6_ENABLED -g -O2 -Wl,--wrap -Wl,calloc -Wl,--wrap -Wl,free -Wl,--wrap -Wl,flush_send_queue -Wl,--wrap -Wl,get_xid -Wl,--wrap -Wl,deliverWatchers -Wl,--wrap -Wl,activateWatcher -Wl,--wrap -Wl,realloc -Wl,--wrap -Wl,pthread_mutex_lock -Wl,--wrap -Wl,pthread_mutex_trylock -Wl,--wrap -Wl,pthread_mutex_unlock -o zktest-mt zktest_mt-TestDriver.o zktest_mt-LibCMocks.o zktest_mt-LibCSymTable.o zktest_mt-MocksBase.o zktest_mt-ZKMocks.o zktest_mt-Util.o zktest_mt-ThreadingUtil.o zktest_mt-TestZookeeperInit.o zktest_mt-TestZookeeperClose.o zktest_mt-TestReconfig.o zktest_mt-TestReconfigServer.o zktest_mt-TestClientRetry.o zktest_mt-TestOperations.o zktest_mt-TestMulti.o zktest_mt-TestWatchers.o zktest_mt-TestClient.o zktest_mt-ZooKeeperQuorumServer.o zktest_mt-TestReadOnlyClient.o zktest_mt-TestLogClientEnv.o zktest_mt-TestServerRequireClientSASLAuth.o zktest_mt-PthreadMocks.o  ./.libs/libzkmt.a -lm -lrt ./.libs/libhashtable.a -lgcov -lpthread -L/usr/lib/x86_64-linux-gnu -lcppunit -ldl
     [exec] make[1]: Leaving directory '<https://builds.apache.org/job/PreCommit-ZOOKEEPER-github-pr-build-maven/ws/zookeeper-client/zookeeper-client-c/target/c'>
     [exec] make  check-TESTS
     [exec] make[1]: Entering directory '<https://builds.apache.org/job/PreCommit-ZOOKEEPER-github-pr-build-maven/ws/zookeeper-client/zookeeper-client-c/target/c'>
     [exec]  ZooKeeper server process failed ZooKeeper server NOT started
     [exec] Running 
     [exec] Zookeeper_init::testBasic : elapsed 0 : OK
     [exec] Zookeeper_init::testAddressResolution : elapsed 0 : OK
     [exec] Zookeeper_init::testMultipleAddressResolution : elapsed 0 : OK
     [exec] Zookeeper_init::testNullAddressString : elapsed 0 : OK
     [exec] Zookeeper_init::testEmptyAddressString : elapsed 0 : OK
     [exec] Zookeeper_init::testOneSpaceAddressString : elapsed 0 : OK
     [exec] Zookeeper_init::testTwoSpacesAddressString : elapsed 0 : OK
     [exec] Zookeeper_init::testInvalidAddressString1 : elapsed 0 : OK
     [exec] Zookeeper_init::testInvalidAddressString2 : elapsed 40 : OK
     [exec] Zookeeper_init::testNonexistentHost : elapsed 12 : OK
     [exec] Zookeeper_init::testOutOfMemory_init : elapsed 0 : OK
     [exec] Zookeeper_init::testOutOfMemory_getaddrs1 : elapsed 0 : OK
     [exec] Zookeeper_init::testOutOfMemory_getaddrs2 : elapsed 0 : OK
     [exec] Zookeeper_init::testPermuteAddrsList : elapsed 0 : OK
     [exec] Zookeeper_close::testCloseUnconnected : elapsed 0 : OK
     [exec] Zookeeper_close::testCloseUnconnected1 : elapsed 0 : OK
     [exec] Zookeeper_close::testCloseConnected1 : elapsed 0 : OK
     [exec] Zookeeper_close::testCloseFromWatcher1 : elapsed 0 : OK
     [exec] Zookeeper_reconfig::testcycleNextServer : elapsed 0 : OK
     [exec] Zookeeper_reconfig::testMigrateOrNot : elapsed 0 : OK
     [exec] Zookeeper_reconfig::testMigrationCycle : elapsed 0 : OK
     [exec] Zookeeper_reconfig::testMigrateProbability : elapsed 4642 : OK
     [exec] Zookeeper_reconfig::testLoadBalancing : elapsed 8806 : OK
     [exec] Zookeeper_operations::testPing : elapsed 5 : OK
     [exec] Zookeeper_operations::testUnsolicitedPing : elapsed 0 : OK
     [exec] Zookeeper_operations::testTimeoutCausedByWatches1 : elapsed 0 : OK
     [exec] Zookeeper_operations::testTimeoutCausedByWatches2 : elapsed 0 : OK
     [exec] Zookeeper_operations::testCloseWhileInProgressFromMain : elapsed 0 : OK
     [exec] Zookeeper_operations::testCloseWhileInProgressFromCompletion : elapsed 100 : OK
     [exec] Zookeeper_operations::testCloseWhileMultiInProgressFromMain : elapsed 0 : OK
     [exec] Zookeeper_operations::testCloseWhileMultiInProgressFromCompletion : elapsed 100 : OK
     [exec] Zookeeper_operations::testOperationsAndDisconnectConcurrently1 : elapsed 0 : OK
     [exec] Zookeeper_operations::testOperationsAndDisconnectConcurrently2 : elapsed 0 : OK
     [exec] Zookeeper_operations::testConcurrentOperations1 : elapsed 200 : OK
     [exec] Zookeeper_watchers::testDefaultSessionWatcher1 : elapsed 0 : OK
     [exec] Zookeeper_watchers::testDefaultSessionWatcher2 : elapsed 0 : OK
     [exec] Zookeeper_watchers::testObjectSessionWatcher1 : elapsed 0 : OK
     [exec] Zookeeper_watchers::testObjectSessionWatcher2 : elapsed 200 : OK
     [exec] Zookeeper_watchers::testNodeWatcher1 : elapsed 400 : OK
     [exec] Zookeeper_watchers::testChildWatcher1 : elapsed 300 : OK
     [exec] Zookeeper_watchers::testChildWatcher2 : elapsed 300 : OK
     [exec] Zookeeper_logClientEnv::testLogClientEnv : elapsed 0 : OK
     [exec] OK (42)
     [exec] <https://builds.apache.org/job/PreCommit-ZOOKEEPER-github-pr-build-maven/ws/zookeeper-client/zookeeper-client-c/../../zookeeper-client/zookeeper-client-c/tests/zkServer.sh>: line 62: kill: (24399) - No such process
     [exec] PASS: zktest-st
     [exec]  ZooKeeper server process failed ZooKeeper server NOT started
     [exec] Running 
     [exec] Zookeeper_init::testBasic : elapsed 0 : OK
     [exec] Zookeeper_init::testAddressResolution : elapsed 0 : OK
     [exec] Zookeeper_init::testMultipleAddressResolution : elapsed 0 : OK
     [exec] Zookeeper_init::testNullAddressString : elapsed 0 : OK
     [exec] Zookeeper_init::testEmptyAddressString : elapsed 0 : OK
     [exec] Zookeeper_init::testOneSpaceAddressString : elapsed 0 : OK
     [exec] Zookeeper_init::testTwoSpacesAddressString : elapsed 0 : OK
     [exec] Zookeeper_init::testInvalidAddressString1 : elapsed 0 : OK
     [exec] Zookeeper_init::testInvalidAddressString2 : elapsed 34 : OK
     [exec] Zookeeper_init::testNonexistentHost : elapsed 12 : OK
     [exec] Zookeeper_init::testOutOfMemory_init : elapsed 0 : OK
     [exec] Zookeeper_init::testOutOfMemory_getaddrs1 : elapsed 0 : OK
     [exec] Zookeeper_init::testOutOfMemory_getaddrs2 : elapsed 0 : OK
     [exec] Zookeeper_init::testPermuteAddrsList : elapsed 0 : OK
     [exec] Zookeeper_close::testIOThreadStoppedOnExpire : elapsed 239 : OK
     [exec] Zookeeper_close::testCloseUnconnected : elapsed 0 : OK
     [exec] Zookeeper_close::testCloseUnconnected1 : elapsed 40 : OK
     [exec] Zookeeper_close::testCloseConnected1 : elapsed 237 : OK
     [exec] ZooKeeper JMX enabled by default
     [exec] Using config: <https://builds.apache.org/job/PreCommit-ZOOKEEPER-github-pr-build-maven/ws/zookeeper-client/zookeeper-client-c/../../build/test/test-cppunit/conf/0.conf>
     [exec] Zookeeper_close::testCloseFromWatcher1 : elapsed 235 : OK
     [exec] Zookeeper_reconfig::testcycleNextServer : elapsed 0 : OK
     [exec] Zookeeper_reconfig::testMigrateOrNot : elapsed 0 : OK
     [exec] Zookeeper_reconfig::testMigrationCycle : elapsed 0 : OK
     [exec] TestReconfigServer::testNonIncrementalStarting zookeeper ... FAILED TO START
     [exec] FAIL: zktest-mt
     [exec] ==========================================
     [exec] 1 of 2 tests failed
     [exec] Please report to user@zookeeper.apache.org
     [exec] ==========================================
     [exec] Makefile:1815: recipe for target 'check-TESTS' failed
     [exec] make[1]: Leaving directory '<https://builds.apache.org/job/PreCommit-ZOOKEEPER-github-pr-build-maven/ws/zookeeper-client/zookeeper-client-c/target/c'>
     [exec] Makefile:2071: recipe for target 'check-am' failed
     [exec] zktest-mt: <https://builds.apache.org/job/PreCommit-ZOOKEEPER-github-pr-build-maven/ws/zookeeper-client/zookeeper-client-c/tests/ZooKeeperQuorumServer.cc>:67: void ZooKeeperQuorumServer::start(): Assertion `system(command.c_str()) == 0' failed.
     [exec] /bin/bash: line 5: 24675 Aborted                 ZKROOT=<https://builds.apache.org/job/PreCommit-ZOOKEEPER-github-pr-build-maven/ws/zookeeper-client/zookeeper-client-c/../..> CLASSPATH=$CLASSPATH:$CLOVER_HOME/lib/clover*.jar ${dir}$tst
     [exec] make[1]: *** [check-TESTS] Error 1
     [exec] make: *** [check-am] Error 2
[INFO] ------------------------------------------------------------------------
[INFO] Reactor Summary for Apache ZooKeeper 3.6.0-SNAPSHOT:
[INFO] 
[INFO] Apache ZooKeeper ................................... SUCCESS [ 23.223 s]
[INFO] Apache ZooKeeper - Documentation ................... SUCCESS [  9.321 s]
[INFO] Apache ZooKeeper - Jute ............................ SUCCESS [01:51 min]
[INFO] Apache ZooKeeper - Server .......................... SUCCESS [29:54 min]
[INFO] Apache ZooKeeper - Metrics Providers ............... SUCCESS [  3.413 s]
[INFO] Apache ZooKeeper - Prometheus.io Metrics Provider .. SUCCESS [ 13.945 s]
[INFO] Apache ZooKeeper - Client .......................... SUCCESS [  3.223 s]
[INFO] Apache ZooKeeper - Client - C ...................... FAILURE [01:49 min]
[INFO] Apache ZooKeeper - Recipes ......................... SKIPPED
[INFO] Apache ZooKeeper - Recipes - Election .............. SKIPPED
[INFO] Apache ZooKeeper - Recipes - Lock .................. SKIPPED
[INFO] Apache ZooKeeper - Recipes - Queue ................. SKIPPED
[INFO] Apache ZooKeeper - Assembly ........................ SKIPPED
[INFO] Apache ZooKeeper - Contrib ......................... SKIPPED
[INFO] Apache ZooKeeper - Contrib - Loggraph .............. SKIPPED
[INFO] Apache ZooKeeper - Contrib - Rest .................. SKIPPED
[INFO] Apache ZooKeeper - Contrib - ZooInspector .......... SKIPPED
[INFO] ------------------------------------------------------------------------
[INFO] BUILD FAILURE
[INFO] ------------------------------------------------------------------------
[INFO] Total time:  35:19 min
[INFO] Finished at: 2019-08-16T02:06:54Z
[INFO] ------------------------------------------------------------------------
Waiting for Jenkins to finish collecting data
[ERROR] Failed to execute goal org.apache.maven.plugins:maven-antrun-plugin:1.8:run (test-cppunit) on project zookeeper-client-c: An Ant BuildException has occured: exec returned: 2
[ERROR] around Ant part ...<exec failonerror="true" dir="<https://builds.apache.org/job/PreCommit-ZOOKEEPER-github-pr-build-maven/ws/zookeeper-client/zookeeper-client-c/target/c"> executable="make">... @ 4:177 in <https://builds.apache.org/job/PreCommit-ZOOKEEPER-github-pr-build-maven/ws/zookeeper-client/zookeeper-client-c/target/antrun/build-main.xml>
[ERROR] -> [Help 1]
[ERROR] 
[ERROR] To see the full stack trace of the errors, re-run Maven with the -e switch.
[ERROR] Re-run Maven using the -X switch to enable full debug logging.
[ERROR] 
[ERROR] For more information about the errors and possible solutions, please read the following articles:
[ERROR] [Help 1] http://cwiki.apache.org/confluence/display/MAVEN/MojoExecutionException
[ERROR] 
[ERROR] After correcting the problems, you can resume the build with the command
[ERROR]   mvn <goals> -rf :zookeeper-client-c
[JENKINS] Archiving <https://builds.apache.org/job/PreCommit-ZOOKEEPER-github-pr-build-maven/ws/zookeeper-server/pom.xml> to org.apache.zookeeper/zookeeper/3.6.0-SNAPSHOT/zookeeper-3.6.0-SNAPSHOT.pom
[JENKINS] Archiving <https://builds.apache.org/job/PreCommit-ZOOKEEPER-github-pr-build-maven/ws/zookeeper-server/target/zookeeper-3.6.0-SNAPSHOT.jar> to org.apache.zookeeper/zookeeper/3.6.0-SNAPSHOT/zookeeper-3.6.0-SNAPSHOT.jar
[JENKINS] Archiving <https://builds.apache.org/job/PreCommit-ZOOKEEPER-github-pr-build-maven/ws/zookeeper-server/target/zookeeper-3.6.0-SNAPSHOT-tests.jar> to org.apache.zookeeper/zookeeper/3.6.0-SNAPSHOT/zookeeper-3.6.0-SNAPSHOT-tests.jar
[JENKINS] Archiving <https://builds.apache.org/job/PreCommit-ZOOKEEPER-github-pr-build-maven/ws/zookeeper-server/target/zookeeper-3.6.0-SNAPSHOT-sources.jar> to org.apache.zookeeper/zookeeper/3.6.0-SNAPSHOT/zookeeper-3.6.0-SNAPSHOT-sources.jar
[JENKINS] Archiving <https://builds.apache.org/job/PreCommit-ZOOKEEPER-github-pr-build-maven/ws/zookeeper-server/target/zookeeper-3.6.0-SNAPSHOT-javadoc.jar> to org.apache.zookeeper/zookeeper/3.6.0-SNAPSHOT/zookeeper-3.6.0-SNAPSHOT-javadoc.jar
[JENKINS] Archiving <https://builds.apache.org/job/PreCommit-ZOOKEEPER-github-pr-build-maven/ws/zookeeper-contrib/zookeeper-contrib-loggraph/pom.xml> to org.apache.zookeeper/zookeeper-contrib-loggraph/3.6.0-SNAPSHOT/zookeeper-contrib-loggraph-3.6.0-SNAPSHOT.pom
[JENKINS] Archiving <https://builds.apache.org/job/PreCommit-ZOOKEEPER-github-pr-build-maven/ws/zookeeper-metrics-providers/pom.xml> to org.apache.zookeeper/zookeeper-metrics-providers/3.6.0-SNAPSHOT/zookeeper-metrics-providers-3.6.0-SNAPSHOT.pom
[JENKINS] Archiving <https://builds.apache.org/job/PreCommit-ZOOKEEPER-github-pr-build-maven/ws/zookeeper-metrics-providers/zookeeper-prometheus-metrics/pom.xml> to org.apache.zookeeper/zookeeper-prometheus-metrics/3.6.0-SNAPSHOT/zookeeper-prometheus-metrics-3.6.0-SNAPSHOT.pom
[JENKINS] Archiving <https://builds.apache.org/job/PreCommit-ZOOKEEPER-github-pr-build-maven/ws/zookeeper-metrics-providers/zookeeper-prometheus-metrics/target/zookeeper-prometheus-metrics-3.6.0-SNAPSHOT.jar> to org.apache.zookeeper/zookeeper-prometheus-metrics/3.6.0-SNAPSHOT/zookeeper-prometheus-metrics-3.6.0-SNAPSHOT.jar
[JENKINS] Archiving <https://builds.apache.org/job/PreCommit-ZOOKEEPER-github-pr-build-maven/ws/zookeeper-metrics-providers/zookeeper-prometheus-metrics/target/zookeeper-prometheus-metrics-3.6.0-SNAPSHOT-tests.jar> to org.apache.zookeeper/zookeeper-prometheus-metrics/3.6.0-SNAPSHOT/zookeeper-prometheus-metrics-3.6.0-SNAPSHOT-tests.jar
[JENKINS] Archiving <https://builds.apache.org/job/PreCommit-ZOOKEEPER-github-pr-build-maven/ws/zookeeper-metrics-providers/zookeeper-prometheus-metrics/target/zookeeper-prometheus-metrics-3.6.0-SNAPSHOT-sources.jar> to org.apache.zookeeper/zookeeper-prometheus-metrics/3.6.0-SNAPSHOT/zookeeper-prometheus-metrics-3.6.0-SNAPSHOT-sources.jar
[JENKINS] Archiving <https://builds.apache.org/job/PreCommit-ZOOKEEPER-github-pr-build-maven/ws/zookeeper-metrics-providers/zookeeper-prometheus-metrics/target/zookeeper-prometheus-metrics-3.6.0-SNAPSHOT-javadoc.jar> to org.apache.zookeeper/zookeeper-prometheus-metrics/3.6.0-SNAPSHOT/zookeeper-prometheus-metrics-3.6.0-SNAPSHOT-javadoc.jar
[JENKINS] Archiving <https://builds.apache.org/job/PreCommit-ZOOKEEPER-github-pr-build-maven/ws/zookeeper-recipes/zookeeper-recipes-election/pom.xml> to org.apache.zookeeper/zookeeper-recipes-election/3.6.0-SNAPSHOT/zookeeper-recipes-election-3.6.0-SNAPSHOT.pom
[JENKINS] Archiving <https://builds.apache.org/job/PreCommit-ZOOKEEPER-github-pr-build-maven/ws/pom.xml> to org.apache.zookeeper/parent/3.6.0-SNAPSHOT/parent-3.6.0-SNAPSHOT.pom
[JENKINS] Archiving <https://builds.apache.org/job/PreCommit-ZOOKEEPER-github-pr-build-maven/ws/zookeeper-recipes/zookeeper-recipes-lock/pom.xml> to org.apache.zookeeper/zookeeper-recipes-lock/3.6.0-SNAPSHOT/zookeeper-recipes-lock-3.6.0-SNAPSHOT.pom
[JENKINS] Archiving <https://builds.apache.org/job/PreCommit-ZOOKEEPER-github-pr-build-maven/ws/zookeeper-contrib/pom.xml> to org.apache.zookeeper/zookeeper-contrib/3.6.0-SNAPSHOT/zookeeper-contrib-3.6.0-SNAPSHOT.pom
[JENKINS] Archiving <https://builds.apache.org/job/PreCommit-ZOOKEEPER-github-pr-build-maven/ws/zookeeper-client/pom.xml> to org.apache.zookeeper/zookeeper-client/3.6.0-SNAPSHOT/zookeeper-client-3.6.0-SNAPSHOT.pom
[JENKINS] Archiving <https://builds.apache.org/job/PreCommit-ZOOKEEPER-github-pr-build-maven/ws/zookeeper-jute/pom.xml> to org.apache.zookeeper/zookeeper-jute/3.6.0-SNAPSHOT/zookeeper-jute-3.6.0-SNAPSHOT.pom
[JENKINS] Archiving <https://builds.apache.org/job/PreCommit-ZOOKEEPER-github-pr-build-maven/ws/zookeeper-jute/target/zookeeper-jute-3.6.0-SNAPSHOT.jar> to org.apache.zookeeper/zookeeper-jute/3.6.0-SNAPSHOT/zookeeper-jute-3.6.0-SNAPSHOT.jar
[JENKINS] Archiving <https://builds.apache.org/job/PreCommit-ZOOKEEPER-github-pr-build-maven/ws/zookeeper-jute/target/zookeeper-jute-3.6.0-SNAPSHOT-tests.jar> to org.apache.zookeeper/zookeeper-jute/3.6.0-SNAPSHOT/zookeeper-jute-3.6.0-SNAPSHOT-tests.jar
[JENKINS] Archiving <https://builds.apache.org/job/PreCommit-ZOOKEEPER-github-pr-build-maven/ws/zookeeper-jute/target/zookeeper-jute-3.6.0-SNAPSHOT-sources.jar> to org.apache.zookeeper/zookeeper-jute/3.6.0-SNAPSHOT/zookeeper-jute-3.6.0-SNAPSHOT-sources.jar
[JENKINS] Archiving <https://builds.apache.org/job/PreCommit-ZOOKEEPER-github-pr-build-maven/ws/zookeeper-jute/target/zookeeper-jute-3.6.0-SNAPSHOT-javadoc.jar> to org.apache.zookeeper/zookeeper-jute/3.6.0-SNAPSHOT/zookeeper-jute-3.6.0-SNAPSHOT-javadoc.jar
[JENKINS] Archiving <https://builds.apache.org/job/PreCommit-ZOOKEEPER-github-pr-build-maven/ws/zookeeper-recipes/zookeeper-recipes-queue/pom.xml> to org.apache.zookeeper/zookeeper-recipes-queue/3.6.0-SNAPSHOT/zookeeper-recipes-queue-3.6.0-SNAPSHOT.pom
[JENKINS] Archiving <https://builds.apache.org/job/PreCommit-ZOOKEEPER-github-pr-build-maven/ws/zookeeper-docs/pom.xml> to org.apache.zookeeper/zookeeper-docs/3.6.0-SNAPSHOT/zookeeper-docs-3.6.0-SNAPSHOT.pom
[JENKINS] Archiving <https://builds.apache.org/job/PreCommit-ZOOKEEPER-github-pr-build-maven/ws/zookeeper-docs/target/zookeeper-docs-3.6.0-SNAPSHOT.jar> to org.apache.zookeeper/zookeeper-docs/3.6.0-SNAPSHOT/zookeeper-docs-3.6.0-SNAPSHOT.jar
[JENKINS] Archiving <https://builds.apache.org/job/PreCommit-ZOOKEEPER-github-pr-build-maven/ws/zookeeper-docs/target/zookeeper-docs-3.6.0-SNAPSHOT-tests.jar> to org.apache.zookeeper/zookeeper-docs/3.6.0-SNAPSHOT/zookeeper-docs-3.6.0-SNAPSHOT-tests.jar
[JENKINS] Archiving <https://builds.apache.org/job/PreCommit-ZOOKEEPER-github-pr-build-maven/ws/zookeeper-docs/target/zookeeper-docs-3.6.0-SNAPSHOT-sources.jar> to org.apache.zookeeper/zookeeper-docs/3.6.0-SNAPSHOT/zookeeper-docs-3.6.0-SNAPSHOT-sources.jar
[JENKINS] Archiving <https://builds.apache.org/job/PreCommit-ZOOKEEPER-github-pr-build-maven/ws/zookeeper-recipes/pom.xml> to org.apache.zookeeper/zookeeper-recipes/3.6.0-SNAPSHOT/zookeeper-recipes-3.6.0-SNAPSHOT.pom
[JENKINS] Archiving <https://builds.apache.org/job/PreCommit-ZOOKEEPER-github-pr-build-maven/ws/zookeeper-client/zookeeper-client-c/pom.xml> to org.apache.zookeeper/zookeeper-client-c/3.6.0-SNAPSHOT/zookeeper-client-c-3.6.0-SNAPSHOT.pom
[JENKINS] Archiving <https://builds.apache.org/job/PreCommit-ZOOKEEPER-github-pr-build-maven/ws/zookeeper-contrib/zookeeper-contrib-rest/pom.xml> to org.apache.zookeeper/zookeeper-contrib-rest/3.6.0-SNAPSHOT/zookeeper-contrib-rest-3.6.0-SNAPSHOT.pom
[JENKINS] Archiving <https://builds.apache.org/job/PreCommit-ZOOKEEPER-github-pr-build-maven/ws/zookeeper-assembly/pom.xml> to org.apache.zookeeper/zookeeper-assembly/3.6.0-SNAPSHOT/zookeeper-assembly-3.6.0-SNAPSHOT.pom
[JENKINS] Archiving <https://builds.apache.org/job/PreCommit-ZOOKEEPER-github-pr-build-maven/ws/zookeeper-contrib/zookeeper-contrib-zooinspector/pom.xml> to org.apache.zookeeper/zookeeper-contrib-zooinspector/3.6.0-SNAPSHOT/zookeeper-contrib-zooinspector-3.6.0-SNAPSHOT.pom
channel stopped
[SpotBugs] Skipping execution of recorder since overall result is 'FAILURE'
Setting status of 9812cdcf61d24a0741a10f7a4e67b453f300be69 to FAILURE with url https://builds.apache.org/job/PreCommit-ZOOKEEPER-github-pr-build-maven/1138/ and message: 'FAILURE
 '
Using context: JenkinsMaven

Mime
View raw message