zookeeper-dev mailing list archives

Site index · List index
Message view « Date » · « Thread »
Top « Date » · « Thread »
From Apache Jenkins Server <jenk...@builds.apache.org>
Subject Build failed in Jenkins: zookeeper-master-maven-jdk12 #92
Date Tue, 13 Aug 2019 16:57:18 GMT
See <https://builds.apache.org/job/zookeeper-master-maven-jdk12/92/display/redirect>

------------------------------------------
[...truncated 524.44 KB...]
     [exec] Using config: <https://builds.apache.org/job/zookeeper-master-maven-jdk12/ws/zookeeper-client/zookeeper-client-c/../../build/test/test-cppunit/conf/2.conf>
     [exec] ZooKeeper JMX enabled by default
     [exec] Using config: <https://builds.apache.org/job/zookeeper-master-maven-jdk12/ws/zookeeper-client/zookeeper-client-c/../../build/test/test-cppunit/conf/0.conf>
     [exec] Starting zookeeper ... STARTED
     [exec] ZooKeeper JMX enabled by default
     [exec] Using config: <https://builds.apache.org/job/zookeeper-master-maven-jdk12/ws/zookeeper-client/zookeeper-client-c/../../build/test/test-cppunit/conf/0.conf>
     [exec] ZooKeeper JMX enabled by default
     [exec] Using config: <https://builds.apache.org/job/zookeeper-master-maven-jdk12/ws/zookeeper-client/zookeeper-client-c/../../build/test/test-cppunit/conf/1.conf>
     [exec] ZooKeeper JMX enabled by default
     [exec] Using config: <https://builds.apache.org/job/zookeeper-master-maven-jdk12/ws/zookeeper-client/zookeeper-client-c/../../build/test/test-cppunit/conf/2.conf>
     [exec] ZooKeeper JMX enabled by default
     [exec] Using config: <https://builds.apache.org/job/zookeeper-master-maven-jdk12/ws/zookeeper-client/zookeeper-client-c/../../build/test/test-cppunit/conf/0.conf>
     [exec] Stopping zookeeper ... STOPPED
     [exec] Stopping zookeeper ... STOPPED
     [exec] ZooKeeper JMX enabled by default
     [exec] Using config: <https://builds.apache.org/job/zookeeper-master-maven-jdk12/ws/zookeeper-client/zookeeper-client-c/../../build/test/test-cppunit/conf/1.conf>
     [exec] ZooKeeper JMX enabled by default
     [exec] Using config: <https://builds.apache.org/job/zookeeper-master-maven-jdk12/ws/zookeeper-client/zookeeper-client-c/../../build/test/test-cppunit/conf/2.conf>
     [exec] Stopping zookeeper ... STOPPED
     [exec] ZooKeeper JMX enabled by default
     [exec] Using config: <https://builds.apache.org/job/zookeeper-master-maven-jdk12/ws/zookeeper-client/zookeeper-client-c/../../build/test/test-cppunit/conf/0.conf>
     [exec] Starting zookeeper ... STARTED
     [exec] ZooKeeper JMX enabled by default
     [exec] Using config: <https://builds.apache.org/job/zookeeper-master-maven-jdk12/ws/zookeeper-client/zookeeper-client-c/../../build/test/test-cppunit/conf/1.conf>
     [exec] Starting zookeeper ... STARTED
     [exec] ZooKeeper JMX enabled by default
     [exec] Using config: <https://builds.apache.org/job/zookeeper-master-maven-jdk12/ws/zookeeper-client/zookeeper-client-c/../../build/test/test-cppunit/conf/2.conf>
     [exec] Starting zookeeper ... STARTED
     [exec] ZooKeeper JMX enabled by default
     [exec] Using config: <https://builds.apache.org/job/zookeeper-master-maven-jdk12/ws/zookeeper-client/zookeeper-client-c/../../build/test/test-cppunit/conf/0.conf>
     [exec] ZooKeeper JMX enabled by default
     [exec] Using config: <https://builds.apache.org/job/zookeeper-master-maven-jdk12/ws/zookeeper-client/zookeeper-client-c/../../build/test/test-cppunit/conf/0.conf>
     [exec] ZooKeeper JMX enabled by default
     [exec] Using config: <https://builds.apache.org/job/zookeeper-master-maven-jdk12/ws/zookeeper-client/zookeeper-client-c/../../build/test/test-cppunit/conf/1.conf>
     [exec] ZooKeeper JMX enabled by default
     [exec] Using config: <https://builds.apache.org/job/zookeeper-master-maven-jdk12/ws/zookeeper-client/zookeeper-client-c/../../build/test/test-cppunit/conf/2.conf>
     [exec] ZooKeeper JMX enabled by default
     [exec] Using config: <https://builds.apache.org/job/zookeeper-master-maven-jdk12/ws/zookeeper-client/zookeeper-client-c/../../build/test/test-cppunit/conf/0.conf>
     [exec] ZooKeeper JMX enabled by default
     [exec] Using config: <https://builds.apache.org/job/zookeeper-master-maven-jdk12/ws/zookeeper-client/zookeeper-client-c/../../build/test/test-cppunit/conf/1.conf>
     [exec] ZooKeeper JMX enabled by default
     [exec] Using config: <https://builds.apache.org/job/zookeeper-master-maven-jdk12/ws/zookeeper-client/zookeeper-client-c/../../build/test/test-cppunit/conf/2.conf>
     [exec] ZooKeeper JMX enabled by default
     [exec] Using config: <https://builds.apache.org/job/zookeeper-master-maven-jdk12/ws/zookeeper-client/zookeeper-client-c/../../build/test/test-cppunit/conf/0.conf>
     [exec] ZooKeeper JMX enabled by default
     [exec] Using config: <https://builds.apache.org/job/zookeeper-master-maven-jdk12/ws/zookeeper-client/zookeeper-client-c/../../build/test/test-cppunit/conf/1.conf>
     [exec] ZooKeeper JMX enabled by default
     [exec] Using config: <https://builds.apache.org/job/zookeeper-master-maven-jdk12/ws/zookeeper-client/zookeeper-client-c/../../build/test/test-cppunit/conf/0.conf>
     [exec] ZooKeeper JMX enabled by default
     [exec] Using config: <https://builds.apache.org/job/zookeeper-master-maven-jdk12/ws/zookeeper-client/zookeeper-client-c/../../build/test/test-cppunit/conf/1.conf>
     [exec] ZooKeeper JMX enabled by default
     [exec] Using config: <https://builds.apache.org/job/zookeeper-master-maven-jdk12/ws/zookeeper-client/zookeeper-client-c/../../build/test/test-cppunit/conf/2.conf>
     [exec] Stopping zookeeper ... STOPPED
     [exec] Stopping zookeeper ... STOPPED
     [exec] Stopping zookeeper ... STOPPED
     [exec] Client port found: 4000. Client address: localhost.
     [exec] Error contacting service. It is probably not running.
     [exec] 
     [exec] Client port found: 4000. Client address: localhost.
     [exec] Error contacting service. It is probably not running.
     [exec] 
     [exec]  : elapsed 29024 : OK
     [exec] Zookeeper_clientretry::testRetry ZooKeeper server started ZooKeeper server started
: elapsed 12898 : OK
     [exec] Zookeeper_operations::testAsyncWatcher1 : elapsed 83 : OK
     [exec] Zookeeper_operations::testAsyncGetOperation : elapsed 28 : OK
     [exec] Zookeeper_operations::testOperationsAndDisconnectConcurrently1 : elapsed 2218
: OK
     [exec] Zookeeper_operations::testOperationsAndDisconnectConcurrently2 : elapsed 0 : OK
     [exec] Zookeeper_operations::testConcurrentOperations1 : elapsed 19646 : OK
     [exec] Zookeeper_multi::testCreate : elapsed 1058 : OK
     [exec] Zookeeper_multi::testCreateDelete : elapsed 1043 : OK
     [exec] Zookeeper_multi::testInvalidVersion : elapsed 1028 : OK
     [exec] Zookeeper_multi::testNestedCreate : elapsed 1098 : OK
     [exec] Zookeeper_multi::testSetData : elapsed 6027 : OK
     [exec] Zookeeper_multi::testUpdateConflict : elapsed 1020 : OK
     [exec] Zookeeper_multi::testDeleteUpdateConflict : elapsed 1019 : OK
     [exec] Zookeeper_multi::testAsyncMulti : elapsed 2001 : OK
     [exec] Zookeeper_multi::testMultiFail : elapsed 1013 : OK
     [exec] Zookeeper_multi::testCheck : elapsed 1033 : OK
     [exec] Zookeeper_multi::testWatch : elapsed 2019 : OK
     [exec] Zookeeper_multi::testSequentialNodeCreateInAsyncMulti : elapsed 2000 : OK
     [exec] Zookeeper_multi::testBigAsyncMulti : elapsed 3003 : OK
     [exec] Zookeeper_watchers::testDefaultSessionWatcher1 : elapsed 52 : OK
     [exec] Zookeeper_watchers::testDefaultSessionWatcher2 : elapsed 9 : OK
     [exec] Zookeeper_watchers::testObjectSessionWatcher1 : elapsed 71 : OK
     [exec] Zookeeper_watchers::testObjectSessionWatcher2 : elapsed 65 : OK
     [exec] Zookeeper_watchers::testNodeWatcher1 : elapsed 72 : OK
     [exec] Zookeeper_watchers::testChildWatcher1 : elapsed 59 : OK
     [exec] Zookeeper_watchers::testChildWatcher2 : elapsed 108 : OK
     [exec] Zookeeper_simpleSystem::testLogCallbackSetLog Message Received: [2019-08-13 16:54:58,430:6083(0x7f5391552740):ZOO_INFO@testLogCallbackSet@1010:
testLogCallbackSet #0]
     [exec] Log Message Received: [2019-08-13 16:54:58,430:6083(0x7f5391552740):ZOO_INFO@testLogCallbackSet@1010:
testLogCallbackSet #1]
     [exec] Log Message Received: [2019-08-13 16:54:58,430:6083(0x7f5391552740):ZOO_INFO@testLogCallbackSet@1010:
testLogCallbackSet #2]
     [exec] Log Message Received: [2019-08-13 16:54:58,430:6083(0x7f5391552740):ZOO_INFO@testLogCallbackSet@1010:
testLogCallbackSet #3]
     [exec] Log Message Received: [2019-08-13 16:54:58,430:6083(0x7f5391552740):ZOO_INFO@testLogCallbackSet@1010:
testLogCallbackSet #4]
     [exec] Log Message Received: [2019-08-13 16:54:58,430:6083(0x7f5391552740):ZOO_INFO@testLogCallbackSet@1010:
testLogCallbackSet #5]
     [exec] Log Message Received: [2019-08-13 16:54:58,430:6083(0x7f5391552740):ZOO_INFO@testLogCallbackSet@1010:
testLogCallbackSet #6]
     [exec] Log Message Received: [2019-08-13 16:54:58,430:6083(0x7f5391552740):ZOO_INFO@testLogCallbackSet@1010:
testLogCallbackSet #7]
     [exec] Log Message Received: [2019-08-13 16:54:58,430:6083(0x7f5391552740):ZOO_INFO@testLogCallbackSet@1010:
testLogCallbackSet #8]
     [exec] Log Message Received: [2019-08-13 16:54:58,430:6083(0x7f5391552740):ZOO_INFO@testLogCallbackSet@1010:
testLogCallbackSet #9]
     [exec] Log Message Received: [2019-08-13 16:54:58,430:6083(0x7f5391552740):ZOO_INFO@zookeeper_close@3258:
Closing zookeeper sessionId=0x100f2357f44000e to 127.0.0.1:22181
     [exec] ]
     [exec]  : elapsed 1006 : OK
     [exec] Zookeeper_simpleSystem::testLogCallbackInitLog Message Received: [2019-08-13 16:54:58,430:6083(0x7f5391552740):ZOO_INFO@log_env@1101:
Client environment:zookeeper.version=zookeeper C client 3.6.0]
     [exec] Log Message Received: [2019-08-13 16:54:58,430:6083(0x7f5391552740):ZOO_INFO@log_env@1105:
Client environment:host.name=asf901.gq1.ygridcore.net]
     [exec] Log Message Received: [2019-08-13 16:54:58,430:6083(0x7f5391552740):ZOO_INFO@log_env@1112:
Client environment:os.name=Linux]
     [exec] Log Message Received: [2019-08-13 16:54:58,430:6083(0x7f5391552740):ZOO_INFO@log_env@1113:
Client environment:os.arch=4.15.0-52-generic]
     [exec] Log Message Received: [2019-08-13 16:54:58,430:6083(0x7f5391552740):ZOO_INFO@log_env@1114:
Client environment:os.version=#56-Ubuntu SMP Tue Jun 4 22:49:08 UTC 2019]
     [exec] Log Message Received: [2019-08-13 16:54:58,430:6083(0x7f5391552740):ZOO_INFO@log_env@1122:
Client environment:user.name=jenkins]
     [exec] Log Message Received: [2019-08-13 16:54:58,430:6083(0x7f5391552740):ZOO_INFO@log_env@1130:
Client environment:user.home=/home/jenkins]
     [exec] Log Message Received: [2019-08-13 16:54:58,430:6083(0x7f5391552740):ZOO_INFO@log_env@1142:
Client environment:user.dir=<https://builds.apache.org/job/zookeeper-master-maven-jdk12/ws/zookeeper-client/zookeeper-client-c/target/c]>
     [exec] Log Message Received: [2019-08-13 16:54:58,430:6083(0x7f5391552740):ZOO_INFO@zookeeper_init_internal@1188:
Initiating client connection, host=127.0.0.1:22181 sessionTimeout=10000 watcher=0x55c375be59b0
sessionId=0 sessionPasswd=<null> context=0x7ffd95df77b0 flags=0]
     [exec] Log Message Received: [2019-08-13 16:54:58,431:6083(0x7f538efaf700):ZOO_INFO@check_events@2475:
initiated connection to server 127.0.0.1:22181]
     [exec] Log Message Received: [2019-08-13 16:54:58,463:6083(0x7f538efaf700):ZOO_INFO@check_events@2527:
session establishment complete on server 127.0.0.1:22181, sessionId=0x100f2357f44000f, negotiated
timeout=10000 ]
     [exec] Log Message Received: [2019-08-13 16:54:59,431:6083(0x7f5391552740):ZOO_INFO@testLogCallbackInit@1032:
testLogCallbackInit #0]
     [exec] Log Message Received: [2019-08-13 16:54:59,431:6083(0x7f5391552740):ZOO_INFO@testLogCallbackInit@1032:
testLogCallbackInit #1]
     [exec] Log Message Received: [2019-08-13 16:54:59,431:6083(0x7f5391552740):ZOO_INFO@testLogCallbackInit@1032:
testLogCallbackInit #2]
     [exec] Log Message Received: [2019-08-13 16:54:59,431:6083(0x7f5391552740):ZOO_INFO@testLogCallbackInit@1032:
testLogCallbackInit #3]
     [exec] Log Message Received: [2019-08-13 16:54:59,431:6083(0x7f5391552740):ZOO_INFO@testLogCallbackInit@1032:
testLogCallbackInit #4]
     [exec] Log Message Received: [2019-08-13 16:54:59,431:6083(0x7f5391552740):ZOO_INFO@testLogCallbackInit@1032:
testLogCallbackInit #5]
     [exec] Log Message Received: [2019-08-13 16:54:59,431:6083(0x7f5391552740):ZOO_INFO@testLogCallbackInit@1032:
testLogCallbackInit #6]
     [exec] Log Message Received: [2019-08-13 16:54:59,431:6083(0x7f5391552740):ZOO_INFO@testLogCallbackInit@1032:
testLogCallbackInit #7]
     [exec] Log Message Received: [2019-08-13 16:54:59,431:6083(0x7f5391552740):ZOO_INFO@testLogCallbackInit@1032:
testLogCallbackInit #8]
     [exec] Log Message Received: [2019-08-13 16:54:59,431:6083(0x7f5391552740):ZOO_INFO@testLogCallbackInit@1032:
testLogCallbackInit #9]
     [exec] Log Message Received: [2019-08-13 16:54:59,431:6083(0x7f5391552740):ZOO_INFO@zookeeper_close@3258:
Closing zookeeper sessionId=0x100f2357f44000f to 127.0.0.1:22181
     [exec] ]
     [exec]  : elapsed 1000 : OK
     [exec] Zookeeper_simpleSystem::testLogCallbackClearLog Message Received: [2019-08-13
16:54:59,431:6083(0x7f5391552740):ZOO_INFO@log_env@1101: Client environment:zookeeper.version=zookeeper
C client 3.6.0]
     [exec] Log Message Received: [2019-08-13 16:54:59,431:6083(0x7f5391552740):ZOO_INFO@log_env@1105:
Client environment:host.name=asf901.gq1.ygridcore.net]
     [exec] Log Message Received: [2019-08-13 16:54:59,431:6083(0x7f5391552740):ZOO_INFO@log_env@1112:
Client environment:os.name=Linux]
     [exec] Log Message Received: [2019-08-13 16:54:59,431:6083(0x7f5391552740):ZOO_INFO@log_env@1113:
Client environment:os.arch=4.15.0-52-generic]
     [exec] Log Message Received: [2019-08-13 16:54:59,431:6083(0x7f5391552740):ZOO_INFO@log_env@1114:
Client environment:os.version=#56-Ubuntu SMP Tue Jun 4 22:49:08 UTC 2019]
     [exec] Log Message Received: [2019-08-13 16:54:59,431:6083(0x7f5391552740):ZOO_INFO@log_env@1122:
Client environment:user.name=jenkins]
     [exec] Log Message Received: [2019-08-13 16:54:59,431:6083(0x7f5391552740):ZOO_INFO@log_env@1130:
Client environment:user.home=/home/jenkins]
     [exec] Log Message Received: [2019-08-13 16:54:59,431:6083(0x7f5391552740):ZOO_INFO@log_env@1142:
Client environment:user.dir=<https://builds.apache.org/job/zookeeper-master-maven-jdk12/ws/zookeeper-client/zookeeper-client-c/target/c]>
     [exec] Log Message Received: [2019-08-13 16:54:59,431:6083(0x7f5391552740):ZOO_INFO@zookeeper_init_internal@1188:
Initiating client connection, host=127.0.0.1:22181 sessionTimeout=10000 watcher=0x55c375be59b0
sessionId=0 sessionPasswd=<null> context=0x7ffd95df77b0 flags=0]
     [exec] Log Message Received: [2019-08-13 16:54:59,432:6083(0x7f538e7ae700):ZOO_INFO@check_events@2475:
initiated connection to server 127.0.0.1:22181]
     [exec] Log Message Received: [2019-08-13 16:54:59,451:6083(0x7f538e7ae700):ZOO_INFO@check_events@2527:
session establishment complete on server 127.0.0.1:22181, sessionId=0x100f2357f440010, negotiated
timeout=10000 ]
     [exec]  : elapsed 1004 : OK
     [exec] Zookeeper_simpleSystem::testAsyncWatcherAutoReset ZooKeeper server started : elapsed
12362 : OK
     [exec] Zookeeper_simpleSystem::testDeserializeString : elapsed 0 : OK
     [exec] Zookeeper_simpleSystem::testFirstServerDown : elapsed 1001 : OK
     [exec] Zookeeper_simpleSystem::testNonexistentHost : elapsed 1047 : OK
     [exec] Zookeeper_simpleSystem::testNullData : elapsed 1041 : OK
     [exec] Zookeeper_simpleSystem::testIPV6 : elapsed 1012 : OK
     [exec] Zookeeper_simpleSystem::testCreate : elapsed 1017 : OK
     [exec] Zookeeper_simpleSystem::testCreateContainer : elapsed 1009 : OK
     [exec] Zookeeper_simpleSystem::testCreateTtl : elapsed 2011 : OK
     [exec] Zookeeper_simpleSystem::testPath : elapsed 1056 : OK
     [exec] Zookeeper_simpleSystem::testPathValidation : elapsed 1142 : OK
     [exec] Zookeeper_simpleSystem::testPing : elapsed 17692 : OK
     [exec] Zookeeper_simpleSystem::testAcl : elapsed 1024 : OK
     [exec] Zookeeper_simpleSystem::testChroot : elapsed 3101 : OK
     [exec] Zookeeper_simpleSystem::testAuth ZooKeeper server started ZooKeeper server started
: elapsed 33402 : OK
     [exec] Zookeeper_simpleSystem::testHangingClient : elapsed 1076 : OK
     [exec] Zookeeper_simpleSystem::testWatcherAutoResetWithGlobal ZooKeeper server started
ZooKeeper server started ZooKeeper server started : elapsed 22422 : OK
     [exec] Zookeeper_simpleSystem::testWatcherAutoResetWithLocal ZooKeeper server started
ZooKeeper server started ZooKeeper server started : elapsed 20801 : OK
     [exec] Zookeeper_simpleSystem::testGetChildren2 : elapsed 1177 : OK
     [exec] Zookeeper_simpleSystem::testLastZxid : elapsed 5534 : OK
     [exec] Zookeeper_simpleSystem::testRemoveWatchers ZooKeeper server started : elapsed
11552 : OK
     [exec] Zookeeper_readOnly::testReadOnly : assertion : elapsed 4212
     [exec] Zookeeper_logClientEnv::testLogClientEnv : elapsed 12 : OK
     [exec] Zookeeper_serverRequireClientSASL::testServerRequireClientSASL : elapsed 3449
: OK
     [exec] <https://builds.apache.org/job/zookeeper-master-maven-jdk12/ws/zookeeper-client/zookeeper-client-c/tests/TestReadOnlyClient.cc>:99:
Assertion: equality assertion failed [Expected: 0, Actual  : -4]
     [exec] Failures !!!
     [exec] Run: 80   Failure total: 1   Failures: 1   Errors: 0
     [exec] make[1]: *** [check-TESTS] Error 1
     [exec] FAIL: zktest-mt
     [exec] ==========================================
     [exec] 2 of 2 tests failed
     [exec] Please report to user@zookeeper.apache.org
     [exec] ==========================================
     [exec] Makefile:1817: recipe for target 'check-TESTS' failed
     [exec] make[1]: Leaving directory '<https://builds.apache.org/job/zookeeper-master-maven-jdk12/ws/zookeeper-client/zookeeper-client-c/target/c'>
     [exec] Makefile:2073: recipe for target 'check-am' failed
     [exec] make: *** [check-am] Error 2
[INFO] ------------------------------------------------------------------------
[INFO] Reactor Summary for Apache ZooKeeper 3.6.0-SNAPSHOT:
[INFO] 
[INFO] Apache ZooKeeper ................................... SUCCESS [ 23.438 s]
[INFO] Apache ZooKeeper - Documentation ................... SUCCESS [ 13.119 s]
[INFO] Apache ZooKeeper - Jute ............................ SUCCESS [02:07 min]
[INFO] Apache ZooKeeper - Server .......................... SUCCESS [24:15 min]
[INFO] Apache ZooKeeper - Metrics Providers ............... SUCCESS [  4.019 s]
[INFO] Apache ZooKeeper - Prometheus.io Metrics Provider .. SUCCESS [ 43.765 s]
[INFO] Apache ZooKeeper - Client .......................... SUCCESS [  3.491 s]
[INFO] Apache ZooKeeper - Client - C ...................... FAILURE [09:35 min]
[INFO] Apache ZooKeeper - Recipes ......................... SKIPPED
[INFO] Apache ZooKeeper - Recipes - Election .............. SKIPPED
[INFO] Apache ZooKeeper - Recipes - Lock .................. SKIPPED
[INFO] Apache ZooKeeper - Recipes - Queue ................. SKIPPED
[INFO] Apache ZooKeeper - Assembly ........................ SKIPPED
[INFO] Apache ZooKeeper - Contrib ......................... SKIPPED
[INFO] Apache ZooKeeper - Contrib - Loggraph .............. SKIPPED
[INFO] Apache ZooKeeper - Contrib - Rest .................. SKIPPED
[INFO] Apache ZooKeeper - Contrib - ZooInspector .......... SKIPPED
[INFO] ------------------------------------------------------------------------
[INFO] BUILD FAILURE
[INFO] ------------------------------------------------------------------------
[INFO] Total time:  38:20 min
[INFO] Finished at: 2019-08-13T16:57:47Z
[INFO] ------------------------------------------------------------------------
Waiting for Jenkins to finish collecting data
[ERROR] Failed to execute goal org.apache.maven.plugins:maven-antrun-plugin:1.8:run (test-cppunit)
on project zookeeper-client-c: An Ant BuildException has occured: exec returned: 2
[ERROR] around Ant part ...<exec failonerror="true" dir="<https://builds.apache.org/job/zookeeper-master-maven-jdk12/ws/zookeeper-client/zookeeper-client-c/target/c">
executable="make">... @ 4:164 in <https://builds.apache.org/job/zookeeper-master-maven-jdk12/ws/zookeeper-client/zookeeper-client-c/target/antrun/build-main.xml>
[ERROR] -> [Help 1]
[ERROR] 
[ERROR] To see the full stack trace of the errors, re-run Maven with the -e switch.
[ERROR] Re-run Maven using the -X switch to enable full debug logging.
[ERROR] 
[ERROR] For more information about the errors and possible solutions, please read the following
articles:
[ERROR] [Help 1] http://cwiki.apache.org/confluence/display/MAVEN/MojoExecutionException
[ERROR] 
[ERROR] After correcting the problems, you can resume the build with the command
[ERROR]   mvn <goals> -rf :zookeeper-client-c
[JENKINS] Archiving <https://builds.apache.org/job/zookeeper-master-maven-jdk12/ws/zookeeper-server/pom.xml>
to org.apache.zookeeper/zookeeper/3.6.0-SNAPSHOT/zookeeper-3.6.0-SNAPSHOT.pom
[JENKINS] Archiving <https://builds.apache.org/job/zookeeper-master-maven-jdk12/ws/zookeeper-server/target/zookeeper-3.6.0-SNAPSHOT.jar>
to org.apache.zookeeper/zookeeper/3.6.0-SNAPSHOT/zookeeper-3.6.0-SNAPSHOT.jar
[JENKINS] Archiving <https://builds.apache.org/job/zookeeper-master-maven-jdk12/ws/zookeeper-server/target/zookeeper-3.6.0-SNAPSHOT-tests.jar>
to org.apache.zookeeper/zookeeper/3.6.0-SNAPSHOT/zookeeper-3.6.0-SNAPSHOT-tests.jar
[JENKINS] Archiving <https://builds.apache.org/job/zookeeper-master-maven-jdk12/ws/zookeeper-server/target/zookeeper-3.6.0-SNAPSHOT-sources.jar>
to org.apache.zookeeper/zookeeper/3.6.0-SNAPSHOT/zookeeper-3.6.0-SNAPSHOT-sources.jar
[JENKINS] Archiving <https://builds.apache.org/job/zookeeper-master-maven-jdk12/ws/zookeeper-server/target/zookeeper-3.6.0-SNAPSHOT-javadoc.jar>
to org.apache.zookeeper/zookeeper/3.6.0-SNAPSHOT/zookeeper-3.6.0-SNAPSHOT-javadoc.jar
[JENKINS] Archiving <https://builds.apache.org/job/zookeeper-master-maven-jdk12/ws/zookeeper-contrib/zookeeper-contrib-loggraph/pom.xml>
to org.apache.zookeeper/zookeeper-contrib-loggraph/3.6.0-SNAPSHOT/zookeeper-contrib-loggraph-3.6.0-SNAPSHOT.pom
[JENKINS] Archiving <https://builds.apache.org/job/zookeeper-master-maven-jdk12/ws/zookeeper-metrics-providers/pom.xml>
to org.apache.zookeeper/zookeeper-metrics-providers/3.6.0-SNAPSHOT/zookeeper-metrics-providers-3.6.0-SNAPSHOT.pom
[JENKINS] Archiving <https://builds.apache.org/job/zookeeper-master-maven-jdk12/ws/zookeeper-metrics-providers/zookeeper-prometheus-metrics/pom.xml>
to org.apache.zookeeper/zookeeper-prometheus-metrics/3.6.0-SNAPSHOT/zookeeper-prometheus-metrics-3.6.0-SNAPSHOT.pom
[JENKINS] Archiving <https://builds.apache.org/job/zookeeper-master-maven-jdk12/ws/zookeeper-metrics-providers/zookeeper-prometheus-metrics/target/zookeeper-prometheus-metrics-3.6.0-SNAPSHOT.jar>
to org.apache.zookeeper/zookeeper-prometheus-metrics/3.6.0-SNAPSHOT/zookeeper-prometheus-metrics-3.6.0-SNAPSHOT.jar
[JENKINS] Archiving <https://builds.apache.org/job/zookeeper-master-maven-jdk12/ws/zookeeper-metrics-providers/zookeeper-prometheus-metrics/target/zookeeper-prometheus-metrics-3.6.0-SNAPSHOT-tests.jar>
to org.apache.zookeeper/zookeeper-prometheus-metrics/3.6.0-SNAPSHOT/zookeeper-prometheus-metrics-3.6.0-SNAPSHOT-tests.jar
[JENKINS] Archiving <https://builds.apache.org/job/zookeeper-master-maven-jdk12/ws/zookeeper-metrics-providers/zookeeper-prometheus-metrics/target/zookeeper-prometheus-metrics-3.6.0-SNAPSHOT-sources.jar>
to org.apache.zookeeper/zookeeper-prometheus-metrics/3.6.0-SNAPSHOT/zookeeper-prometheus-metrics-3.6.0-SNAPSHOT-sources.jar
[JENKINS] Archiving <https://builds.apache.org/job/zookeeper-master-maven-jdk12/ws/zookeeper-metrics-providers/zookeeper-prometheus-metrics/target/zookeeper-prometheus-metrics-3.6.0-SNAPSHOT-javadoc.jar>
to org.apache.zookeeper/zookeeper-prometheus-metrics/3.6.0-SNAPSHOT/zookeeper-prometheus-metrics-3.6.0-SNAPSHOT-javadoc.jar
[Fast Archiver] Compressed 444.35 KB of artifacts by 36.0% relative to #91
[JENKINS] Archiving <https://builds.apache.org/job/zookeeper-master-maven-jdk12/ws/zookeeper-recipes/zookeeper-recipes-election/pom.xml>
to org.apache.zookeeper/zookeeper-recipes-election/3.6.0-SNAPSHOT/zookeeper-recipes-election-3.6.0-SNAPSHOT.pom
[JENKINS] Archiving <https://builds.apache.org/job/zookeeper-master-maven-jdk12/ws/pom.xml>
to org.apache.zookeeper/parent/3.6.0-SNAPSHOT/parent-3.6.0-SNAPSHOT.pom
[JENKINS] Archiving <https://builds.apache.org/job/zookeeper-master-maven-jdk12/ws/zookeeper-recipes/zookeeper-recipes-lock/pom.xml>
to org.apache.zookeeper/zookeeper-recipes-lock/3.6.0-SNAPSHOT/zookeeper-recipes-lock-3.6.0-SNAPSHOT.pom
[JENKINS] Archiving <https://builds.apache.org/job/zookeeper-master-maven-jdk12/ws/zookeeper-contrib/pom.xml>
to org.apache.zookeeper/zookeeper-contrib/3.6.0-SNAPSHOT/zookeeper-contrib-3.6.0-SNAPSHOT.pom
[JENKINS] Archiving <https://builds.apache.org/job/zookeeper-master-maven-jdk12/ws/zookeeper-client/pom.xml>
to org.apache.zookeeper/zookeeper-client/3.6.0-SNAPSHOT/zookeeper-client-3.6.0-SNAPSHOT.pom
[JENKINS] Archiving <https://builds.apache.org/job/zookeeper-master-maven-jdk12/ws/zookeeper-jute/pom.xml>
to org.apache.zookeeper/zookeeper-jute/3.6.0-SNAPSHOT/zookeeper-jute-3.6.0-SNAPSHOT.pom
[JENKINS] Archiving <https://builds.apache.org/job/zookeeper-master-maven-jdk12/ws/zookeeper-jute/target/zookeeper-jute-3.6.0-SNAPSHOT.jar>
to org.apache.zookeeper/zookeeper-jute/3.6.0-SNAPSHOT/zookeeper-jute-3.6.0-SNAPSHOT.jar
[JENKINS] Archiving <https://builds.apache.org/job/zookeeper-master-maven-jdk12/ws/zookeeper-jute/target/zookeeper-jute-3.6.0-SNAPSHOT-tests.jar>
to org.apache.zookeeper/zookeeper-jute/3.6.0-SNAPSHOT/zookeeper-jute-3.6.0-SNAPSHOT-tests.jar
[JENKINS] Archiving <https://builds.apache.org/job/zookeeper-master-maven-jdk12/ws/zookeeper-jute/target/zookeeper-jute-3.6.0-SNAPSHOT-sources.jar>
to org.apache.zookeeper/zookeeper-jute/3.6.0-SNAPSHOT/zookeeper-jute-3.6.0-SNAPSHOT-sources.jar
[JENKINS] Archiving <https://builds.apache.org/job/zookeeper-master-maven-jdk12/ws/zookeeper-jute/target/zookeeper-jute-3.6.0-SNAPSHOT-javadoc.jar>
to org.apache.zookeeper/zookeeper-jute/3.6.0-SNAPSHOT/zookeeper-jute-3.6.0-SNAPSHOT-javadoc.jar
[Fast Archiver] Compressed 1.39 MB of artifacts by 13.5% relative to #91
[JENKINS] Archiving <https://builds.apache.org/job/zookeeper-master-maven-jdk12/ws/zookeeper-recipes/zookeeper-recipes-queue/pom.xml>
to org.apache.zookeeper/zookeeper-recipes-queue/3.6.0-SNAPSHOT/zookeeper-recipes-queue-3.6.0-SNAPSHOT.pom
[JENKINS] Archiving <https://builds.apache.org/job/zookeeper-master-maven-jdk12/ws/zookeeper-docs/pom.xml>
to org.apache.zookeeper/zookeeper-docs/3.6.0-SNAPSHOT/zookeeper-docs-3.6.0-SNAPSHOT.pom
[JENKINS] Archiving <https://builds.apache.org/job/zookeeper-master-maven-jdk12/ws/zookeeper-docs/target/zookeeper-docs-3.6.0-SNAPSHOT.jar>
to org.apache.zookeeper/zookeeper-docs/3.6.0-SNAPSHOT/zookeeper-docs-3.6.0-SNAPSHOT.jar
[JENKINS] Archiving <https://builds.apache.org/job/zookeeper-master-maven-jdk12/ws/zookeeper-docs/target/zookeeper-docs-3.6.0-SNAPSHOT-tests.jar>
to org.apache.zookeeper/zookeeper-docs/3.6.0-SNAPSHOT/zookeeper-docs-3.6.0-SNAPSHOT-tests.jar
[JENKINS] Archiving <https://builds.apache.org/job/zookeeper-master-maven-jdk12/ws/zookeeper-docs/target/zookeeper-docs-3.6.0-SNAPSHOT-sources.jar>
to org.apache.zookeeper/zookeeper-docs/3.6.0-SNAPSHOT/zookeeper-docs-3.6.0-SNAPSHOT-sources.jar
[JENKINS] Archiving <https://builds.apache.org/job/zookeeper-master-maven-jdk12/ws/zookeeper-recipes/pom.xml>
to org.apache.zookeeper/zookeeper-recipes/3.6.0-SNAPSHOT/zookeeper-recipes-3.6.0-SNAPSHOT.pom
[JENKINS] Archiving <https://builds.apache.org/job/zookeeper-master-maven-jdk12/ws/zookeeper-client/zookeeper-client-c/pom.xml>
to org.apache.zookeeper/zookeeper-client-c/3.6.0-SNAPSHOT/zookeeper-client-c-3.6.0-SNAPSHOT.pom
[JENKINS] Archiving <https://builds.apache.org/job/zookeeper-master-maven-jdk12/ws/zookeeper-contrib/zookeeper-contrib-rest/pom.xml>
to org.apache.zookeeper/zookeeper-contrib-rest/3.6.0-SNAPSHOT/zookeeper-contrib-rest-3.6.0-SNAPSHOT.pom
[JENKINS] Archiving <https://builds.apache.org/job/zookeeper-master-maven-jdk12/ws/zookeeper-assembly/pom.xml>
to org.apache.zookeeper/zookeeper-assembly/3.6.0-SNAPSHOT/zookeeper-assembly-3.6.0-SNAPSHOT.pom
[JENKINS] Archiving <https://builds.apache.org/job/zookeeper-master-maven-jdk12/ws/zookeeper-contrib/zookeeper-contrib-zooinspector/pom.xml>
to org.apache.zookeeper/zookeeper-contrib-zooinspector/3.6.0-SNAPSHOT/zookeeper-contrib-zooinspector-3.6.0-SNAPSHOT.pom
channel stopped
[SpotBugs] Skipping execution of recorder since overall result is 'FAILURE'

Mime
View raw message