zookeeper-dev mailing list archives

Site index · List index
Message view « Date » · « Thread »
Top « Date » · « Thread »
From Apache Jenkins Server <jenk...@builds.apache.org>
Subject ZooKeeper_branch35_jdk8 - Build # 1496 - Failure
Date Mon, 05 Aug 2019 19:57:07 GMT
See https://builds.apache.org/job/ZooKeeper_branch35_jdk8/1496/

###################################################################################
########################## LAST 60 LINES OF THE CONSOLE ###########################
[...truncated 67.37 KB...]
    [junit] Tests run: 1, Failures: 0, Errors: 0, Skipped: 0, Time elapsed: 1.248 sec, Thread:
1, Class: org.apache.zookeeper.test.SaslSuperUserTest
    [junit] Running org.apache.zookeeper.test.ServerCnxnTest in thread 1
    [junit] Tests run: 1, Failures: 0, Errors: 0, Skipped: 0, Time elapsed: 3.505 sec, Thread:
1, Class: org.apache.zookeeper.test.ServerCnxnTest
    [junit] Running org.apache.zookeeper.test.SessionInvalidationTest in thread 1
    [junit] Tests run: 1, Failures: 0, Errors: 0, Skipped: 0, Time elapsed: 1.749 sec, Thread:
1, Class: org.apache.zookeeper.test.SessionInvalidationTest
    [junit] Running org.apache.zookeeper.test.SessionTest in thread 1
    [junit] Tests run: 5, Failures: 0, Errors: 0, Skipped: 0, Time elapsed: 13.797 sec, Thread:
1, Class: org.apache.zookeeper.test.SessionTest
    [junit] Running org.apache.zookeeper.test.SessionTimeoutTest in thread 1
    [junit] Tests run: 4, Failures: 0, Errors: 0, Skipped: 0, Time elapsed: 2.485 sec, Thread:
1, Class: org.apache.zookeeper.test.SessionTimeoutTest
    [junit] Running org.apache.zookeeper.test.SessionTrackerCheckTest in thread 1
    [junit] Tests run: 2, Failures: 0, Errors: 0, Skipped: 0, Time elapsed: 0.228 sec, Thread:
1, Class: org.apache.zookeeper.test.SessionTrackerCheckTest
    [junit] Running org.apache.zookeeper.test.SessionUpgradeTest in thread 1
    [junit] Tests run: 4, Failures: 0, Errors: 0, Skipped: 0, Time elapsed: 23.624 sec, Thread:
1, Class: org.apache.zookeeper.test.SessionUpgradeTest
    [junit] Running org.apache.zookeeper.test.StandaloneTest in thread 1
    [junit] Tests run: 4, Failures: 0, Errors: 0, Skipped: 0, Time elapsed: 3.175 sec, Thread:
1, Class: org.apache.zookeeper.test.StandaloneTest
    [junit] Running org.apache.zookeeper.test.StatTest in thread 1
    [junit] Tests run: 4, Failures: 0, Errors: 0, Skipped: 0, Time elapsed: 2.748 sec, Thread:
1, Class: org.apache.zookeeper.test.StatTest
    [junit] Running org.apache.zookeeper.test.StaticHostProviderTest in thread 1
    [junit] Tests run: 26, Failures: 0, Errors: 0, Skipped: 0, Time elapsed: 3.355 sec, Thread:
1, Class: org.apache.zookeeper.test.StaticHostProviderTest
    [junit] Running org.apache.zookeeper.test.StringUtilTest in thread 1
    [junit] Tests run: 1, Failures: 0, Errors: 0, Skipped: 0, Time elapsed: 0.095 sec, Thread:
1, Class: org.apache.zookeeper.test.StringUtilTest
    [junit] Tests run: 1, Failures: 0, Errors: 0, Skipped: 0, Time elapsed: 113.649 sec, Thread:
4, Class: org.apache.zookeeper.test.RecoveryTest
    [junit] Running org.apache.zookeeper.test.TruncateTest in thread 4
    [junit] Running org.apache.zookeeper.test.SyncCallTest in thread 1
    [junit] Tests run: 1, Failures: 0, Errors: 0, Skipped: 0, Time elapsed: 1.249 sec, Thread:
1, Class: org.apache.zookeeper.test.SyncCallTest
    [junit] Running org.apache.zookeeper.test.WatchEventWhenAutoResetTest in thread 1
    [junit] Tests run: 1, Failures: 0, Errors: 0, Skipped: 0, Time elapsed: 103.596 sec, Thread:
3, Class: org.apache.zookeeper.test.RestoreCommittedLogTest
    [junit] Running org.apache.zookeeper.test.WatchedEventTest in thread 3
    [junit] Tests run: 4, Failures: 0, Errors: 0, Skipped: 0, Time elapsed: 0.544 sec, Thread:
3, Class: org.apache.zookeeper.test.WatchedEventTest
    [junit] Running org.apache.zookeeper.test.WatcherFuncTest in thread 3
    [junit] Tests run: 3, Failures: 0, Errors: 0, Skipped: 0, Time elapsed: 19.004 sec, Thread:
4, Class: org.apache.zookeeper.test.TruncateTest
    [junit] Tests run: 6, Failures: 0, Errors: 0, Skipped: 0, Time elapsed: 5.523 sec, Thread:
3, Class: org.apache.zookeeper.test.WatcherFuncTest
    [junit] Running org.apache.zookeeper.test.WatcherTest in thread 4
    [junit] Running org.apache.zookeeper.test.X509AuthTest in thread 3
    [junit] Tests run: 3, Failures: 0, Errors: 0, Skipped: 0, Time elapsed: 0.156 sec, Thread:
3, Class: org.apache.zookeeper.test.X509AuthTest
    [junit] Running org.apache.zookeeper.test.ZkDatabaseCorruptionTest in thread 3
    [junit] Tests run: 4, Failures: 0, Errors: 0, Skipped: 0, Time elapsed: 28.509 sec, Thread:
1, Class: org.apache.zookeeper.test.WatchEventWhenAutoResetTest
    [junit] Running org.apache.zookeeper.test.ZooKeeperQuotaTest in thread 1
    [junit] Tests run: 1, Failures: 0, Errors: 0, Skipped: 0, Time elapsed: 1.605 sec, Thread:
1, Class: org.apache.zookeeper.test.ZooKeeperQuotaTest
    [junit] Running org.apache.zookeeper.util.PemReaderTest in thread 1
    [junit] Tests run: 2, Failures: 0, Errors: 0, Skipped: 0, Time elapsed: 15.58 sec, Thread:
3, Class: org.apache.zookeeper.test.ZkDatabaseCorruptionTest
    [junit] Running org.apache.jute.BinaryInputArchiveTest in thread 3
    [junit] Tests run: 1, Failures: 0, Errors: 0, Skipped: 0, Time elapsed: 0.246 sec, Thread:
3, Class: org.apache.jute.BinaryInputArchiveTest
    [junit] Tests run: 64, Failures: 0, Errors: 0, Skipped: 0, Time elapsed: 5.731 sec, Thread:
1, Class: org.apache.zookeeper.util.PemReaderTest
    [junit] Tests run: 8, Failures: 0, Errors: 0, Skipped: 0, Time elapsed: 35.422 sec, Thread:
4, Class: org.apache.zookeeper.test.WatcherTest
    [junit] Tests run: 13, Failures: 0, Errors: 0, Skipped: 0, Time elapsed: 280.631 sec,
Thread: 2, Class: org.apache.zookeeper.test.ReconfigTest

fail.build.on.test.failure:

BUILD FAILED
/home/jenkins/jenkins-slave/workspace/ZooKeeper_branch35_jdk8/build.xml:1333: The following
error occurred while executing this line:
/home/jenkins/jenkins-slave/workspace/ZooKeeper_branch35_jdk8/build.xml:1337: Tests failed!

Total time: 30 minutes 7 seconds
Build step 'Invoke Ant' marked build as failure
Archiving artifacts
Recording test results
Email was triggered for: Failure - Any
Sending email for trigger: Failure - Any



###################################################################################
############################## FAILED TESTS (if any) ##############################
1 tests failed.
FAILED:  org.apache.zookeeper.test.DisconnectedWatcherTest.testManyChildWatchersAutoReset

Error Message:
test timed out after 840000 milliseconds

Stack Trace:
org.junit.runners.model.TestTimedOutException: test timed out after 840000 milliseconds
	at java.lang.Object.wait(Native Method)
	at java.lang.Object.wait(Object.java:502)
	at org.apache.zookeeper.ClientCnxn.submitRequest(ClientCnxn.java:1529)
	at org.apache.zookeeper.ClientCnxn.submitRequest(ClientCnxn.java:1512)
	at org.apache.zookeeper.ZooKeeper.create(ZooKeeper.java:1536)
	at org.apache.zookeeper.test.DisconnectedWatcherTest.testManyChildWatchersAutoReset(DisconnectedWatcherTest.java:247)
	at org.apache.zookeeper.JUnit4ZKTestRunner$LoggedInvokeMethod.evaluate(JUnit4ZKTestRunner.java:80)
	at java.util.concurrent.FutureTask.run(FutureTask.java:266)
	at java.lang.Thread.run(Thread.java:748)
Mime
  • Unnamed multipart/mixed (inline, None, 0 bytes)
View raw message